{"text_format":"1","workbook":"xlsx","n_sheets":38,"sheets":["Introduction","Read Me","TOC","Definitions","Control Sheet","CompletionTracker","Stationary-Entry","StatTemplateReadMe","Stationary-Data","Stationary-Calcs","ElecTemplateReadMe","Mobile-Entry","MobTemplateReadMe","Mobile-Data","Mobile-Detail Calcs","Mobile-Summary","Solid Waste-Control","Solid Waste-Entry","Wastewater-Control","Wastewater-Entry","Wastewater- Calcs","Electricity-Entry","Electricity-Data","Electricity LocationBased-Calcs","Employee Commute","Electricity MarketBased-Calcs","Water","Agriculture & Land Management","Urban Forestry","Waste Production","Additional Emission Sources","Summary-Emissions","Factors","Background Controls","Help","Commercial End Use Study","Detail Type Data","Notes"],"not_rendered":{"charts":27,"images":34,"macros":1,"external_links":0,"defined_names":341,"comments":1,"pivot_tables":0},"unopened":[],"bounds":{"document_bytes":16777216,"sheet_cells":100000,"rows_first":2000,"rows_last":500,"rows_between":2000,"halvings":0,"cell_chars":16384,"cell_head_chars":4096},"cells_cut":0,"cells_raw":0,"read":"whole","date_system":"1900"}

{"sheet":"Introduction","index":0,"n_rows":36,"n_cols":1,"rows_kept":36,"cut":false,"hidden":false,"merged":[[35,0,35,12]]}
["Introduction"]
[]
[]
[]
[]
[]
[]
[]
[]
[]
[]
[]
[]
[]
[]
[]
[]
[]
[]
[]
[]
[]
[]
[]
[]
[]
[]
[]
[]
[]
[]
[]
[]
[]
[]
["Local GHG Inventory Tool: Community Module"]

{"sheet":"Read Me","index":1,"n_rows":69,"n_cols":1,"rows_kept":69,"cut":false,"hidden":false,"merged":[[68,0,68,19]]}
["Read Me"]
[]
[]
[]
[]
[]
[]
[]
[]
[]
[]
[]
[]
[]
[]
[]
[]
[]
[]
[]
[]
[]
[]
[]
[]
[]
[]
[]
[]
[]
[]
[]
[]
[]
[]
[]
[]
[]
[]
[]
[]
[]
[]
[]
[]
[]
[]
[]
[]
[]
[]
[]
[]
[]
[]
[]
[]
[]
[]
[]
[]
[]
[]
[]
[]
[]
[]
[]
["Local GHG Inventory Tool: Community Module"]

{"sheet":"TOC","index":2,"n_rows":42,"n_cols":1,"rows_kept":42,"cut":false,"hidden":false,"merged":[[41,0,41,21]]}
["Table of Contents"]
[]
[]
[]
[]
[]
[]
[]
[]
[]
[]
[]
[]
[]
[]
[]
[]
[]
[]
[]
[]
[]
[]
[]
[]
[]
[]
[]
[]
[]
[]
[]
[]
[]
[]
[]
[]
[]
[]
[]
[]
["Local GHG Inventory Tool: Community Module"]

{"sheet":"Definitions","index":3,"n_rows":52,"n_cols":3,"rows_kept":52,"cut":false,"hidden":false,"merged":[[51,0,51,8]]}
["Definitions"]
[]
[null,"Please refer to this list for an explanation of any terms you may find within this tool."]
[]
[null,"Term","Definition"]
[null,"Base Year","A measurement, calculation, or time used as a basis for comparison. According to LGOP, it is good practice to aim for a base year that is likely to be representative of the general level of emissions over the surrounding period."]
[null,"BAU","Business As Usual. Used to refer to a future scenario in which there are no changes to the status quo."]
[null,"Biogenic","Biogenic emissions or fuels are produced by the biological processes of living organisms. Note that this term refers only to recently produced (i.e., non-fossil) material of biological origin"]
[null,"BOD5","Biological Oxygen Demand. The amount of oxygen consumed in five days by decomposing waste, used to measure the amount of waste input or output into a system."]
[null,"CO2","Carbon dioxide"]
[null,"CO2e","Carbon dioxide equivalent emissions. This is determined by multiplying the emissions of methane and nitrous oxide by their Global Warming Potential."]
[null,"CH4","Methane. Methane is a greenhouse gas with a GWP that is 25 times that of CO2.  It is produced through anaerobic decomposition of waste, enteric fermentation, production of natural gas and petroleum products, and other industrial processes."]
[null,"Contractual Instrument","Any type of contract between two parties for the sale and purchase of energy bundled with attributes about the energy generation, or for unbundled attribute claims. They can include energy attribute certificates (RECs, GOs, etc.), direct contracts, and residual grid mix emission rates."]
[null,"Denitrification","The process by which microorganisms remove nitrogen from its fixed form in the soil and release it into the atmosphere in the form of nitrous oxide (N2O)"]
[null,"Direct Emissions","The emissions generated on-site (as opposed to electricity delivered through a grid system), such as from the combustion of fossil fuels"]
[null,"EF","Emission Factor. The value for scaling emissions to activity data in terms of a standard rate of emissions per unit of activity (e.g., grams of carbon dioxide emitted per barrel of fossil fuel consumed)."]
[null,"Effluent","The treated or untreated wastewater that flows out of a source"]
[null,"Energy Attribute Certificate","A category of contractual instrument that represents certain information (or attributes) about the energy generated, but does not represent the energy itself. This category includes a variety of instruments with different names, including certificates, tags, credits, or generator declarations."]
[null,"EPA","United States Environmental Protection Agency"]
[null,"Fossil Fuel","Any fuel derived from the pre-historic burial of organic matter.  Examples include natural gas (methane or CH4) and petroleum products (gasoline, diesel, kerosene, propane, and others).  Combustion of petroleum products releases greenhouse gases into the atmosphere."]
[null,"Fugitive Emissions","Emissions of gases that escape from pressurized equipment, such as fuel transportation pipelines or wastewater treatment plants."]
[null,"G.G.E.","Gallon of gasoline equivalent"]
[null,"GHG","greenhouse gas"]
[null,"GPC","Global Protocol for Community-Scale GHG Emissions"]
[null,"GWP","Global Warming Potential. Conversion factor used to compare all greenhouse gas emissions to carbon dioxide equivalent units. The GWP represents the combined effect of the differing times these gases remain in the atmosphere and their relative effectiveness in absorbing outgoing thermal infrared radiation."]
[null,"Indirect Emissions","Refers  to indirect emissions associated with the consumption of purchased or acquired electricity, steam, heating, or cooling. These emissions can be allocated in an inventory to an entity, but are generated offsite.  An example is electricity that is not generated directly at a facility. A facility uses electricity on-site, but the fuels used to generate the electricity are combusted off-site, perhaps at a regional power plant. If the generation source is at a different site that is also operated by the community, it is not an indirect emission source."]
[null,"kg","kilograms"]
[null,"kWh","kilowatt-hour"]
[null,"LEED","Leadership in Energy and Environmental Design "]
[null,"LFG","landfill gas"]
[null,"LGOP","Local Government Operations Protocol"]
[null,"Location-based method","Reflects the average emissions intensity of grids on which energy consumption occurs (using exclusively grid-average emission factor data)."]
[null,"Market-based method","Reflects emissions from electricity based on where communities have specifically chosen to procure power (e.g., Renewable Energy Credits (RECs)), using utility-specific emission factors to estimate emissions from grid electricity purchases, where applicable, and accounting for other contractual instruments."]
[null,"mcf","thousand cubic feet of natural gas"]
[null,"MG","million gallons"]
[null,"MMBtu","million British Thermal Units, a measure of energy"]
[null,"Mobile Combustion","The combustion of fuels to power a moving vehicle, such as gasoline or diesel fuel in a car or truck"]
[null,"MT CO2e","Metric tons of carbon dioxide equivalent. This is the standard unit for measuring greenhouse gas emissions."]
[null,"N2O","nitrous oxide"]
[null,"Nitrification","Biological process in which ammonia is converted to nitrate (NO3)."]
[null,"Operational Control","A Local government has operational control over an operation if it has the full authority to introduce and implement its operating procedures"]
[null,"RPS","Renewable Portfolio Standard"]
[null,"Scope 1 Emissions","All direct GHG emissions"]
[null,"Scope 2 Emissions","Indirect GHG emissions from the consumption of purchased electricity, heat, or steam."]
[null,"Scope 3 Emissions","Other indirect emissions, such as the extraction and production of purchased materials and fuels, transport-related activities in vehicles not owned or controlled by the reporting entity, outsourced activities, etc. The Scope 3 emissions included in this inventory are  imported water consumption,  waste generation, urban forestry, and agriculture & land management."]
[null,"Short Tons","American ton, equal to 2,000 lbs. One short ton = 0.907 metric tons"]
[null,"Stationary Combustion","The on-site combustion of fuels to produce electricity, heat, or motive power using equipment in a fixed location"]
[]
[]
[]
[]
["Local GHG Inventory Tool: Community Module"]

{"sheet":"Control Sheet","index":4,"n_rows":92,"n_cols":8,"rows_kept":92,"cut":false,"hidden":false,"merged":[[41,4,41,6],[39,1,39,12],[91,0,91,13],[43,1,43,2],[37,0,37,7],[38,1,38,7]]}
["Inventory Control Sheet"]
["Complete the 4 steps below to set up the tool for your community."]
["1) Please enter the name of your city, the inventory year, and population below."]
[]
[null,"City",null,"Commonwealth of the Northern Mariana Islands"]
[null,"Year",null,2022]
[null,"Population",null,47329]
["2) The sectors included in the community inventory are defined below. These are the main sectors defined in the Global Protocol "]
["for Community-Scale GHG Emissions and the main sectors used to categorize GHG emissions. These sectors will be used to standardize"]
[null,"The maximum number of sectors is 20. The minimum is 1."]
[]
[null,null,null,4]
["data entry for calculations throughout the tool."]
[]
[]
["Dstart",null,1,"Residential"]
[null,null,2,"Commercial/Institutional"]
[null,null,3,"Industrial"]
[null,null,4,"Energy Generation"]
[null,null,5]
[null,null,6]
[null,null,7]
[null,null,8]
[null,null,9]
[null,null,10]
[null,null,11]
[null,null,12]
[null,null,13]
[null,null,14]
[null,null,15]
[null,null,16]
[null,null,17]
[null,null,18]
[null,null,19]
[null,null,20]
[]
[]
["3) Select the eGRID subregion where your community is located and enter utility-specific emissions factors, if available, for the utilities that provide electric service for your community."]
[null,"These utility selections and emission factors will be used to help calculate your emissions throughout the tool.\nThe eGRID subregion emission factors will be used to estimate location-based emissions. Utility-specific emissions factors will be used to estimate market-based emissions."]
[null,"Please see the map below the table to identify the eGRID subregion that includes your community and continue to Step 4 below"]
[null,"once this table is complete. For help determining your eGRID subregion, visit EPA's website by clicking the map below."]
[null,null,null,null,"Emission Factors (lb/MWh)",null,null,"Total EF "]
[null,null,null,"eGRID Subregion","CO2","CH4","N2O","lb CO2e/MWh"]
[null,"Select your subregion:",null,"AKGD eGRID subregion",{"$f":"IFERROR(VLOOKUP(D44, elec_factors_CO2, elec_colindex_MyYear+1, FALSE),\"\")","v":1067.68},{"$f":"IFERROR(VLOOKUP(D44, elec_factors_CH4, elec_colindex_MyYear+1, FALSE),\"\")","v":9.0999999999999998E-2},{"$f":"IFERROR(VLOOKUP(D44, elec_factors_N2O, elec_colindex_MyYear+1, FALSE),\"\")","v":1.2E-2},{"$f":"IFERROR(E44*CO2_CO2e+F44*CH4_CO2e+G44*N2O_CO2e,\"\")","v":1073.4080000000001}]
[null,null,null,"Utility Name"]
[null,true,null,null,null,null,null,{"$f":"E46*CO2_CO2e+F46*CH4_CO2e+G46*N2O_CO2e","v":0}]
[null,false,null,null,null,null,null,{"$f":"E47*CO2_CO2e+F47*CH4_CO2e+G47*N2O_CO2e","v":0}]
[null,false,null,null,null,null,null,{"$f":"E48*CO2_CO2e+F48*CH4_CO2e+G48*N2O_CO2e","v":0}]
[null,false,null,null,null,null,null,{"$f":"E49*CO2_CO2e+F49*CH4_CO2e+G49*N2O_CO2e","v":0}]
[null,false,null,null,null,null,null,{"$f":"E50*CO2_CO2e+F50*CH4_CO2e+G50*N2O_CO2e","v":0}]
[]
[]
[]
[]
[]
[]
[]
[]
[]
[]
[]
[]
[]
[]
[]
[]
[]
[]
[]
[]
[]
[]
[]
[]
[]
[]
[]
[]
[]
[]
[]
["4) Finally, please click on the \"Set Up\" button below."]
[null,"This will set up each sheet based on your entries above. You can always come back and change an emission factor."]
[null,"However, please do not edit or delete sector names."]
[]
[]
[]
[null,"Following revised reporting requirements under the UNFCCC, this tool presents CO2 equivalent values for CO2, CH4, and N2O based on the IPCC Fifth Assessment "]
[null,"Report (AR5) GWP values. If you would like to use different GWP values for this inventory (e.g., IPCC AR4), please use the button to the right to navigate to the "]
[null,"Factors sheet where alternative values can be entered before clicking \"Set Up\" above."]
[]
["Local GHG Inventory Tool: Community Module"]

{"sheet":"CompletionTracker","index":5,"n_rows":24,"n_cols":2,"rows_kept":24,"cut":false,"hidden":true,"merged":[]}
["CompletionTracker"]
[]
[]
["Control Sheet",false]
["Stationary-Entry",false]
["Stationary-Data",false]
["Electricity-Entry",false]
["Electricity-Data",false]
["Mobile-Entry",false]
["Mobile-Data",false]
["Solid Waste-Control",false]
["Solid Waste-Entry",false]
["Wastewater-Control",false]
["Wastewater-Entry",false]
["Employee Commutes",false]
["Water",false]
["Agriculture & Land Management",false]
["Urban Forestry",false]
["Waste Production",false]
["Additional Emission Sources",false]
["Summary-Emissions"]
["Summary-Reductions"]
["Background Controls"]
["Help"]

{"sheet":"Stationary-Entry","index":6,"n_rows":25,"n_cols":6,"rows_kept":25,"cut":false,"hidden":false,"merged":[[24,0,24,5]]}
["Stationary Units - Entry"]
["Data Entry & Calculations"]
[]
[]
[]
[]
["1)","Describe the fuel consuming unit you are entering"]
[null,"ID#","Unit Description","Facility Type (if applicable)","Sector"]
[0,{"$f":"stat_CurrentID","v":8}]
[]
[]
["2) ",{"$f":"\"Enter the activity data for the year \"&MyYear","v":"Enter the activity data for the year 2022"}]
[]
[null,"Fuel Type",{"$f":"IF(ISNA(\"Fuel Use (\"&VLOOKUP(stat_entry_fuel,stat_factors,6,FALSE)&\"):\"),\"Fuel Use\",\"Fuel Use (\"&VLOOKUP(stat_entry_fuel,stat_factors,6,FALSE)&\"):\")","v":"Fuel Use"}]
[]
[]
[]
[null,null,null,null,null," "]
[]
[]
[]
[]
[]
[]
["Local GHG Inventory Tool: Community Module"]

{"sheet":"StatTemplateReadMe","index":7,"n_rows":49,"n_cols":4,"rows_kept":49,"cut":false,"hidden":true,"merged":[[25,1,25,2],[0,1,0,2],[1,1,1,2],[2,1,2,2],[3,1,3,2],[23,1,23,2],[24,1,24,2],[4,1,4,2],[5,1,5,2],[6,1,6,2],[7,1,7,2],[8,1,8,2],[9,1,9,2]]}
["Stationary Data Template Instructions","This sheet describes the file layout and data parameters needed for batch import."]
[null,"This will allow you to bypass the data entry form and upload multiple lines of data."]
[null,"Please enter your activity data on the following worksheet (DataSheet) according to the parameters below."]
[null,"Copy and paste the data from that sheet onto the \"Stationary-Data\" worksheet in the inventory tool."]
["ID#","This value is automatically supplied when adding data via the input form. You will need to update this manually when using the batch import feature. Please assign a unique value to each line of data you add."]
[null,"Values must be integers in ascending order. Gaps between numbers are permitted. For example, three lines with IDs in order of 11, 12, and 15 are ok; IDs of 11, 15, and 12 is not. The calculations will not be accurate if the ID numbers do not meet this condition."]
[null,"It is recommended that you begin with the highest previous number and increase each additional line by 1."]
["Unit Description","Use this field to describe or name the unit or group that you are entering. This field is for the user's reference only and does not impact the calculations."]
["Sector","Enter one of the sectors that were specified on the Control Sheet. You must use the exact spelling of the sector that was provided on the Control Sheet in order for each entry to be included in the calculations."]
["Fuel Type","Please enter the fuel type in this column. You must select the fuel type from the list below. Any other fuels will not be included in the calculations. The consumption amounts must also be in the units listed below."]
[]
[null,"Fuel","Unit"]
[null,"Natural Gas","mcf (thousand cubic feet)"]
[null,"Digester Gas","mcf (thousand cubic feet)"]
[null,"Diesel","gallons"]
[null,"LPG","gallons"]
[null,"Gasoline","gallons"]
[null,"Residual Fuel Oil No. 5","gallons"]
[null,"Residual Fuel Oil No. 6","gallons"]
[null,"Propane","gallons"]
[null,"Butane","gallons"]
[null,"Jet Fuel","gallons"]
[null,"Bituminous Coal","short tons"]
["Amount Consumed","Please enter your fuel consumption for the inventory year here."]
["Unit","This value is for reference only and does not affect the calculations. However, please be sure to enter data using the units specified above."]
["Facility Type","If you have chosen to enter data at the facility level, please specify the type of facility from the lists provided below. "]
[]
[null,"Residential Facility Type List","Commercial/Institutional Facility Type List","Industrial Facility Type List"]
[null,"Single Family Units","Education","Food"]
[null,"Apartment Buildings","Food Sales","Beverage and Tobacco Products"]
[null,"Mobile Homes","Food Service","Textile Mills"]
[null,null,"Health Care","Textile Product Mills"]
[null,"Energy Generation","Lodging","Apparel"]
[null,"Electricity Generators","Mercantile","Leather and Allied Products"]
[null,null,"Office","Wood Products"]
[null,null,"Public Assembly","Paper"]
[null,null,"Public Order and Safety","Printing and Related Support"]
[null,null,"Religious Worship","Petroleum and Coal Products"]
[null,null,"Service","Chemicals"]
[null,null,"Warehouse and Storage","Plastics and Rubber Products"]
[null,null,"Other","Nonmetallic Mineral Products"]
[null,null,"Vacant","Primary Metals"]
[null,null,null,"Fabricated Metal Products"]
[null,null,null,"Machinery"]
[null,null,null,"Computer and Electronic Products"]
[null,null,null,"Electrical Equip., Appliances, and Components"]
[null,null,null,"Transportation Equipment"]
[null,null,null,"Furniture and Related Products"]
[null,null,null,"Miscellaneous"]

{"sheet":"Stationary-Data","index":8,"n_rows":15,"n_cols":7,"rows_kept":15,"cut":false,"hidden":false,"merged":[]}
["Stationary Units - Data"]
[]
[]
[]
["Linker Row"]
["ID#","Unit Description","Sector","Fuel Type","Amount of Fuel Used","Unit","Facility Type"]
[{"$f":"MAX(A9:A65521)+1","v":8},{"$f":"stat_entry_description","v":0},{"$f":"stat_entry_dept","v":0},{"$f":"stat_entry_fuel","v":0},{"$f":"stat_entry_consumption","v":0},{"$f":"IF(ISNA(VLOOKUP(D7,stat_factors,6,FALSE)), \" \", VLOOKUP(D7, stat_factors, 6, FALSE))","v":" "},{"$f":"stat_entry_bldgtype","v":0}]
["Saved Data"]
[1,"Electricity Generation - Saipan","Energy Generation","Distillate Fuel Oil",18847445,"gal","Energy Generation: Electricity Generators"]
[2,"Electricity Generation - Tinian","Energy Generation","Distillate Fuel Oil",956268,"gal","Energy Generation: Electricity Generators"]
[3,"Electricity Generation - Rota","Energy Generation","Distillate Fuel Oil",791817,"gal","Energy Generation: Electricity Generators"]
[4,"Electricity Generation - Saipan Hotels (Pacific Islands Club)","Commercial/Institutional","Diesel",432000,"gal","Commercial/Institutional: Lodging"]
[5,"Electricity Generation - Saipan Hotels (Hyatt Regency)","Commercial/Institutional","Diesel",552000,"gal","Commercial/Institutional: Lodging"]
[6,"Electricity Generation - Saipan Hotels (Aqua Resort)","Commercial/Institutional","Diesel",192000,"gal","Commercial/Institutional: Lodging"]
[7,"Electricity Generation - Saipan Marpi Landfill","Industrial","Diesel",9000,"gal","Industrial: Miscellaneous"]

{"sheet":"Stationary-Calcs","index":9,"n_rows":301,"n_cols":27,"rows_kept":301,"cut":false,"hidden":false,"merged":[[300,0,300,21],[20,1,20,5],[72,1,72,5],[72,8,72,11],[90,8,90,10],[20,8,20,12]]}
["Stationary Units - Calculation & Summary "]
["Jump to…"]
["Sector Summary"]
["Emissions by Sector"]
["Fuel and Energy Use by Sector"]
["Fuel Summary"]
["Emissions by Fuel Type"]
["Fuel and Energy Use by Type"]
["Background Calculations"]
["CO2 emissions by fuel type"]
["CH4 emissions by fuel type"]
["N2O emissions by fuel type"]
["Activity data by sector and fuel type"]
["CO2 emissions by sector and fuel type"]
["CH4 emissions by sector and fuel type"]
["N2O emissions by sector and fuel type"]
["Energy use by sector and fuel type"]
[]
["Sector Summary"]
[]
[null,"Emissions by Sector (MT CO2e)",null,null,null,null,null,null,"Fuel and Energy (MMBtu) Use by Sector"]
[null,"Sector","CO2","CH4","N2O","Total",null,null,"Sector","mcf","gal","tons","Energy Use"]
["Dstart",{"$f":"'Background Controls'!I5","v":"Residential"},{"$f":"IF(ISNA(VLOOKUP($B23, stat_calcs_CO2_deptFT, 18, FALSE)),0,VLOOKUP($B23, stat_calcs_CO2_deptFT, 18, FALSE))","v":0},{"$f":"IF(ISNA(VLOOKUP($B23, stat_calcs_CH4_deptFT, 18, FALSE)),0,VLOOKUP($B23, stat_calcs_CH4_deptFT, 18, FALSE))","v":0},{"$f":"IF(ISNA(VLOOKUP($B23, stat_calcs_N2O_deptFT, 18, FALSE)),0,VLOOKUP($B23, stat_calcs_N2O_deptFT, 18, FALSE))","v":0},{"$f":"SUM(C23:E23)","v":0},null,null,{"$f":"B23","v":"Residential"},{"$f":"IF(ISNA(VLOOKUP($I23, stat_calcs_consump_deptFT, 18, FALSE)),0,VLOOKUP($I23, stat_calcs_consump_deptFT, 18, FALSE))","v":0},{"$f":"IF(ISNA(VLOOKUP($I23, stat_calcs_consump_deptFT, 19, FALSE)),0,VLOOKUP($I23, stat_calcs_consump_deptFT, 19, FALSE))","v":0},{"$f":"IF(ISNA(VLOOKUP($I23, stat_calcs_consump_deptFT, 20, FALSE)),0,VLOOKUP($I23, stat_calcs_consump_deptFT, 20, FALSE))","v":0},{"$f":"IF(ISNA(VLOOKUP($I23, stat_calcs_E_deptFT, 18, FALSE)),0,VLOOKUP($I23, stat_calcs_E_deptFT, 18, FALSE))","v":0}]
[null,{"$f":"'Background Controls'!I6","v":"Commercial/Institutional"},12006.960000000001,13.6416,25.8216,{"$f":"SUM(C24:E24)","v":12046.423200000001},null,null,{"$f":"B24","v":"Commercial/Institutional"},0,1176000,0,162400]
[null,{"$f":"'Background Controls'!I7","v":"Industrial"},91.890000000000015,0.10440000000000001,0.19761428571428571,92.192014285714293,null,null,"Industrial",0,9000,0,1242.8571428571429]
[null,{"$f":"'Background Controls'!I8","v":"Energy Generation"},211741.23601879395,239.93792450000001,454.16821423214282,212435.34215752609,null,null,"Energy Generation",0,20595530,0,2856403.8630952383]
[null,{"$f":"'Background Controls'!I9","v":0},0,0,0,0,null,null,0,0,0,0,0]
[null,{"$f":"'Background Controls'!I10","v":0},0,0,0,0,null,null,0,0,0,0,0]
[null,{"$f":"'Background Controls'!I11","v":0},0,0,0,0,null,null,0,0,0,0,0]
[null,{"$f":"'Background Controls'!I12","v":0},0,0,0,0,null,null,0,0,0,0,0]
[null,{"$f":"'Background Controls'!I13","v":0},0,0,0,0,null,null,0,0,0,0,0]
[null,{"$f":"'Background Controls'!I14","v":0},0,0,0,0,null,null,0,0,0,0,0]
[null,{"$f":"'Background Controls'!I15","v":0},0,0,0,0,null,null,0,0,0,0,0]
[null,{"$f":"'Background Controls'!I16","v":0},0,0,0,0,null,null,0,0,0,0,0]
[null,{"$f":"'Background Controls'!I17","v":0},0,0,0,0,null,null,0,0,0,0,0]
[null,{"$f":"'Background Controls'!I18","v":0},0,0,0,0,null,null,0,0,0,0,0]
[null,{"$f":"'Background Controls'!I19","v":0},0,0,0,0,null,null,0,0,0,0,0]
[null,{"$f":"'Background Controls'!I20","v":0},0,0,0,0,null,null,0,0,0,0,0]
[null,{"$f":"'Background Controls'!I21","v":0},0,0,0,0,null,null,0,0,0,0,0]
[null,{"$f":"'Background Controls'!I22","v":0},0,0,0,0,null,null,0,0,0,0,0]
[null,{"$f":"'Background Controls'!I23","v":0},0,0,0,0,null,null,0,0,0,0,0]
[null,{"$f":"'Background Controls'!I24","v":0},0,0,0,0,null,null,0,0,0,0,0]
[null,"Total Stationary Combustion Emissions",{"$f":"SUM(C23:C42)","v":223840.08601879395},{"$f":"SUM(D23:D42)","v":253.68392450000002},{"$f":"SUM(E23:E42)","v":480.18742851785709},{"$f":"SUM(F23:F42)","v":224573.95737181179},null,null,"Total Stationary Combustion Energy Use",{"$f":"SUM(J23:J42)","v":0},{"$f":"SUM(K23:K42)","v":21780530},{"$f":"SUM(L23:L42)","v":0},{"$f":"SUM(M23:M42)","v":3020046.7202380956}]
[]
[]
[null,"Check to display: ",null,null,null,null,null,null,null,null,null,null,null,null,null,null,null,null,null,null,null,null,"emissions",true]
[null,null,null,null,null,null,null,null,null,null,null,null,null,null,null,null,null,null,null,null,null,null,"energy",true]
[null,null,null,null,null,null,null,null,null,null,null,null,null,null,null,null,null,null,null,null,null,null,"both",{"$f":"AND(X46:X47)","v":true}]
[null,null,null,null,null,null,null,null,null,null,null,null,null,null,null,null,null,null,null,null,null,null,null,{"$f":"IF(X48=TRUE, W48, IF(X46=TRUE, W46, IF(X47=TRUE, W47,\"both\")))","v":"both"}]
[]
[]
[]
[]
[]
[]
[]
[]
[]
[]
[]
[]
[]
[]
[]
[]
[]
[]
[]
[]
[]
["Fuel Summary"]
[]
[null,"Emissions by Fuel Type",null,null,null,null,null,null,"Fuel and Energy Use by Type"]
[null,"Fuel Type","CO2","CH4","N2O","TOTAL",null,null,"Fuel Type","Fuel Consumed",null,"Energy Use (MMBtu)"]
[null,"Natural Gas",{"$f":"VLOOKUP($B75, stat_calcs_CO2byFuel, 8, FALSE)","v":0},{"$f":"VLOOKUP($B75, stat_calcs_CH4byFuel, 8, FALSE)","v":0},{"$f":"VLOOKUP($B75, stat_calcs_N2ObyFuel, 8, FALSE)","v":0},{"$f":"SUM(C75:E75)","v":0},null,null,"Natural Gas",{"$f":"SUMIF(stat_data_FuelType, I75, stat_data_consump)","v":0},"mcf",{"$f":"HLOOKUP(I75, stat_calcs_E_deptFT, 22, FALSE)","v":0}]
[null,"Diesel",{"$f":"VLOOKUP($B76, stat_calcs_CO2byFuel, 8, FALSE)","v":12098.850000000002},13.746,26.019214285714284,{"$f":"SUM(C76:E76)","v":12138.615214285715},null,null,"Diesel",1185000,"gal",163642.85714285713]
[null,"Gasoline",0,0,0,0,null,null,"Gasoline",0,"gal",0]
[null,"LPG",0,0,0,0,null,null,"LPG",0,"gal",0]
[null,"Propane",0,0,0,0,null,null,"Propane",0,"gal",0]
[null,"Butane",0,0,0,0,null,null,"Butane",0,"gal",0]
[null,"Residual Fuel Oil No. 5",0,0,0,0,null,null,"Residual Fuel Oil No. 5",0,"gal",0]
[null,"Residual Fuel Oil No. 6",0,0,0,0,null,null,"Residual Fuel Oil No. 6",0,"gal",0]
[null,"Jet Fuel",0,0,0,0,null,null,"Jet Fuel",0,"gal",0]
[null,"Residential Coal",0,{"$f":"VLOOKUP($B84, stat_calcs_CH4byFuel, 8, FALSE)","v":0},0,0,null,null,"Residential Coal",0,"tons",0]
[null,"Commercial Coal",0,0,0,{"$f":"SUM(C85:E85)","v":0},null,null,"Commercial Coal",{"$f":"SUMIF(stat_data_FuelType, I85, stat_data_consump)","v":0},"tons",{"$f":"HLOOKUP(I85, stat_calcs_E_deptFT, 22, FALSE)","v":0}]
[null,"Industrial Coal",0,0,0,0,null,null,"Industrial Coal",0,"tons",0]
[null,"Electric Power Coal",0,0,0,0,null,null,"Electric Power Coal",0,"tons",0]
[null,"Digester Gas",0,0,0,0,null,null,"Digester Gas",0,"tons",0]
[null,"Distillate Fuel Oil",{"$f":"VLOOKUP($B89, stat_calcs_CO2byFuel, 8, FALSE)","v":211741.23601879398},239.93792450000001,454.16821423214282,{"$f":"SUM(C89:E89)","v":212435.34215752612},null,null,"Distillate Fuel Oil",20595530,"gal",2856403.8630952383]
[null,"Kerosene",0,0,0,0,null,null,"Kerosene",0,"gal",0]
[null,"Total Emissions from Stationary Fuel Combustion",{"$f":"SUM(C75:C90)","v":223840.08601879398},{"$f":"SUM(D75:D90)","v":253.68392450000002},{"$f":"SUM(E75:E90)","v":480.18742851785709},{"$f":"SUM(F75:F90)","v":224573.95737181182},null,null,"Total Stationary Fuel Consumed",null,null,{"$f":"SUM(L75:L90)","v":3020046.7202380956},null,null,null,null,null,null,null,null,null,null,null,null,null,null,{"$f":"L91-S297","v":0}]
[]
[null,"Check to display: ",null,null,null,null,null,null,null,null,null,null,null,null,null,null,null,null,null,null,null,null,"emissions",true]
[null,null,null,null,null,null,null,null,null,null,null,null,null,null,null,null,null,null,null,null,null,null,"energy",true]
[null,null,null,null,null,null,null,null,null,null,null,null,null,null,null,null,null,null,null,null,null,null,"both",{"$f":"AND(X93:X94)","v":true}]
[null,null,null,null,null,null,null,null,null,null,null,null,null,null,null,null,null,null,null,null,null,null,null,{"$f":"IF(X95=TRUE, W95, IF(X93=TRUE, W93, IF(X94=TRUE, W94, \"both\")))","v":"both"}]
[]
[]
[]
[]
[]
[]
[]
[]
[]
[]
[]
[]
[]
[]
[]
[]
["Background Calculations"]
[]
["CO2 Emissions by Fuel Type"]
["CO2 Emissions = Fuel use × CO2 Emission Factor (kg CO2/unit of fuel) × MT/kg"]
[null,null,"Fuel Use","Unit","kg CO2/unit ","MT/kg","MT CO2","× GWP =","MT CO2e"]
[null,"Natural Gas",{"$f":"SUMIF(stat_data_FuelType, B118, stat_data_consump)","v":0},"mcf",{"$f":"VLOOKUP(B118, stat_factors, 2, FALSE)","v":54.862613215666663},{"$f":"kg_mt","v":1E-3},{"$f":"C118*E118*F118","v":0},{"$f":"CO2_CO2e","v":1},{"$f":"G118*H118","v":0}]
[null,"Diesel",1185000,"gal",10.210000000000001,1E-3,12098.850000000002,1,{"$f":"G119*H119","v":12098.850000000002}]
[null,"Gasoline",0,"gal",8.4954458676091367,1E-3,0,1,0]
[null,"LPG",0,"gal",6.0224607740611882,1E-3,0,1,0]
[null,"Propane",0,"gal",5.721169999999999,1E-3,0,1,0]
[null,"Butane",0,"gal",6.67,1E-3,0,1,0]
[null,"Residual Fuel Oil No. 5",0,"gal",10.210000000000001,1E-3,0,1,0]
[null,"Residual Fuel Oil No. 6",0,"gal",11.27,1E-3,0,1,0]
[null,"Jet Fuel",0,"gal",9.7499999999999982,1E-3,0,1,0]
[null,"Residential Coal",0,"tons",2390.9013836509489,1E-3,0,1,0]
[null,"Commercial Coal",{"$f":"SUMIF(stat_data_FuelType, B128, stat_data_consump)","v":0},"tons",{"$f":"VLOOKUP(B128, stat_factors, 2, FALSE)","v":2051.399141447806},1E-3,{"$f":"C128*E128*F128","v":0},1,{"$f":"G128*H128","v":0}]
[null,"Industrial Coal",0,"tons",2138.577605506634,1E-3,0,1,0]
[null,"Electric Power Coal",0,"tons",1890.5234630391508,1E-3,0,1,0]
[null,"Digester Gas",0,"mcf",34.105850000000004,1E-3,0,1,{"$f":"G131*H131","v":0}]
[null,{"$f":"Q177","v":"Distillate Fuel Oil"},20595530,"gal",10.280931639962359,1E-3,{"$f":"C132*E132*F132","v":211741.23601879398},1,{"$f":"G132*H132","v":211741.23601879398}]
[null,{"$f":"R177","v":"Kerosene"},0,"gal",{"$f":"VLOOKUP(B133, stat_factors, 2, FALSE)","v":10.15},1E-3,0,1,{"$f":"G133*H133","v":0}]
[]
["CH4 Emissions by Fuel Type"]
["CH4 Emissions = Fuel use × CH4 Emission Factor (kg CH4/unit of fuel) × MT/kg; CO2 equivalent emissions = MT CH4 × Global Warming Potential of CH4"]
[null,null,"Fuel Use","Unit","kg CH4/unit ","MT/kg","MT CH4","× GWP =","MT CO2e"]
[null,"Natural Gas",{"$f":"SUMIF(stat_data_FuelType, B138, stat_data_consump)","v":0},"mcf",{"$f":"VLOOKUP(B138, stat_factors, 3, FALSE)","v":4.8738999999999996E-3},{"$f":"kg_mt","v":1E-3},{"$f":"C138*E138*F138","v":0},{"$f":"CH4_CO2e","v":28},{"$f":"G138*H138","v":0}]
[null,"Diesel",1185000,"gal",4.1428571428571431E-4,1E-3,0.49092857142857144,28,{"$f":"G139*H139","v":13.746}]
[null,"Gasoline",0,"gal",3.6071428571428572E-4,1E-3,0,28,0]
[null,"LPG",0,"gal",2.7599999999999999E-4,1E-3,0,28,0]
[null,"Propane",0,"gal",2.7300000000000002E-4,1E-3,0,28,0]
[null,"Butane",0,"gal",3.0899999999999998E-4,1E-3,0,28,0]
[null,"Residual Fuel Oil No. 5",0,"gal",4.2000000000000007E-4,1E-3,0,28,0]
[null,"Residual Fuel Oil No. 6",0,"gal",4.4999999999999999E-4,1E-3,0,28,0]
[null,"Jet Fuel",0,"gal",4.0500000000000003E-4,1E-3,0,28,0]
[null,"Residential Coal",0,"tons",{"$f":"VLOOKUP(B147, stat_factors, 3, FALSE)","v":0.27422999999999997},1E-3,{"$f":"C147*E147*F147","v":0},28,{"$f":"G147*H147","v":0}]
[null,"Commercial Coal",{"$f":"SUMIF(stat_data_FuelType, B148, stat_data_consump)","v":0},"tons",{"$f":"VLOOKUP(B148, stat_factors, 3, FALSE)","v":0.23529},1E-3,{"$f":"C148*E148*F148","v":0},28,{"$f":"G148*H148","v":0}]
[null,"Industrial Coal",0,"tons",{"$f":"VLOOKUP(B149, stat_factors, 3, FALSE)","v":0.24585000000000001},1E-3,0,28,0]
[null,"Electric Power Coal",0,"tons",{"$f":"VLOOKUP(B150, stat_factors, 3, FALSE)","v":0.21703},1E-3,0,28,0]
[null,"Digester Gas",0,"mcf",{"$f":"VLOOKUP(B151, stat_factors, 3, FALSE)","v":2.0960000000000002E-3},1E-3,{"$f":"C151*E151*F151","v":0},28,{"$f":"G151*H151","v":0}]
[null,"Distillate Fuel Oil",20595530,"gal",4.1607142857142863E-4,1E-3,8.5692115892857146,28,239.93792450000001]
[null,"Kerosene",0,"gal",4.0500000000000003E-4,1E-3,0,28,{"$f":"G153*H153","v":0}]
[]
["N2O Emissions by Fuel Type"]
["N2O Emissions = Fuel use × N2O Emission Factor (kg N2O/unit of fuel) × MT/kg; CO2 equivalent emissions = MT N2O × Global Warming Potential of N2O"]
[null,null,"Fuel Use","Unit","kg N2O/unit","MT/kg","MT N2O","× GWP =","MT CO2e"]
[null,"Natural Gas",{"$f":"SUMIF(stat_data_FuelType, B158, stat_data_consump)","v":0},"mcf",{"$f":"VLOOKUP(B158, stat_factors, 4, FALSE)","v":1.037E-4},{"$f":"kg_mt","v":1E-3},{"$f":"C158*E158*F158","v":0},{"$f":"N2O_CO2e","v":265},{"$f":"G158*H158","v":0}]
[null,"Diesel",1185000,"gal",8.285714285714286E-5,1E-3,9.8185714285714279E-2,265,{"$f":"G159*H159","v":26.019214285714284}]
[null,"Gasoline",0,"gal",7.2142857142857127E-5,1E-3,0,265,0]
[null,"LPG",0,"gal",5.5199999999999993E-5,1E-3,0,265,{"$f":"G161*H161","v":0}]
[null,"Propane",0,"gal",5.4599999999999992E-5,1E-3,0,265,0]
[null,"Butane",0,"gal",6.1799999999999998E-5,1E-3,0,265,0]
[null,"Residual Fuel Oil No. 5",0,"gal",8.3999999999999995E-5,1E-3,0,265,0]
[null,"Residual Fuel Oil No. 6",0,"gal",8.9999999999999992E-5,1E-3,0,265,0]
[null,"Jet Fuel",0,"gal",8.1000000000000004E-5,1E-3,0,265,0]
[null,"Residential Coal",0,"tons",3.9888E-2,1E-3,0,265,0]
[null,"Commercial Coal",{"$f":"SUMIF(stat_data_FuelType, B168, stat_data_consump)","v":0},"tons",{"$f":"VLOOKUP(B168, stat_factors, 4, FALSE)","v":3.4224000000000004E-2},1E-3,{"$f":"C168*E168*F168","v":0},265,0]
[null,"Industrial Coal",0,"tons",3.5760000000000007E-2,1E-3,0,265,0]
[null,"Electric Power Coal",0,"tons",3.1567999999999999E-2,1E-3,0,265,0]
[null,"Digester Gas",0,"mcf",4.1265000000000003E-4,1E-3,0,265,{"$f":"G171*H171","v":0}]
[null,"Distillate Fuel Oil",20595530,"gal",{"$f":"VLOOKUP(B172, stat_factors, 4, FALSE)","v":8.3214285714285706E-5},1E-3,{"$f":"C172*E172*F172","v":1.7138423178571427},265,{"$f":"G172*H172","v":454.16821423214282}]
[null,"Kerosene",0,"gal",{"$f":"VLOOKUP(B173, stat_factors, 4, FALSE)","v":8.1000000000000004E-5},1E-3,0,265,{"$f":"G173*H173","v":0}]
[]
["Activity Data by Sector and Fuel Type"]
["Fuel use data by sector and fuel type. Units: Natural Gas and Digester Gas (mcf), Bituminous Coal (short tons), all other (gallons)"]
[null,null,{"$f":"TRANSPOSE($B$158:$B$167)","v":"Natural Gas"},"Diesel","Gasoline","LPG","Propane","Butane","Residual Fuel Oil No. 5","Residual Fuel Oil No. 6","Jet Fuel","Residential Coal",{"$f":"B168","v":"Commercial Coal"},"Industrial Coal","Electric Power Coal","Digester Gas","Distillate Fuel Oil","Kerosene","Gas Products (mcf)","Petroleum Products (gal)","Coal (tons)"]
["Dstart",{"$f":"B23","v":"Residential"},{"$f":"SUMIFS(stat_data_consump, stat_data_dept, $B178, stat_data_FuelType, C$177)","v":0},0,0,0,0,0,0,0,0,0,0,0,0,0,0,0,{"$f":"SUM(C178,P178)","v":0},{"$f":"SUM(D178:K178,Q178:R178)","v":0},{"$f":"SUM(L178:O178)","v":0}]
[null,"Commercial/Institutional",0,1176000,0,0,0,0,0,0,0,0,0,0,0,0,0,0,{"$f":"SUM(C179,P179)","v":0},{"$f":"SUM(D179:K179,Q179:R179)","v":1176000},{"$f":"SUM(L179:O179)","v":0}]
[null,"Industrial",0,9000,0,0,0,0,0,0,0,0,0,0,0,0,0,0,0,9000,0]
[null,"Energy Generation",0,0,0,0,0,0,0,0,0,0,0,0,0,0,20595530,0,0,20595530,0]
[null,0,0,0,0,0,0,0,0,0,0,0,0,0,0,0,0,0,0,{"$f":"SUM(D182:K182,Q182:R182)","v":0},0]
[null,0,0,0,0,0,0,0,0,0,0,0,0,0,0,0,0,0,0,0,0]
[null,0,0,0,0,0,0,0,0,0,0,0,0,0,0,0,0,0,0,0,0]
[null,0,0,0,0,0,0,0,0,0,0,0,0,0,0,0,0,0,0,0,0]
[null,0,0,0,0,0,0,0,0,0,0,0,0,0,0,0,0,0,0,0,0]
[null,0,0,0,0,0,0,0,0,0,0,0,0,0,0,0,0,0,0,0,0]
[null,0,0,0,0,0,0,0,0,0,0,0,0,0,0,0,0,0,0,0,0]
[null,0,0,0,0,0,0,0,0,0,0,0,0,0,0,0,0,0,0,0,0]
[null,0,{"$f":"SUMIFS(stat_data_consump, stat_data_dept, $B190, stat_data_FuelType, C$177)","v":0},0,0,0,0,0,0,0,0,0,0,0,0,{"$f":"SUMIFS(stat_data_consump, stat_data_dept, $B190, stat_data_FuelType, P$177)","v":0},0,0,0,0,0]
[null,0,0,0,0,0,0,0,0,0,0,0,0,0,0,0,0,0,0,0,0]
[null,0,0,0,0,0,0,0,0,0,0,0,0,0,0,0,0,0,0,0,0]
[null,0,0,0,0,0,0,0,0,0,0,0,0,0,0,0,0,0,0,0,{"$f":"SUM(L193:O193)","v":0}]
[null,0,0,0,0,0,0,0,0,0,0,0,0,0,0,0,0,0,0,0,0]
[null,0,0,0,0,0,0,0,0,0,0,0,0,0,0,0,0,0,0,0,0]
[null,0,0,0,0,0,0,0,0,0,0,0,0,0,0,0,0,0,0,0,0]
[null,0,0,0,0,0,0,0,0,0,0,0,0,0,0,0,0,0,0,0,0]
[null,"Total",{"$f":"SUM(C178:C197)","v":0},{"$f":"SUM(D178:D197)","v":1185000},{"$f":"SUM(E178:E197)","v":0},0,0,0,0,0,0,{"$f":"SUM(L178:L197)","v":0},{"$f":"SUM(M178:M197)","v":0},0,0,{"$f":"SUM(P178:P197)","v":0},{"$f":"SUM(Q178:Q197)","v":20595530},{"$f":"SUM(R178:R197)","v":0},{"$f":"SUM(C198,P198)","v":0},{"$f":"SUM(D198:K198,Q198:R198)","v":21780530},{"$f":"SUM(L198:O198)","v":0}]
[]
["Emissions by Sector and Fuel Type"]
[]
["CO2 Emissions = Units of Fuel Consumed × kg CO2 / unit × MT/kg "]
[null,"CO2",{"$f":"TRANSPOSE($B$158:$B$167)","v":"Natural Gas"},"Diesel","Gasoline","LPG","Propane","Butane","Residual Fuel Oil No. 5","Residual Fuel Oil No. 6","Jet Fuel","Residential Coal",{"$f":"M177","v":"Commercial Coal"},"Industrial Coal","Electric Power Coal","Digester Gas","Distillate Fuel Oil","Kerosene","TOTAL"]
["Dstart",{"$f":"B178","v":"Residential"},{"$f":"C178*kg_mt*VLOOKUP(C$203, stat_factors, 2, FALSE)","v":0},0,0,0,0,0,0,0,0,0,{"$f":"M178*kg_mt*VLOOKUP(M$203, stat_factors, 2, FALSE)","v":0},0,0,0,0,0,{"$f":"SUM(C204:R204)","v":0}]
[null,{"$f":"B179","v":"Commercial/Institutional"},{"$f":"C179*kg_mt*VLOOKUP(C$203, stat_factors, 2, FALSE)","v":0},12006.960000000001,0,0,0,0,0,0,0,0,0,0,0,0,0,0,{"$f":"SUM(C205:R205)","v":12006.960000000001}]
[null,"Industrial",{"$f":"C180*kg_mt*VLOOKUP(C$203, stat_factors, 2, FALSE)","v":0},91.890000000000015,0,0,0,0,0,0,0,0,0,0,0,0,0,0,91.890000000000015]
[null,"Energy Generation",{"$f":"C181*kg_mt*VLOOKUP(C$203, stat_factors, 2, FALSE)","v":0},0,0,0,0,0,0,0,0,0,0,0,0,0,211741.23601879395,0,211741.23601879395]
[null,0,{"$f":"C182*kg_mt*VLOOKUP(C$203, stat_factors, 2, FALSE)","v":0},0,0,0,0,0,0,0,0,0,0,0,0,0,0,0,0]
[null,0,{"$f":"C183*kg_mt*VLOOKUP(C$203, stat_factors, 2, FALSE)","v":0},0,0,0,0,0,0,0,0,0,0,0,0,0,0,0,0]
[null,0,{"$f":"C184*kg_mt*VLOOKUP(C$203, stat_factors, 2, FALSE)","v":0},0,0,0,0,0,0,0,0,0,0,0,0,0,0,0,0]
[null,0,{"$f":"C185*kg_mt*VLOOKUP(C$203, stat_factors, 2, FALSE)","v":0},0,0,0,0,0,0,0,0,0,0,0,0,0,0,0,0]
[null,0,{"$f":"C186*kg_mt*VLOOKUP(C$203, stat_factors, 2, FALSE)","v":0},0,0,0,0,0,0,0,0,0,0,0,0,0,0,0,0]
[null,0,{"$f":"C187*kg_mt*VLOOKUP(C$203, stat_factors, 2, FALSE)","v":0},0,0,0,0,0,0,0,0,0,0,0,0,0,0,0,0]
[null,0,{"$f":"C188*kg_mt*VLOOKUP(C$203, stat_factors, 2, FALSE)","v":0},0,0,0,0,0,0,0,0,0,0,0,0,0,0,0,0]
[null,0,{"$f":"C189*kg_mt*VLOOKUP(C$203, stat_factors, 2, FALSE)","v":0},0,0,0,0,0,0,0,0,0,0,0,0,0,0,0,0]
[null,0,{"$f":"C190*kg_mt*VLOOKUP(C$203, stat_factors, 2, FALSE)","v":0},0,0,0,0,0,0,0,0,0,0,0,0,0,0,0,0]
[null,0,{"$f":"C191*kg_mt*VLOOKUP(C$203, stat_factors, 2, FALSE)","v":0},0,0,0,0,0,0,0,0,0,0,0,0,0,0,0,0]
[null,0,{"$f":"C192*kg_mt*VLOOKUP(C$203, stat_factors, 2, FALSE)","v":0},0,0,0,0,0,0,0,0,0,0,0,0,0,0,0,0]
[null,0,{"$f":"C193*kg_mt*VLOOKUP(C$203, stat_factors, 2, FALSE)","v":0},0,0,0,0,0,0,0,0,0,0,0,0,0,0,0,0]
[null,0,{"$f":"C194*kg_mt*VLOOKUP(C$203, stat_factors, 2, FALSE)","v":0},0,0,0,0,0,0,0,0,0,0,0,0,0,0,0,0]
[null,0,{"$f":"C195*kg_mt*VLOOKUP(C$203, stat_factors, 2, FALSE)","v":0},0,0,0,0,0,0,0,0,0,0,0,0,0,0,0,0]
[null,0,{"$f":"C196*kg_mt*VLOOKUP(C$203, stat_factors, 2, FALSE)","v":0},0,0,0,0,0,0,0,0,0,0,0,0,0,0,0,0]
[null,0,{"$f":"C197*kg_mt*VLOOKUP(C$203, stat_factors, 2, FALSE)","v":0},0,0,0,0,0,0,0,0,0,0,0,0,0,0,0,0]
[null,"Total",{"$f":"SUM(C204:C223)","v":0},{"$f":"SUM(D204:D223)","v":12098.85},0,0,0,0,0,0,0,0,{"$f":"SUM(M204:M223)","v":0},0,0,0,211741.23601879395,0,{"$f":"SUM(S204:S223)","v":223840.08601879395}]
[]
["CH4 Emissions = Units of Fuel Consumed × kg CH4 / unit × MT/kg × GWP CH4"]
[null,"CH4",{"$f":"TRANSPOSE($B$158:$B$167)","v":"Natural Gas"},"Diesel","Gasoline","LPG","Propane","Butane","Residual Fuel Oil No. 5","Residual Fuel Oil No. 6","Jet Fuel","Residential Coal","Commercial Coal","Industrial Coal","Electric Power Coal","Digester Gas","Distillate Fuel Oil","Kerosene","TOTAL"]
["Dstart",{"$f":"B204","v":"Residential"},{"$f":"C178*kg_mt*VLOOKUP(C$227, stat_factors, 3, FALSE)*CH4_CO2e","v":0},0,0,0,0,0,0,0,0,0,0,0,0,0,0,0,{"$f":"SUM(C228:R228)","v":0}]
[null,{"$f":"B205","v":"Commercial/Institutional"},{"$f":"C179*kg_mt*VLOOKUP(C$227, stat_factors, 3, FALSE)*CH4_CO2e","v":0},13.6416,0,0,0,0,0,0,0,0,0,0,0,0,0,0,{"$f":"SUM(C229:R229)","v":13.6416}]
[null,"Industrial",{"$f":"C180*kg_mt*VLOOKUP(C$227, stat_factors, 3, FALSE)*CH4_CO2e","v":0},0.10440000000000001,0,0,0,0,0,0,0,0,0,0,0,0,0,0,0.10440000000000001]
[null,"Energy Generation",{"$f":"C181*kg_mt*VLOOKUP(C$227, stat_factors, 3, FALSE)*CH4_CO2e","v":0},0,0,0,0,0,0,0,0,0,0,0,0,0,239.93792450000001,0,239.93792450000001]
[null,0,{"$f":"C182*kg_mt*VLOOKUP(C$227, stat_factors, 3, FALSE)*CH4_CO2e","v":0},0,0,0,0,0,0,0,0,0,0,0,0,0,0,0,0]
[null,0,{"$f":"C183*kg_mt*VLOOKUP(C$227, stat_factors, 3, FALSE)*CH4_CO2e","v":0},0,0,0,0,0,0,0,0,0,0,0,0,0,0,0,0]
[null,0,{"$f":"C184*kg_mt*VLOOKUP(C$227, stat_factors, 3, FALSE)*CH4_CO2e","v":0},0,0,0,0,0,0,0,0,0,0,0,0,0,0,0,0]
[null,0,{"$f":"C185*kg_mt*VLOOKUP(C$227, stat_factors, 3, FALSE)*CH4_CO2e","v":0},0,0,0,0,0,0,0,0,0,0,0,0,0,0,0,{"$f":"SUM(C235:R235)","v":0}]
[null,0,{"$f":"C186*kg_mt*VLOOKUP(C$227, stat_factors, 3, FALSE)*CH4_CO2e","v":0},0,0,0,0,0,0,0,0,0,0,0,0,0,0,0,0]
[null,0,{"$f":"C187*kg_mt*VLOOKUP(C$227, stat_factors, 3, FALSE)*CH4_CO2e","v":0},0,0,0,0,0,0,0,0,0,0,0,0,0,0,0,0]
[null,0,{"$f":"C188*kg_mt*VLOOKUP(C$227, stat_factors, 3, FALSE)*CH4_CO2e","v":0},0,0,0,0,0,0,0,0,0,0,0,0,0,0,0,0]
[null,0,{"$f":"C189*kg_mt*VLOOKUP(C$227, stat_factors, 3, FALSE)*CH4_CO2e","v":0},0,0,0,0,0,0,0,0,0,0,0,0,0,0,0,0]
[null,0,{"$f":"C190*kg_mt*VLOOKUP(C$227, stat_factors, 3, FALSE)*CH4_CO2e","v":0},0,0,0,0,0,0,0,0,0,0,0,0,0,0,0,0]
[null,0,{"$f":"C191*kg_mt*VLOOKUP(C$227, stat_factors, 3, FALSE)*CH4_CO2e","v":0},0,0,0,0,0,0,0,0,0,0,0,0,0,0,0,0]
[null,0,{"$f":"C192*kg_mt*VLOOKUP(C$227, stat_factors, 3, FALSE)*CH4_CO2e","v":0},0,0,0,0,0,0,0,0,0,0,0,0,0,0,0,0]
[null,0,{"$f":"C193*kg_mt*VLOOKUP(C$227, stat_factors, 3, FALSE)*CH4_CO2e","v":0},0,0,0,0,0,0,0,0,0,0,0,0,0,0,0,0]
[null,0,{"$f":"C194*kg_mt*VLOOKUP(C$227, stat_factors, 3, FALSE)*CH4_CO2e","v":0},0,0,0,0,0,0,0,0,0,0,0,0,0,0,0,0]
[null,0,{"$f":"C195*kg_mt*VLOOKUP(C$227, stat_factors, 3, FALSE)*CH4_CO2e","v":0},0,0,0,0,0,0,0,0,0,0,0,0,0,0,0,0]
[null,0,{"$f":"C196*kg_mt*VLOOKUP(C$227, stat_factors, 3, FALSE)*CH4_CO2e","v":0},0,0,0,0,0,0,0,0,0,0,0,0,0,0,0,0]
[null,0,{"$f":"C197*kg_mt*VLOOKUP(C$227, stat_factors, 3, FALSE)*CH4_CO2e","v":0},0,0,0,0,0,0,0,0,0,0,0,0,0,0,0,0]
[null,"Total",{"$f":"SUM(C228:C247)","v":0},{"$f":"SUM(D228:D247)","v":13.746},0,0,0,0,0,0,0,0,{"$f":"SUM(M228:M247)","v":0},0,0,0,239.93792450000001,0,{"$f":"SUM(S228:S247)","v":253.68392450000002}]
[]
["N2O Emissions = Units of Fuel Consumed × kg N2O / unit × MT/kg × GWP N2O"]
[null,"N2O",{"$f":"TRANSPOSE($B$158:$B$167)","v":"Natural Gas"},"Diesel","Gasoline","LPG","Propane","Butane","Residual Fuel Oil No. 5","Residual Fuel Oil No. 6","Jet Fuel","Residential Coal","Commercial Coal","Industrial Coal","Electric Power Coal","Digester Gas","Distillate Fuel Oil","Kerosene","TOTAL"]
["Dstart",{"$f":"B228","v":"Residential"},{"$f":"C178*kg_mt*VLOOKUP(C$251, stat_factors, 4, FALSE)*N2O_CO2e","v":0},0,0,0,0,0,0,0,0,0,0,0,0,0,0,0,{"$f":"SUM(C252:R252)","v":0}]
[null,{"$f":"B229","v":"Commercial/Institutional"},{"$f":"C179*kg_mt*VLOOKUP(C$251, stat_factors, 4, FALSE)*N2O_CO2e","v":0},25.8216,0,0,0,0,0,0,0,0,0,0,0,0,0,0,{"$f":"SUM(C253:R253)","v":25.8216}]
[null,"Industrial",{"$f":"C180*kg_mt*VLOOKUP(C$251, stat_factors, 4, FALSE)*N2O_CO2e","v":0},0.19761428571428571,0,0,0,0,0,0,0,0,0,0,0,0,0,0,{"$f":"SUM(C254:R254)","v":0.19761428571428571}]
[null,"Energy Generation",{"$f":"C181*kg_mt*VLOOKUP(C$251, stat_factors, 4, FALSE)*N2O_CO2e","v":0},0,0,0,0,0,0,0,0,0,0,0,0,0,454.16821423214282,0,454.16821423214282]
[null,0,{"$f":"C182*kg_mt*VLOOKUP(C$251, stat_factors, 4, FALSE)*N2O_CO2e","v":0},0,0,0,0,0,0,0,0,0,0,0,0,0,0,0,0]
[null,0,{"$f":"C183*kg_mt*VLOOKUP(C$251, stat_factors, 4, FALSE)*N2O_CO2e","v":0},0,0,0,0,0,0,0,0,0,0,0,0,0,0,0,0]
[null,0,{"$f":"C184*kg_mt*VLOOKUP(C$251, stat_factors, 4, FALSE)*N2O_CO2e","v":0},0,0,0,0,0,0,0,0,0,0,0,0,0,0,0,0]
[null,0,{"$f":"C185*kg_mt*VLOOKUP(C$251, stat_factors, 4, FALSE)*N2O_CO2e","v":0},0,0,0,0,0,0,0,0,0,0,0,0,0,0,0,0]
[null,0,{"$f":"C186*kg_mt*VLOOKUP(C$251, stat_factors, 4, FALSE)*N2O_CO2e","v":0},0,0,0,0,0,0,0,0,0,0,0,0,0,0,0,0]
[null,0,{"$f":"C187*kg_mt*VLOOKUP(C$251, stat_factors, 4, FALSE)*N2O_CO2e","v":0},0,0,0,0,0,0,0,0,0,0,0,0,0,0,0,0]
[null,0,{"$f":"C188*kg_mt*VLOOKUP(C$251, stat_factors, 4, FALSE)*N2O_CO2e","v":0},0,0,0,0,0,0,0,0,0,0,0,0,0,0,0,0]
[null,0,{"$f":"C189*kg_mt*VLOOKUP(C$251, stat_factors, 4, FALSE)*N2O_CO2e","v":0},0,0,0,0,0,0,0,0,0,0,0,0,0,0,0,0]
[null,0,{"$f":"C190*kg_mt*VLOOKUP(C$251, stat_factors, 4, FALSE)*N2O_CO2e","v":0},0,0,0,0,0,0,0,0,0,0,0,0,0,0,0,0]
[null,0,{"$f":"C191*kg_mt*VLOOKUP(C$251, stat_factors, 4, FALSE)*N2O_CO2e","v":0},0,0,0,0,0,0,0,0,0,0,0,0,0,0,0,0]
[null,0,{"$f":"C192*kg_mt*VLOOKUP(C$251, stat_factors, 4, FALSE)*N2O_CO2e","v":0},0,0,0,0,0,0,0,0,0,0,0,0,0,0,0,0]
[null,0,{"$f":"C193*kg_mt*VLOOKUP(C$251, stat_factors, 4, FALSE)*N2O_CO2e","v":0},0,0,0,0,0,0,0,0,0,0,0,0,0,0,0,0]
[null,0,{"$f":"C194*kg_mt*VLOOKUP(C$251, stat_factors, 4, FALSE)*N2O_CO2e","v":0},0,0,0,0,0,0,0,0,0,0,0,0,0,0,0,0]
[null,0,{"$f":"C195*kg_mt*VLOOKUP(C$251, stat_factors, 4, FALSE)*N2O_CO2e","v":0},0,0,0,0,0,0,0,0,0,0,0,0,0,0,0,0]
[null,0,{"$f":"C196*kg_mt*VLOOKUP(C$251, stat_factors, 4, FALSE)*N2O_CO2e","v":0},0,0,0,0,0,0,0,0,0,0,0,0,0,0,0,{"$f":"SUM(C270:R270)","v":0}]
[null,0,{"$f":"C197*kg_mt*VLOOKUP(C$251, stat_factors, 4, FALSE)*N2O_CO2e","v":0},0,0,0,0,0,0,0,0,0,0,0,0,0,0,0,0]
[null,"Total",{"$f":"SUM(C252:C271)","v":0},{"$f":"SUM(D252:D271)","v":26.019214285714284},0,0,0,0,0,0,0,0,{"$f":"SUM(M252:M271)","v":0},0,0,0,454.16821423214282,0,{"$f":"SUM(S252:S271)","v":480.18742851785709}]
[]
["Energy Use by Sector and Fuel Type"]
["Energy Consumed (MMbtu) = Units of Fuel Consumed × Heat Content of Fuel (MMBtu/unit)"]
[null,null,{"$f":"TRANSPOSE($B$158:$B$167)","v":"Natural Gas"},"Diesel","Gasoline","LPG","Propane","Butane","Residual Fuel Oil No. 5","Residual Fuel Oil No. 6","Jet Fuel","Residential Coal","Commercial Coal","Industrial Coal","Electric Power Coal","Digester Gas","Distillate Fuel Oil","Kerosene","TOTAL"]
["Dstart",{"$f":"B252","v":"Residential"},{"$f":"C178*VLOOKUP(C$276, stat_factors, 5, FALSE)","v":0},0,0,0,0,0,0,0,0,0,{"$f":"M178*VLOOKUP(M$276, stat_factors, 5, FALSE)","v":0},0,0,0,{"$f":"Q178*VLOOKUP(Q$276, stat_factors, 5, FALSE)","v":0},0,{"$f":"SUM(C277:R277)","v":0}]
[null,{"$f":"B253","v":"Commercial/Institutional"},{"$f":"C179*VLOOKUP(C$276, stat_factors, 5, FALSE)","v":0},162400,0,0,0,0,0,0,0,0,{"$f":"M179*VLOOKUP(M$276, stat_factors, 5, FALSE)","v":0},0,0,0,{"$f":"Q179*VLOOKUP(Q$276, stat_factors, 5, FALSE)","v":0},0,{"$f":"SUM(C278:R278)","v":162400}]
[null,"Industrial",{"$f":"C180*VLOOKUP(C$276, stat_factors, 5, FALSE)","v":0},1242.8571428571429,0,0,0,0,0,0,0,0,{"$f":"M180*VLOOKUP(M$276, stat_factors, 5, FALSE)","v":0},0,0,0,{"$f":"Q180*VLOOKUP(Q$276, stat_factors, 5, FALSE)","v":0},0,1242.8571428571429]
[null,"Energy Generation",{"$f":"C181*VLOOKUP(C$276, stat_factors, 5, FALSE)","v":0},0,0,0,0,0,0,0,0,0,{"$f":"M181*VLOOKUP(M$276, stat_factors, 5, FALSE)","v":0},0,0,0,{"$f":"Q181*VLOOKUP(Q$276, stat_factors, 5, FALSE)","v":2856403.8630952383},0,2856403.8630952383]
[null,0,{"$f":"C182*VLOOKUP(C$276, stat_factors, 5, FALSE)","v":0},0,0,0,0,0,0,0,0,0,{"$f":"M182*VLOOKUP(M$276, stat_factors, 5, FALSE)","v":0},0,0,0,{"$f":"Q182*VLOOKUP(Q$276, stat_factors, 5, FALSE)","v":0},0,0]
[null,0,{"$f":"C183*VLOOKUP(C$276, stat_factors, 5, FALSE)","v":0},0,0,0,0,0,0,0,0,0,{"$f":"M183*VLOOKUP(M$276, stat_factors, 5, FALSE)","v":0},0,0,0,{"$f":"Q183*VLOOKUP(Q$276, stat_factors, 5, FALSE)","v":0},0,0]
[null,0,{"$f":"C184*VLOOKUP(C$276, stat_factors, 5, FALSE)","v":0},0,0,0,0,0,0,0,0,0,{"$f":"M184*VLOOKUP(M$276, stat_factors, 5, FALSE)","v":0},0,0,0,{"$f":"Q184*VLOOKUP(Q$276, stat_factors, 5, FALSE)","v":0},0,0]
[null,0,{"$f":"C185*VLOOKUP(C$276, stat_factors, 5, FALSE)","v":0},0,0,0,0,0,0,0,0,0,{"$f":"M185*VLOOKUP(M$276, stat_factors, 5, FALSE)","v":0},0,0,0,{"$f":"Q185*VLOOKUP(Q$276, stat_factors, 5, FALSE)","v":0},0,0]
[null,0,{"$f":"C186*VLOOKUP(C$276, stat_factors, 5, FALSE)","v":0},0,0,0,0,0,0,0,0,0,{"$f":"M186*VLOOKUP(M$276, stat_factors, 5, FALSE)","v":0},0,0,0,{"$f":"Q186*VLOOKUP(Q$276, stat_factors, 5, FALSE)","v":0},0,0]
[null,0,{"$f":"C187*VLOOKUP(C$276, stat_factors, 5, FALSE)","v":0},0,0,0,0,0,0,0,0,0,{"$f":"M187*VLOOKUP(M$276, stat_factors, 5, FALSE)","v":0},0,0,0,{"$f":"Q187*VLOOKUP(Q$276, stat_factors, 5, FALSE)","v":0},0,0]
[null,0,{"$f":"C188*VLOOKUP(C$276, stat_factors, 5, FALSE)","v":0},0,0,0,0,0,0,0,0,0,{"$f":"M188*VLOOKUP(M$276, stat_factors, 5, FALSE)","v":0},0,0,0,{"$f":"Q188*VLOOKUP(Q$276, stat_factors, 5, FALSE)","v":0},0,0]
[null,0,{"$f":"C189*VLOOKUP(C$276, stat_factors, 5, FALSE)","v":0},0,0,0,0,0,0,0,0,0,{"$f":"M189*VLOOKUP(M$276, stat_factors, 5, FALSE)","v":0},0,0,0,{"$f":"Q189*VLOOKUP(Q$276, stat_factors, 5, FALSE)","v":0},0,0]
[null,0,{"$f":"C190*VLOOKUP(C$276, stat_factors, 5, FALSE)","v":0},0,0,0,0,0,0,0,0,0,{"$f":"M190*VLOOKUP(M$276, stat_factors, 5, FALSE)","v":0},0,0,0,{"$f":"Q190*VLOOKUP(Q$276, stat_factors, 5, FALSE)","v":0},0,0]
[null,0,{"$f":"C191*VLOOKUP(C$276, stat_factors, 5, FALSE)","v":0},0,0,0,0,0,0,0,0,0,{"$f":"M191*VLOOKUP(M$276, stat_factors, 5, FALSE)","v":0},0,0,0,{"$f":"Q191*VLOOKUP(Q$276, stat_factors, 5, FALSE)","v":0},0,0]
[null,0,{"$f":"C192*VLOOKUP(C$276, stat_factors, 5, FALSE)","v":0},0,0,0,0,0,0,0,0,0,{"$f":"M192*VLOOKUP(M$276, stat_factors, 5, FALSE)","v":0},0,0,0,{"$f":"Q192*VLOOKUP(Q$276, stat_factors, 5, FALSE)","v":0},0,0]
[null,0,{"$f":"C193*VLOOKUP(C$276, stat_factors, 5, FALSE)","v":0},0,0,0,0,0,0,0,0,0,{"$f":"M193*VLOOKUP(M$276, stat_factors, 5, FALSE)","v":0},0,0,0,{"$f":"Q193*VLOOKUP(Q$276, stat_factors, 5, FALSE)","v":0},0,0]
[null,0,{"$f":"C194*VLOOKUP(C$276, stat_factors, 5, FALSE)","v":0},0,0,0,0,0,0,0,0,0,{"$f":"M194*VLOOKUP(M$276, stat_factors, 5, FALSE)","v":0},0,0,0,{"$f":"Q194*VLOOKUP(Q$276, stat_factors, 5, FALSE)","v":0},0,{"$f":"SUM(C293:R293)","v":0}]
[null,0,{"$f":"C195*VLOOKUP(C$276, stat_factors, 5, FALSE)","v":0},0,0,0,0,0,0,0,0,0,{"$f":"M195*VLOOKUP(M$276, stat_factors, 5, FALSE)","v":0},0,0,0,{"$f":"Q195*VLOOKUP(Q$276, stat_factors, 5, FALSE)","v":0},0,0]
[null,0,{"$f":"C196*VLOOKUP(C$276, stat_factors, 5, FALSE)","v":0},0,0,0,0,0,0,0,0,0,{"$f":"M196*VLOOKUP(M$276, stat_factors, 5, FALSE)","v":0},0,0,0,{"$f":"Q196*VLOOKUP(Q$276, stat_factors, 5, FALSE)","v":0},0,0]
[null,0,{"$f":"C197*VLOOKUP(C$276, stat_factors, 5, FALSE)","v":0},0,0,0,0,0,0,0,0,0,{"$f":"M197*VLOOKUP(M$276, stat_factors, 5, FALSE)","v":0},0,0,0,{"$f":"Q197*VLOOKUP(Q$276, stat_factors, 5, FALSE)","v":0},0,0]
[null,"Total",{"$f":"SUM(C277:C296)","v":0},{"$f":"SUM(D277:D296)","v":163642.85714285713},0,0,0,0,0,0,0,0,{"$f":"SUM(M277:M296)","v":0},0,0,0,2856403.8630952383,{"$f":"SUM(R277:R296)","v":0},{"$f":"SUM(S277:S295)","v":3020046.7202380956}]
[]
[]
[]
["Local GHG Inventory Tool: Community Module"]

{"sheet":"ElecTemplateReadMe","index":10,"n_rows":49,"n_cols":4,"rows_kept":49,"cut":false,"hidden":true,"merged":[[5,1,5,2],[0,1,0,2],[1,1,1,2],[2,1,2,2],[3,1,3,2],[4,1,4,2],[33,1,33,2],[8,1,8,2],[6,1,6,2],[7,1,7,2],[31,1,31,2],[32,1,32,2]]}
["Electricity Data Template Instructions","This sheet describes the file layout and data parameters needed for batch import."]
[null,"This will allow you to bypass the data entry form and upload multiple lines of data."]
[null,"Please enter your activity data on the following worksheet (DataSheet) according to the parameters below."]
[null,"Copy and paste the data from that sheet onto the \"Electricity-Data\" worksheet in the inventory tool."]
["ID#","This value is automatically supplied when adding data via the input form. You will need to update this manually when using the batch import feature. Please assign a unique value to each line of data you add."]
[null,"Values must be integers in ascending order. Gaps between numbers are permitted. For example, three lines with IDs in order of 11, 12, and 15 are ok; IDs of 11, 15, and 12 is not. The calculations will not be accurate if the ID numbers do not meet this condition."]
[null,"It is recommended that you begin with the highest previous number and increase each additional line by 1."]
["Unit Description","Use this field to describe or name the unit or group that you are entering. This field is for the user's reference only and does not impact the calculations."]
["Facility Type","If you have chosen to enter data at the facility level, please specify the type of facility from the list below. You must use the exact spelling of the facility type provided below."]
[null,"Residential Facility Type List","Commercial/Institutional Facility Type List","Industrial Facility Type List"]
[null,"Single Family Units","Education","Food"]
[null,"Apartment Buildings","Food Sales","Beverage and Tobacco Products"]
[null,"Mobile Homes","Food Service","Textile Mills"]
[null,null,"Health Care","Textile Product Mills"]
[null,"Energy Generation","Lodging","Apparel"]
[null,"Electricity Generators","Mercantile","Leather and Allied Products"]
[null,null,"Office","Wood Products"]
[null,null,"Public Assembly","Paper"]
[null,null,"Public Order and Safety","Printing and Related Support"]
[null,null,"Religious Worship","Petroleum and Coal Products"]
[null,null,"Service","Chemicals"]
[null,null,"Warehouse and Storage","Plastics and Rubber Products"]
[null,null,"Other","Nonmetallic Mineral Products"]
[null,null,"Vacant","Primary Metals"]
[null,null,null,"Fabricated Metal Products"]
[null,null,null,"Machinery"]
[null,null,null,"Computer and Electronic Products"]
[null,null,null,"Electrical Equip., Appliances, and Components"]
[null,null,null,"Transportation Equipment"]
[null,null,null,"Furniture and Related Products"]
[null,null,null,"Miscellaneous"]
["Sector","Enter one of the sectors that were specified on the Control Sheet. You must use the exact spelling of the sector that was provided on the Control Sheet in order for each entry to be included in the calculations."]
["Electricity Consumed","Please enter the electricity consumption (in kWh) for the given unit in the inventory year."]
["Electric Utility","Please enter the eGRID region that supplies electricity. Select from the regions provided on the Control Sheet, shown again below. Be sure to use the exact spelling of each region for accurate calculations."]
[]
[null,"eGRID Subregion"]
[null,"AKGD eGRID subregion","NYLI eGRID subregion"]
[null,"AKMS eGRID subregion","NYUP eGRID subregion"]
[null,"AZNM eGRID subregion","RFCE eGRID subregion"]
[null,"CAMX eGRID subregion","RFCM eGRID subregion"]
[null,"ERCT eGRID subregion","RFCW eGRID subregion"]
[null,"FRCC eGRID subregion","RMPA eGRID subregion"]
[null,"HIMS eGRID subregion","SPNO eGRID subregion"]
[null,"HIOA eGRID subregion","SPSO eGRID subregion"]
[null,"MROE eGRID subregion","SRMV eGRID subregion"]
[null,"MROW eGRID subregion","SRMW eGRID subregion"]
[null,"NEWE eGRID subregion","SRSO eGRID subregion"]
[null,"NWPP eGRID subregion","SRTV eGRID subregion"]
[null,"NYCW eGRID subregion","SRVC eGRID subregion"]

{"sheet":"Mobile-Entry","index":11,"n_rows":42,"n_cols":8,"rows_kept":42,"cut":false,"hidden":false,"merged":[[27,3,28,6],[29,4,29,5],[29,3,30,3],[41,0,41,6],[33,1,34,2]]}
["Mobile Units - Entry"]
["Data Entry & Calculations"]
[]
[]
[]
[]
[]
[]
[]
[]
[]
[]
[]
[]
[]
["1a)","Describe the vehicle(s) you are entering"]
[null,"ID#","Vehicle or vehicle group description","Sector"]
[0,{"$f":"MobCurrentID","v":23},"Marine Vessels (Diesel)  - Rota","Commercial/Institutional"]
[]
[]
[null,"Vehicle Year","Vehicle Type","Vehicle Model (optional)","Fuel type"]
[null,null,"Ship or Boat",null,"Diesel"]
[]
["1b)",{"$f":"\"Enter the activity data for the year \"&MyYear","v":"Enter the activity data for the year 2022"}]
[]
[null,null,"Entries"]
[null,{"$f":"\"Fuel consumed (\"&IF(ISERROR(HLOOKUP(mob_entry_fuel,'Background Controls'!26:27,2,FALSE)),\"\",HLOOKUP(mob_entry_fuel,'Background Controls'!26:27,2,FALSE))&\"):\"","v":"Fuel consumed (Gallons):"},26192]
[null,"Vehicle miles traveled (VMT)*:",null,"* Helpful Hint: If you do not know the VMT for this entry, you can multiply the fuel consumed by the MPG of the vehicle/vehicle group. Use your own efficiency data or see the table below for average MPG by vehicle type and fuel. → Vehicle Miles = Gallons × Miles/Gallon"]
[]
[null,null,null,"Vehicle Type","Average MPG"]
[null,null,null,null,"Gasoline & Other Fuels","Diesel & Biodiesel"]
[null,null,null,"Passenger Car",24.1,32.4]
[null,null,null,"Light Truck",18.5,22.1,null,true]
["2)","Once you have completed data entry, hit the button below to update the calculations.",null,"Heavy-Duty Vehicle",10.130000000000001,12.96]
[null,null,null,"Motorcycle",50,"N/A"]
[]
[]
[]
[]
[]
[]
["Local GHG Inventory Tool: Community Module"]

{"sheet":"MobTemplateReadMe","index":12,"n_rows":66,"n_cols":3,"rows_kept":66,"cut":false,"hidden":true,"merged":[[5,1,5,2],[9,1,9,2],[10,1,10,2],[24,1,24,2],[26,1,26,2],[0,1,0,2],[1,1,1,2],[2,1,2,2],[3,1,3,2],[4,1,4,2],[65,1,65,2],[6,1,6,2],[7,1,7,2],[8,1,8,2],[25,1,25,2],[64,1,64,2]]}
["Mobile Data Template Instructions","This sheet describes the file layout and data parameters needed for batch import."]
[null,"This will allow you to bypass the data entry form and upload multiple lines of data."]
[null,"Please enter your activity data on the following worksheet (DataSheet) according to the parameters below."]
[null,"Copy and paste the data from that sheet onto the \"Mobile-Data\" worksheet in the inventory tool."]
["ID#","This value is automatically supplied when adding data via the input form. You will need to update this manually when using the batch import feature. Please assign a unique value to each line of data you add."]
[null,"Values must be integers in ascending order. Gaps between numbers are permitted. For example, three lines with IDs in order of 11, 12, and 15 are ok; IDs of 11, 15, and 12 is not. The calculations will not be accurate if the ID numbers do not meet this condition."]
[null,"It is recommended that you begin with the highest previous number and increase each additional line by 1."]
["Vehicle or Vehicle Group Descriptions","Use this field to describe or name the vehicle or group of vehicles that you are entering. This field is for the user's reference only and does not impact the calculations."]
["Sector","Enter one of the sectors that were specified on the Control Sheet. You must use the exact spelling of the sector that was provided on the Control Sheet in order for each entry to be included in the calculations."]
["Vehicle Year","Enter the model year of the vehicle you are entering."]
["Vehicle Type","Please enter the vehicle type from the list below in this column. Be sure to type the name exactly as it appears below."]
[]
[null,"Vehicle Type"]
[null,"Passenger Car"]
[null,"Light Truck (Vans, Pickup Trucks, SUVs)"]
[null,"Heavy-Duty Vehicle"]
[null,"Motorcycle"]
[null,"Agricultural Equipment"]
[null,"Construction Equipment"]
[null,"Utility and Recreational Equipment"]
[null,"Aircraft"]
[null,"Ship or Boat"]
[null,"Locomotive"]
[]
["Vehicle Model","Use this column to enter the vehicle model. This field is optional and for user reference only."]
["Fuel Type","Please enter the fuel type in this column. You must select the fuel type from the list of fuels below, and only select fuels appropriate for the vehicle type. Any other fuels will not be included in the calculations. "]
[null,"The consumption amounts must also be in the units listed below."]
[]
["Vehicle","Fuel Type","Unit"]
["Passenger Car: ","Gasoline","gallons"]
[null,"Diesel","gallons"]
[null,"Biodiesel (B5)","gallons"]
[null,"Biodiesel (B20)","gallons"]
[null,"Ethanol (E5)","gallons"]
[null,"CNG","G.G.E."]
[null,"LPG","gallons"]
["Light Truck (Vans, Pickup Trucks, SUVs): ","Gasoline","gallons"]
[null,"Diesel","gallons"]
[null,"Biodiesel (B5)","gallons"]
[null,"Biodiesel (B20)","gallons"]
[null,"Ethanol (E5)","gallons"]
[null,"CNG","G.G.E."]
[null,"LPG","gallons"]
["Heavy-Duty Vehicle: ","Gasoline","gallons"]
[null,"Diesel","gallons"]
[null,"Biodiesel (B5)","gallons"]
[null,"Biodiesel (B20)","gallons"]
[null,"Ethanol (E5)","gallons"]
[null,"CNG","G.G.E."]
[null,"LNG","gallons"]
[null,"LPG","gallons"]
["Motorcycle: ","Gasoline","gallons"]
["Agricultural Equipment: ","Gasoline","gallons"]
[null,"Diesel","gallons"]
["Construction Equipment: ","Gasoline","gallons"]
[null,"Diesel","gallons"]
["Utility and Recreational Equipment: ","Gasoline","gallons"]
[null,"Diesel","gallons"]
["Aircraft: ","Jet Fuel","gallons"]
[null,"Aviation Gasoline","gallons"]
["Ship or Boat: ","Gasoline","gallons"]
[null,"Diesel","gallons"]
[null,"Residual Fuel","gallons"]
["Locomotive: ","Diesel","gallons"]
["Fuel Consumed","Please enter your fuel consumption for the inventory year here."]
["Vehicle Miles Traveled (VMT)","Please enter the miles traveled by the vehicle during the inventory year here. "]

{"sheet":"Mobile-Data","index":13,"n_rows":30,"n_cols":9,"rows_kept":30,"cut":false,"hidden":false,"merged":[]}
["Mobile Units - Data"]
[]
[]
[]
["Linker Row- DO NOT MODIFY"]
["ID#","Vehicle or vehicle group description","Sector","Vehicle Year","Vehicle Type","Vehicle Model (optional)","Fuel type","Fuel consumption","VMT"]
[{"$f":"MAX(A9:A65531)+1","v":23},{"$f":"mob_entry_description","v":"Marine Vessels (Diesel)  - Rota"},{"$f":"mob_entry_dept","v":"Commercial/Institutional"},{"$f":"mob_entry_vehyear","v":0},{"$f":"mob_entry_vehtype","v":"Ship or Boat"},{"$f":"mob_entry_vehmodel","v":0},{"$f":"mob_entry_fuel","v":"Diesel"},{"$f":"mob_entry_fuelconsumption","v":26192},{"$f":"mob_entry_vmt","v":0}]
["Saved Data"]
[1,"Passenger Car (Gasoline) - Saipan","Commercial/Institutional",0,"Passenger Car",0,"Gasoline",3759980,90615518]
[2,"Light Truck (Gasoline) - Saipan","Commercial/Institutional",0,"Light Truck (Vans, Pickup Trucks, SUVs)",0,"Gasoline",5964119,110336201.5]
[3,"Heavy-Duty Vehicle (Gasoline) - Saipan","Commercial/Institutional",0,"Heavy-Duty Vehicle",0,"Gasoline",46502,471065.26]
[4,"Motorcycle (Gasoline) - Saipan","Commercial/Institutional",0,"Motorcycle",0,"Gasoline",43429,2171450]
[5,"Construction Equipment (Gasoline) - Saipan","Commercial/Institutional",0,"Construction Equipment",0,"Gasoline",13277,134496.01]
[6,"Utility and Recreational Equipment (Gasoline) - Saipan","Commercial/Institutional",0,"Utility and Recreational Equipment",0,"Gasoline",7384,74799.920000000013]
[7,"Light Truck (Diesel) - Saipan","Commercial/Institutional",0,"Light Truck (Vans, Pickup Trucks, SUVs)",0,"Diesel",468060,10344126]
[8,"Heavy-Duty Vehicle (Diesel) - Saipan","Commercial/Institutional",0,"Heavy-Duty Vehicle",0,"Diesel",2623048,33994702.080000006]
[9,"Construction Equipment (Diesel) - Saipan","Commercial/Institutional",0,"Construction Equipment",0,"Diesel",2776979,35989647.840000004]
[10,"Utility and Recreational Equipment (Diesel) - Saipan","Commercial/Institutional",0,"Utility and Recreational Equipment",0,"Diesel",377552,4893073.92]
[11,"Marine Vessels (Gasoline) - Saipan","Commercial/Institutional",0,"Ship or Boat",0,"Gasoline",170883,0]
[12,"Marine Vessels (Diesel) - Saipan","Commercial/Institutional",0,"Ship or Boat",0,"Diesel",98737,0]
[13,"Assumed Gasoline for Transport - Tinian","Commercial/Institutional",0,"Light Truck (Vans, Pickup Trucks, SUVs)",0,"Gasoline",471393,8720770.5]
[14,"Assumed Diesel for Transport - Tinian","Commercial/Institutional",0,"Light Truck (Vans, Pickup Trucks, SUVs)",0,"Diesel",354308,7830206.8000000007]
[15,"Passenger Car (Gasoline)  - Rota","Commercial/Institutional",0,"Passenger Car",0,"Gasoline",150850,3635485]
[16,"Light Truck (Gasoline)  - Rota","Commercial/Institutional",0,"Light Truck (Vans, Pickup Trucks, SUVs)",0,"Gasoline",906238,16765403]
[17,"Heavy-Duty Vehicle (Gasoline)  - Rota","Commercial/Institutional",0,"Heavy-Duty Vehicle",0,"Gasoline",3581,36275.530000000006]
[18,"Motorcycle (Gasoline)  - Rota","Commercial/Institutional",0,"Motorcycle",0,"Gasoline",3284,164200]
[19,"Marine Vessels (Gasoline)  - Rota","Commercial/Institutional",0,"Ship or Boat",0,"Gasoline",40999,0]
[20,"Light Truck (Diesel)  - Rota","Commercial/Institutional",0,"Light Truck (Vans, Pickup Trucks, SUVs)",0,"Diesel",78634,1737811.4000000001]
[21,"Heavy-Duty Vehicle (Diesel)  - Rota","Commercial/Institutional",0,"Heavy-Duty Vehicle",0,"Diesel",223307,2894058.72]
[22,"Marine Vessels (Diesel)  - Rota","Commercial/Institutional",0,"Ship or Boat",0,"Diesel",26192,0]

{"sheet":"Mobile-Detail Calcs","index":14,"n_rows":275,"n_cols":27,"rows_kept":275,"cut":false,"hidden":false,"merged":[[161,2,161,4],[274,0,274,15]]}
["Mobile Combustion - Calculation"]
["Jump to…"]
["Activity Data"]
["Fuel use by sector and fuel type"]
["Energy use by sector and fuel type"]
["CO2 Calculations"]
["Gross CO2"]
["Biogenic CO2"]
["Net CO2"]
["Non-CO2 Calculations"]
["Highway Vehicles"]
["Alternate Fuel Vehicles (AFVs)"]
["Non-Highway Vehicles"]
["Total non-CO2 emissions, current sector"]
["Non-CO2 emissions summary, all sectors"]
[]
["Activity Data"]
[]
["Fuel Use by Sector and Fuel Type"]
["This table summarizes fuel consumption by sector. These are the activity data used to calculate CO2 emissions."]
[null,null,"Gasoline","Diesel","Biodiesel (B5)","Biodiesel (B20)","Ethanol (E85)","CNG","LNG","LPG","Residual Fuel","Jet Fuel","Aviation Gasoline"]
[null,"Units","Gallons","Gallons","Gallons","Gallons","Gallons","G.G.E.","Gallons","Gallons","Gallons","Gallons","Gallons"]
["Dstart",{"$f":"'Background Controls'!I5","v":"Residential"},{"$f":"SUMIFS('Mobile-Data'!$H$9:$H$1048576,'Mobile-Data'!$C$9:$C$1048576,'Mobile-Detail Calcs'!$B23,'Mobile-Data'!$G$9:$G$1048576,'Mobile-Detail Calcs'!C$21)","v":0},{"$f":"SUMIFS('Mobile-Data'!$H$9:$H$1048576,'Mobile-Data'!$C$9:$C$1048576,'Mobile-Detail Calcs'!$B23,'Mobile-Data'!$G$9:$G$1048576,'Mobile-Detail Calcs'!D$21)","v":0},{"$f":"SUMIFS('Mobile-Data'!$H$9:$H$1048576,'Mobile-Data'!$C$9:$C$1048576,'Mobile-Detail Calcs'!$B23,'Mobile-Data'!$G$9:$G$1048576,'Mobile-Detail Calcs'!E$21)","v":0},{"$f":"SUMIFS('Mobile-Data'!$H$9:$H$1048576,'Mobile-Data'!$C$9:$C$1048576,'Mobile-Detail Calcs'!$B23,'Mobile-Data'!$G$9:$G$1048576,'Mobile-Detail Calcs'!F$21)","v":0},{"$f":"SUMIFS('Mobile-Data'!$H$9:$H$1048576,'Mobile-Data'!$C$9:$C$1048576,'Mobile-Detail Calcs'!$B23,'Mobile-Data'!$G$9:$G$1048576,'Mobile-Detail Calcs'!G$21)","v":0},{"$f":"SUMIFS('Mobile-Data'!$H$9:$H$1048576,'Mobile-Data'!$C$9:$C$1048576,'Mobile-Detail Calcs'!$B23,'Mobile-Data'!$G$9:$G$1048576,'Mobile-Detail Calcs'!H$21)","v":0},{"$f":"SUMIFS('Mobile-Data'!$H$9:$H$1048576,'Mobile-Data'!$C$9:$C$1048576,'Mobile-Detail Calcs'!$B23,'Mobile-Data'!$G$9:$G$1048576,'Mobile-Detail Calcs'!I$21)","v":0},{"$f":"SUMIFS('Mobile-Data'!$H$9:$H$1048576,'Mobile-Data'!$C$9:$C$1048576,'Mobile-Detail Calcs'!$B23,'Mobile-Data'!$G$9:$G$1048576,'Mobile-Detail Calcs'!J$21)","v":0},{"$f":"SUMIFS('Mobile-Data'!$H$9:$H$1048576,'Mobile-Data'!$C$9:$C$1048576,'Mobile-Detail Calcs'!$B23,'Mobile-Data'!$G$9:$G$1048576,'Mobile-Detail Calcs'!K$21)","v":0},{"$f":"SUMIFS('Mobile-Data'!$H$9:$H$1048576,'Mobile-Data'!$C$9:$C$1048576,'Mobile-Detail Calcs'!$B23,'Mobile-Data'!$G$9:$G$1048576,'Mobile-Detail Calcs'!L$21)","v":0},{"$f":"SUMIFS('Mobile-Data'!$H$9:$H$1048576,'Mobile-Data'!$C$9:$C$1048576,'Mobile-Detail Calcs'!$B23,'Mobile-Data'!$G$9:$G$1048576,'Mobile-Detail Calcs'!M$21)","v":0}]
[null,{"$f":"'Background Controls'!I6","v":"Commercial/Institutional"},{"$f":"SUMIFS('Mobile-Data'!$H$9:$H$1048576,'Mobile-Data'!$C$9:$C$1048576,'Mobile-Detail Calcs'!$B24,'Mobile-Data'!$G$9:$G$1048576,'Mobile-Detail Calcs'!C$21)","v":11581919},{"$f":"SUMIFS('Mobile-Data'!$H$9:$H$1048576,'Mobile-Data'!$C$9:$C$1048576,'Mobile-Detail Calcs'!$B24,'Mobile-Data'!$G$9:$G$1048576,'Mobile-Detail Calcs'!D$21)","v":7026817},{"$f":"SUMIFS('Mobile-Data'!$H$9:$H$1048576,'Mobile-Data'!$C$9:$C$1048576,'Mobile-Detail Calcs'!$B24,'Mobile-Data'!$G$9:$G$1048576,'Mobile-Detail Calcs'!E$21)","v":0},{"$f":"SUMIFS('Mobile-Data'!$H$9:$H$1048576,'Mobile-Data'!$C$9:$C$1048576,'Mobile-Detail Calcs'!$B24,'Mobile-Data'!$G$9:$G$1048576,'Mobile-Detail Calcs'!F$21)","v":0},{"$f":"SUMIFS('Mobile-Data'!$H$9:$H$1048576,'Mobile-Data'!$C$9:$C$1048576,'Mobile-Detail Calcs'!$B24,'Mobile-Data'!$G$9:$G$1048576,'Mobile-Detail Calcs'!G$21)","v":0},{"$f":"SUMIFS('Mobile-Data'!$H$9:$H$1048576,'Mobile-Data'!$C$9:$C$1048576,'Mobile-Detail Calcs'!$B24,'Mobile-Data'!$G$9:$G$1048576,'Mobile-Detail Calcs'!H$21)","v":0},{"$f":"SUMIFS('Mobile-Data'!$H$9:$H$1048576,'Mobile-Data'!$C$9:$C$1048576,'Mobile-Detail Calcs'!$B24,'Mobile-Data'!$G$9:$G$1048576,'Mobile-Detail Calcs'!I$21)","v":0},{"$f":"SUMIFS('Mobile-Data'!$H$9:$H$1048576,'Mobile-Data'!$C$9:$C$1048576,'Mobile-Detail Calcs'!$B24,'Mobile-Data'!$G$9:$G$1048576,'Mobile-Detail Calcs'!J$21)","v":0},{"$f":"SUMIFS('Mobile-Data'!$H$9:$H$1048576,'Mobile-Data'!$C$9:$C$1048576,'Mobile-Detail Calcs'!$B24,'Mobile-Data'!$G$9:$G$1048576,'Mobile-Detail Calcs'!K$21)","v":0},{"$f":"SUMIFS('Mobile-Data'!$H$9:$H$1048576,'Mobile-Data'!$C$9:$C$1048576,'Mobile-Detail Calcs'!$B24,'Mobile-Data'!$G$9:$G$1048576,'Mobile-Detail Calcs'!L$21)","v":0},{"$f":"SUMIFS('Mobile-Data'!$H$9:$H$1048576,'Mobile-Data'!$C$9:$C$1048576,'Mobile-Detail Calcs'!$B24,'Mobile-Data'!$G$9:$G$1048576,'Mobile-Detail Calcs'!M$21)","v":0}]
[null,{"$f":"'Background Controls'!I7","v":"Industrial"},{"$f":"SUMIFS('Mobile-Data'!$H$9:$H$1048576,'Mobile-Data'!$C$9:$C$1048576,'Mobile-Detail Calcs'!$B25,'Mobile-Data'!$G$9:$G$1048576,'Mobile-Detail Calcs'!C$21)","v":0},{"$f":"SUMIFS('Mobile-Data'!$H$9:$H$1048576,'Mobile-Data'!$C$9:$C$1048576,'Mobile-Detail Calcs'!$B25,'Mobile-Data'!$G$9:$G$1048576,'Mobile-Detail Calcs'!D$21)","v":0},{"$f":"SUMIFS('Mobile-Data'!$H$9:$H$1048576,'Mobile-Data'!$C$9:$C$1048576,'Mobile-Detail Calcs'!$B25,'Mobile-Data'!$G$9:$G$1048576,'Mobile-Detail Calcs'!E$21)","v":0},{"$f":"SUMIFS('Mobile-Data'!$H$9:$H$1048576,'Mobile-Data'!$C$9:$C$1048576,'Mobile-Detail Calcs'!$B25,'Mobile-Data'!$G$9:$G$1048576,'Mobile-Detail Calcs'!F$21)","v":0},{"$f":"SUMIFS('Mobile-Data'!$H$9:$H$1048576,'Mobile-Data'!$C$9:$C$1048576,'Mobile-Detail Calcs'!$B25,'Mobile-Data'!$G$9:$G$1048576,'Mobile-Detail Calcs'!G$21)","v":0},{"$f":"SUMIFS('Mobile-Data'!$H$9:$H$1048576,'Mobile-Data'!$C$9:$C$1048576,'Mobile-Detail Calcs'!$B25,'Mobile-Data'!$G$9:$G$1048576,'Mobile-Detail Calcs'!H$21)","v":0},{"$f":"SUMIFS('Mobile-Data'!$H$9:$H$1048576,'Mobile-Data'!$C$9:$C$1048576,'Mobile-Detail Calcs'!$B25,'Mobile-Data'!$G$9:$G$1048576,'Mobile-Detail Calcs'!I$21)","v":0},{"$f":"SUMIFS('Mobile-Data'!$H$9:$H$1048576,'Mobile-Data'!$C$9:$C$1048576,'Mobile-Detail Calcs'!$B25,'Mobile-Data'!$G$9:$G$1048576,'Mobile-Detail Calcs'!J$21)","v":0},{"$f":"SUMIFS('Mobile-Data'!$H$9:$H$1048576,'Mobile-Data'!$C$9:$C$1048576,'Mobile-Detail Calcs'!$B25,'Mobile-Data'!$G$9:$G$1048576,'Mobile-Detail Calcs'!K$21)","v":0},{"$f":"SUMIFS('Mobile-Data'!$H$9:$H$1048576,'Mobile-Data'!$C$9:$C$1048576,'Mobile-Detail Calcs'!$B25,'Mobile-Data'!$G$9:$G$1048576,'Mobile-Detail Calcs'!L$21)","v":0},{"$f":"SUMIFS('Mobile-Data'!$H$9:$H$1048576,'Mobile-Data'!$C$9:$C$1048576,'Mobile-Detail Calcs'!$B25,'Mobile-Data'!$G$9:$G$1048576,'Mobile-Detail Calcs'!M$21)","v":0}]
[null,{"$f":"'Background Controls'!I8","v":"Energy Generation"},{"$f":"SUMIFS('Mobile-Data'!$H$9:$H$1048576,'Mobile-Data'!$C$9:$C$1048576,'Mobile-Detail Calcs'!$B26,'Mobile-Data'!$G$9:$G$1048576,'Mobile-Detail Calcs'!C$21)","v":0},{"$f":"SUMIFS('Mobile-Data'!$H$9:$H$1048576,'Mobile-Data'!$C$9:$C$1048576,'Mobile-Detail Calcs'!$B26,'Mobile-Data'!$G$9:$G$1048576,'Mobile-Detail Calcs'!D$21)","v":0},{"$f":"SUMIFS('Mobile-Data'!$H$9:$H$1048576,'Mobile-Data'!$C$9:$C$1048576,'Mobile-Detail Calcs'!$B26,'Mobile-Data'!$G$9:$G$1048576,'Mobile-Detail Calcs'!E$21)","v":0},{"$f":"SUMIFS('Mobile-Data'!$H$9:$H$1048576,'Mobile-Data'!$C$9:$C$1048576,'Mobile-Detail Calcs'!$B26,'Mobile-Data'!$G$9:$G$1048576,'Mobile-Detail Calcs'!F$21)","v":0},{"$f":"SUMIFS('Mobile-Data'!$H$9:$H$1048576,'Mobile-Data'!$C$9:$C$1048576,'Mobile-Detail Calcs'!$B26,'Mobile-Data'!$G$9:$G$1048576,'Mobile-Detail Calcs'!G$21)","v":0},{"$f":"SUMIFS('Mobile-Data'!$H$9:$H$1048576,'Mobile-Data'!$C$9:$C$1048576,'Mobile-Detail Calcs'!$B26,'Mobile-Data'!$G$9:$G$1048576,'Mobile-Detail Calcs'!H$21)","v":0},{"$f":"SUMIFS('Mobile-Data'!$H$9:$H$1048576,'Mobile-Data'!$C$9:$C$1048576,'Mobile-Detail Calcs'!$B26,'Mobile-Data'!$G$9:$G$1048576,'Mobile-Detail Calcs'!I$21)","v":0},{"$f":"SUMIFS('Mobile-Data'!$H$9:$H$1048576,'Mobile-Data'!$C$9:$C$1048576,'Mobile-Detail Calcs'!$B26,'Mobile-Data'!$G$9:$G$1048576,'Mobile-Detail Calcs'!J$21)","v":0},{"$f":"SUMIFS('Mobile-Data'!$H$9:$H$1048576,'Mobile-Data'!$C$9:$C$1048576,'Mobile-Detail Calcs'!$B26,'Mobile-Data'!$G$9:$G$1048576,'Mobile-Detail Calcs'!K$21)","v":0},{"$f":"SUMIFS('Mobile-Data'!$H$9:$H$1048576,'Mobile-Data'!$C$9:$C$1048576,'Mobile-Detail Calcs'!$B26,'Mobile-Data'!$G$9:$G$1048576,'Mobile-Detail Calcs'!L$21)","v":0},{"$f":"SUMIFS('Mobile-Data'!$H$9:$H$1048576,'Mobile-Data'!$C$9:$C$1048576,'Mobile-Detail Calcs'!$B26,'Mobile-Data'!$G$9:$G$1048576,'Mobile-Detail Calcs'!M$21)","v":0}]
[null,{"$f":"'Background Controls'!I9","v":0},{"$f":"SUMIFS('Mobile-Data'!$H$9:$H$1048576,'Mobile-Data'!$C$9:$C$1048576,'Mobile-Detail Calcs'!$B27,'Mobile-Data'!$G$9:$G$1048576,'Mobile-Detail Calcs'!C$21)","v":0},{"$f":"SUMIFS('Mobile-Data'!$H$9:$H$1048576,'Mobile-Data'!$C$9:$C$1048576,'Mobile-Detail Calcs'!$B27,'Mobile-Data'!$G$9:$G$1048576,'Mobile-Detail Calcs'!D$21)","v":0},{"$f":"SUMIFS('Mobile-Data'!$H$9:$H$1048576,'Mobile-Data'!$C$9:$C$1048576,'Mobile-Detail Calcs'!$B27,'Mobile-Data'!$G$9:$G$1048576,'Mobile-Detail Calcs'!E$21)","v":0},{"$f":"SUMIFS('Mobile-Data'!$H$9:$H$1048576,'Mobile-Data'!$C$9:$C$1048576,'Mobile-Detail Calcs'!$B27,'Mobile-Data'!$G$9:$G$1048576,'Mobile-Detail Calcs'!F$21)","v":0},{"$f":"SUMIFS('Mobile-Data'!$H$9:$H$1048576,'Mobile-Data'!$C$9:$C$1048576,'Mobile-Detail Calcs'!$B27,'Mobile-Data'!$G$9:$G$1048576,'Mobile-Detail Calcs'!G$21)","v":0},{"$f":"SUMIFS('Mobile-Data'!$H$9:$H$1048576,'Mobile-Data'!$C$9:$C$1048576,'Mobile-Detail Calcs'!$B27,'Mobile-Data'!$G$9:$G$1048576,'Mobile-Detail Calcs'!H$21)","v":0},{"$f":"SUMIFS('Mobile-Data'!$H$9:$H$1048576,'Mobile-Data'!$C$9:$C$1048576,'Mobile-Detail Calcs'!$B27,'Mobile-Data'!$G$9:$G$1048576,'Mobile-Detail Calcs'!I$21)","v":0},{"$f":"SUMIFS('Mobile-Data'!$H$9:$H$1048576,'Mobile-Data'!$C$9:$C$1048576,'Mobile-Detail Calcs'!$B27,'Mobile-Data'!$G$9:$G$1048576,'Mobile-Detail Calcs'!J$21)","v":0},{"$f":"SUMIFS('Mobile-Data'!$H$9:$H$1048576,'Mobile-Data'!$C$9:$C$1048576,'Mobile-Detail Calcs'!$B27,'Mobile-Data'!$G$9:$G$1048576,'Mobile-Detail Calcs'!K$21)","v":0},{"$f":"SUMIFS('Mobile-Data'!$H$9:$H$1048576,'Mobile-Data'!$C$9:$C$1048576,'Mobile-Detail Calcs'!$B27,'Mobile-Data'!$G$9:$G$1048576,'Mobile-Detail Calcs'!L$21)","v":0},{"$f":"SUMIFS('Mobile-Data'!$H$9:$H$1048576,'Mobile-Data'!$C$9:$C$1048576,'Mobile-Detail Calcs'!$B27,'Mobile-Data'!$G$9:$G$1048576,'Mobile-Detail Calcs'!M$21)","v":0}]
[null,{"$f":"'Background Controls'!I10","v":0},{"$f":"SUMIFS('Mobile-Data'!$H$9:$H$1048576,'Mobile-Data'!$C$9:$C$1048576,'Mobile-Detail Calcs'!$B28,'Mobile-Data'!$G$9:$G$1048576,'Mobile-Detail Calcs'!C$21)","v":0},{"$f":"SUMIFS('Mobile-Data'!$H$9:$H$1048576,'Mobile-Data'!$C$9:$C$1048576,'Mobile-Detail Calcs'!$B28,'Mobile-Data'!$G$9:$G$1048576,'Mobile-Detail Calcs'!D$21)","v":0},{"$f":"SUMIFS('Mobile-Data'!$H$9:$H$1048576,'Mobile-Data'!$C$9:$C$1048576,'Mobile-Detail Calcs'!$B28,'Mobile-Data'!$G$9:$G$1048576,'Mobile-Detail Calcs'!E$21)","v":0},{"$f":"SUMIFS('Mobile-Data'!$H$9:$H$1048576,'Mobile-Data'!$C$9:$C$1048576,'Mobile-Detail Calcs'!$B28,'Mobile-Data'!$G$9:$G$1048576,'Mobile-Detail Calcs'!F$21)","v":0},{"$f":"SUMIFS('Mobile-Data'!$H$9:$H$1048576,'Mobile-Data'!$C$9:$C$1048576,'Mobile-Detail Calcs'!$B28,'Mobile-Data'!$G$9:$G$1048576,'Mobile-Detail Calcs'!G$21)","v":0},{"$f":"SUMIFS('Mobile-Data'!$H$9:$H$1048576,'Mobile-Data'!$C$9:$C$1048576,'Mobile-Detail Calcs'!$B28,'Mobile-Data'!$G$9:$G$1048576,'Mobile-Detail Calcs'!H$21)","v":0},{"$f":"SUMIFS('Mobile-Data'!$H$9:$H$1048576,'Mobile-Data'!$C$9:$C$1048576,'Mobile-Detail Calcs'!$B28,'Mobile-Data'!$G$9:$G$1048576,'Mobile-Detail Calcs'!I$21)","v":0},{"$f":"SUMIFS('Mobile-Data'!$H$9:$H$1048576,'Mobile-Data'!$C$9:$C$1048576,'Mobile-Detail Calcs'!$B28,'Mobile-Data'!$G$9:$G$1048576,'Mobile-Detail Calcs'!J$21)","v":0},{"$f":"SUMIFS('Mobile-Data'!$H$9:$H$1048576,'Mobile-Data'!$C$9:$C$1048576,'Mobile-Detail Calcs'!$B28,'Mobile-Data'!$G$9:$G$1048576,'Mobile-Detail Calcs'!K$21)","v":0},{"$f":"SUMIFS('Mobile-Data'!$H$9:$H$1048576,'Mobile-Data'!$C$9:$C$1048576,'Mobile-Detail Calcs'!$B28,'Mobile-Data'!$G$9:$G$1048576,'Mobile-Detail Calcs'!L$21)","v":0},{"$f":"SUMIFS('Mobile-Data'!$H$9:$H$1048576,'Mobile-Data'!$C$9:$C$1048576,'Mobile-Detail Calcs'!$B28,'Mobile-Data'!$G$9:$G$1048576,'Mobile-Detail Calcs'!M$21)","v":0}]
[null,{"$f":"'Background Controls'!I11","v":0},{"$f":"SUMIFS('Mobile-Data'!$H$9:$H$1048576,'Mobile-Data'!$C$9:$C$1048576,'Mobile-Detail Calcs'!$B29,'Mobile-Data'!$G$9:$G$1048576,'Mobile-Detail Calcs'!C$21)","v":0},{"$f":"SUMIFS('Mobile-Data'!$H$9:$H$1048576,'Mobile-Data'!$C$9:$C$1048576,'Mobile-Detail Calcs'!$B29,'Mobile-Data'!$G$9:$G$1048576,'Mobile-Detail Calcs'!D$21)","v":0},{"$f":"SUMIFS('Mobile-Data'!$H$9:$H$1048576,'Mobile-Data'!$C$9:$C$1048576,'Mobile-Detail Calcs'!$B29,'Mobile-Data'!$G$9:$G$1048576,'Mobile-Detail Calcs'!E$21)","v":0},{"$f":"SUMIFS('Mobile-Data'!$H$9:$H$1048576,'Mobile-Data'!$C$9:$C$1048576,'Mobile-Detail Calcs'!$B29,'Mobile-Data'!$G$9:$G$1048576,'Mobile-Detail Calcs'!F$21)","v":0},{"$f":"SUMIFS('Mobile-Data'!$H$9:$H$1048576,'Mobile-Data'!$C$9:$C$1048576,'Mobile-Detail Calcs'!$B29,'Mobile-Data'!$G$9:$G$1048576,'Mobile-Detail Calcs'!G$21)","v":0},{"$f":"SUMIFS('Mobile-Data'!$H$9:$H$1048576,'Mobile-Data'!$C$9:$C$1048576,'Mobile-Detail Calcs'!$B29,'Mobile-Data'!$G$9:$G$1048576,'Mobile-Detail Calcs'!H$21)","v":0},{"$f":"SUMIFS('Mobile-Data'!$H$9:$H$1048576,'Mobile-Data'!$C$9:$C$1048576,'Mobile-Detail Calcs'!$B29,'Mobile-Data'!$G$9:$G$1048576,'Mobile-Detail Calcs'!I$21)","v":0},{"$f":"SUMIFS('Mobile-Data'!$H$9:$H$1048576,'Mobile-Data'!$C$9:$C$1048576,'Mobile-Detail Calcs'!$B29,'Mobile-Data'!$G$9:$G$1048576,'Mobile-Detail Calcs'!J$21)","v":0},{"$f":"SUMIFS('Mobile-Data'!$H$9:$H$1048576,'Mobile-Data'!$C$9:$C$1048576,'Mobile-Detail Calcs'!$B29,'Mobile-Data'!$G$9:$G$1048576,'Mobile-Detail Calcs'!K$21)","v":0},{"$f":"SUMIFS('Mobile-Data'!$H$9:$H$1048576,'Mobile-Data'!$C$9:$C$1048576,'Mobile-Detail Calcs'!$B29,'Mobile-Data'!$G$9:$G$1048576,'Mobile-Detail Calcs'!L$21)","v":0},{"$f":"SUMIFS('Mobile-Data'!$H$9:$H$1048576,'Mobile-Data'!$C$9:$C$1048576,'Mobile-Detail Calcs'!$B29,'Mobile-Data'!$G$9:$G$1048576,'Mobile-Detail Calcs'!M$21)","v":0}]
[null,{"$f":"'Background Controls'!I12","v":0},{"$f":"SUMIFS('Mobile-Data'!$H$9:$H$1048576,'Mobile-Data'!$C$9:$C$1048576,'Mobile-Detail Calcs'!$B30,'Mobile-Data'!$G$9:$G$1048576,'Mobile-Detail Calcs'!C$21)","v":0},{"$f":"SUMIFS('Mobile-Data'!$H$9:$H$1048576,'Mobile-Data'!$C$9:$C$1048576,'Mobile-Detail Calcs'!$B30,'Mobile-Data'!$G$9:$G$1048576,'Mobile-Detail Calcs'!D$21)","v":0},{"$f":"SUMIFS('Mobile-Data'!$H$9:$H$1048576,'Mobile-Data'!$C$9:$C$1048576,'Mobile-Detail Calcs'!$B30,'Mobile-Data'!$G$9:$G$1048576,'Mobile-Detail Calcs'!E$21)","v":0},{"$f":"SUMIFS('Mobile-Data'!$H$9:$H$1048576,'Mobile-Data'!$C$9:$C$1048576,'Mobile-Detail Calcs'!$B30,'Mobile-Data'!$G$9:$G$1048576,'Mobile-Detail Calcs'!F$21)","v":0},{"$f":"SUMIFS('Mobile-Data'!$H$9:$H$1048576,'Mobile-Data'!$C$9:$C$1048576,'Mobile-Detail Calcs'!$B30,'Mobile-Data'!$G$9:$G$1048576,'Mobile-Detail Calcs'!G$21)","v":0},{"$f":"SUMIFS('Mobile-Data'!$H$9:$H$1048576,'Mobile-Data'!$C$9:$C$1048576,'Mobile-Detail Calcs'!$B30,'Mobile-Data'!$G$9:$G$1048576,'Mobile-Detail Calcs'!H$21)","v":0},{"$f":"SUMIFS('Mobile-Data'!$H$9:$H$1048576,'Mobile-Data'!$C$9:$C$1048576,'Mobile-Detail Calcs'!$B30,'Mobile-Data'!$G$9:$G$1048576,'Mobile-Detail Calcs'!I$21)","v":0},{"$f":"SUMIFS('Mobile-Data'!$H$9:$H$1048576,'Mobile-Data'!$C$9:$C$1048576,'Mobile-Detail Calcs'!$B30,'Mobile-Data'!$G$9:$G$1048576,'Mobile-Detail Calcs'!J$21)","v":0},{"$f":"SUMIFS('Mobile-Data'!$H$9:$H$1048576,'Mobile-Data'!$C$9:$C$1048576,'Mobile-Detail Calcs'!$B30,'Mobile-Data'!$G$9:$G$1048576,'Mobile-Detail Calcs'!K$21)","v":0},{"$f":"SUMIFS('Mobile-Data'!$H$9:$H$1048576,'Mobile-Data'!$C$9:$C$1048576,'Mobile-Detail Calcs'!$B30,'Mobile-Data'!$G$9:$G$1048576,'Mobile-Detail Calcs'!L$21)","v":0},{"$f":"SUMIFS('Mobile-Data'!$H$9:$H$1048576,'Mobile-Data'!$C$9:$C$1048576,'Mobile-Detail Calcs'!$B30,'Mobile-Data'!$G$9:$G$1048576,'Mobile-Detail Calcs'!M$21)","v":0}]
[null,{"$f":"'Background Controls'!I13","v":0},{"$f":"SUMIFS('Mobile-Data'!$H$9:$H$1048576,'Mobile-Data'!$C$9:$C$1048576,'Mobile-Detail Calcs'!$B31,'Mobile-Data'!$G$9:$G$1048576,'Mobile-Detail Calcs'!C$21)","v":0},{"$f":"SUMIFS('Mobile-Data'!$H$9:$H$1048576,'Mobile-Data'!$C$9:$C$1048576,'Mobile-Detail Calcs'!$B31,'Mobile-Data'!$G$9:$G$1048576,'Mobile-Detail Calcs'!D$21)","v":0},{"$f":"SUMIFS('Mobile-Data'!$H$9:$H$1048576,'Mobile-Data'!$C$9:$C$1048576,'Mobile-Detail Calcs'!$B31,'Mobile-Data'!$G$9:$G$1048576,'Mobile-Detail Calcs'!E$21)","v":0},{"$f":"SUMIFS('Mobile-Data'!$H$9:$H$1048576,'Mobile-Data'!$C$9:$C$1048576,'Mobile-Detail Calcs'!$B31,'Mobile-Data'!$G$9:$G$1048576,'Mobile-Detail Calcs'!F$21)","v":0},{"$f":"SUMIFS('Mobile-Data'!$H$9:$H$1048576,'Mobile-Data'!$C$9:$C$1048576,'Mobile-Detail Calcs'!$B31,'Mobile-Data'!$G$9:$G$1048576,'Mobile-Detail Calcs'!G$21)","v":0},{"$f":"SUMIFS('Mobile-Data'!$H$9:$H$1048576,'Mobile-Data'!$C$9:$C$1048576,'Mobile-Detail Calcs'!$B31,'Mobile-Data'!$G$9:$G$1048576,'Mobile-Detail Calcs'!H$21)","v":0},{"$f":"SUMIFS('Mobile-Data'!$H$9:$H$1048576,'Mobile-Data'!$C$9:$C$1048576,'Mobile-Detail Calcs'!$B31,'Mobile-Data'!$G$9:$G$1048576,'Mobile-Detail Calcs'!I$21)","v":0},{"$f":"SUMIFS('Mobile-Data'!$H$9:$H$1048576,'Mobile-Data'!$C$9:$C$1048576,'Mobile-Detail Calcs'!$B31,'Mobile-Data'!$G$9:$G$1048576,'Mobile-Detail Calcs'!J$21)","v":0},{"$f":"SUMIFS('Mobile-Data'!$H$9:$H$1048576,'Mobile-Data'!$C$9:$C$1048576,'Mobile-Detail Calcs'!$B31,'Mobile-Data'!$G$9:$G$1048576,'Mobile-Detail Calcs'!K$21)","v":0},{"$f":"SUMIFS('Mobile-Data'!$H$9:$H$1048576,'Mobile-Data'!$C$9:$C$1048576,'Mobile-Detail Calcs'!$B31,'Mobile-Data'!$G$9:$G$1048576,'Mobile-Detail Calcs'!L$21)","v":0},{"$f":"SUMIFS('Mobile-Data'!$H$9:$H$1048576,'Mobile-Data'!$C$9:$C$1048576,'Mobile-Detail Calcs'!$B31,'Mobile-Data'!$G$9:$G$1048576,'Mobile-Detail Calcs'!M$21)","v":0}]
[null,{"$f":"'Background Controls'!I14","v":0},{"$f":"SUMIFS('Mobile-Data'!$H$9:$H$1048576,'Mobile-Data'!$C$9:$C$1048576,'Mobile-Detail Calcs'!$B32,'Mobile-Data'!$G$9:$G$1048576,'Mobile-Detail Calcs'!C$21)","v":0},{"$f":"SUMIFS('Mobile-Data'!$H$9:$H$1048576,'Mobile-Data'!$C$9:$C$1048576,'Mobile-Detail Calcs'!$B32,'Mobile-Data'!$G$9:$G$1048576,'Mobile-Detail Calcs'!D$21)","v":0},{"$f":"SUMIFS('Mobile-Data'!$H$9:$H$1048576,'Mobile-Data'!$C$9:$C$1048576,'Mobile-Detail Calcs'!$B32,'Mobile-Data'!$G$9:$G$1048576,'Mobile-Detail Calcs'!E$21)","v":0},{"$f":"SUMIFS('Mobile-Data'!$H$9:$H$1048576,'Mobile-Data'!$C$9:$C$1048576,'Mobile-Detail Calcs'!$B32,'Mobile-Data'!$G$9:$G$1048576,'Mobile-Detail Calcs'!F$21)","v":0},{"$f":"SUMIFS('Mobile-Data'!$H$9:$H$1048576,'Mobile-Data'!$C$9:$C$1048576,'Mobile-Detail Calcs'!$B32,'Mobile-Data'!$G$9:$G$1048576,'Mobile-Detail Calcs'!G$21)","v":0},{"$f":"SUMIFS('Mobile-Data'!$H$9:$H$1048576,'Mobile-Data'!$C$9:$C$1048576,'Mobile-Detail Calcs'!$B32,'Mobile-Data'!$G$9:$G$1048576,'Mobile-Detail Calcs'!H$21)","v":0},{"$f":"SUMIFS('Mobile-Data'!$H$9:$H$1048576,'Mobile-Data'!$C$9:$C$1048576,'Mobile-Detail Calcs'!$B32,'Mobile-Data'!$G$9:$G$1048576,'Mobile-Detail Calcs'!I$21)","v":0},{"$f":"SUMIFS('Mobile-Data'!$H$9:$H$1048576,'Mobile-Data'!$C$9:$C$1048576,'Mobile-Detail Calcs'!$B32,'Mobile-Data'!$G$9:$G$1048576,'Mobile-Detail Calcs'!J$21)","v":0},{"$f":"SUMIFS('Mobile-Data'!$H$9:$H$1048576,'Mobile-Data'!$C$9:$C$1048576,'Mobile-Detail Calcs'!$B32,'Mobile-Data'!$G$9:$G$1048576,'Mobile-Detail Calcs'!K$21)","v":0},{"$f":"SUMIFS('Mobile-Data'!$H$9:$H$1048576,'Mobile-Data'!$C$9:$C$1048576,'Mobile-Detail Calcs'!$B32,'Mobile-Data'!$G$9:$G$1048576,'Mobile-Detail Calcs'!L$21)","v":0},{"$f":"SUMIFS('Mobile-Data'!$H$9:$H$1048576,'Mobile-Data'!$C$9:$C$1048576,'Mobile-Detail Calcs'!$B32,'Mobile-Data'!$G$9:$G$1048576,'Mobile-Detail Calcs'!M$21)","v":0}]
[null,{"$f":"'Background Controls'!I15","v":0},{"$f":"SUMIFS('Mobile-Data'!$H$9:$H$1048576,'Mobile-Data'!$C$9:$C$1048576,'Mobile-Detail Calcs'!$B33,'Mobile-Data'!$G$9:$G$1048576,'Mobile-Detail Calcs'!C$21)","v":0},{"$f":"SUMIFS('Mobile-Data'!$H$9:$H$1048576,'Mobile-Data'!$C$9:$C$1048576,'Mobile-Detail Calcs'!$B33,'Mobile-Data'!$G$9:$G$1048576,'Mobile-Detail Calcs'!D$21)","v":0},{"$f":"SUMIFS('Mobile-Data'!$H$9:$H$1048576,'Mobile-Data'!$C$9:$C$1048576,'Mobile-Detail Calcs'!$B33,'Mobile-Data'!$G$9:$G$1048576,'Mobile-Detail Calcs'!E$21)","v":0},{"$f":"SUMIFS('Mobile-Data'!$H$9:$H$1048576,'Mobile-Data'!$C$9:$C$1048576,'Mobile-Detail Calcs'!$B33,'Mobile-Data'!$G$9:$G$1048576,'Mobile-Detail Calcs'!F$21)","v":0},{"$f":"SUMIFS('Mobile-Data'!$H$9:$H$1048576,'Mobile-Data'!$C$9:$C$1048576,'Mobile-Detail Calcs'!$B33,'Mobile-Data'!$G$9:$G$1048576,'Mobile-Detail Calcs'!G$21)","v":0},{"$f":"SUMIFS('Mobile-Data'!$H$9:$H$1048576,'Mobile-Data'!$C$9:$C$1048576,'Mobile-Detail Calcs'!$B33,'Mobile-Data'!$G$9:$G$1048576,'Mobile-Detail Calcs'!H$21)","v":0},{"$f":"SUMIFS('Mobile-Data'!$H$9:$H$1048576,'Mobile-Data'!$C$9:$C$1048576,'Mobile-Detail Calcs'!$B33,'Mobile-Data'!$G$9:$G$1048576,'Mobile-Detail Calcs'!I$21)","v":0},{"$f":"SUMIFS('Mobile-Data'!$H$9:$H$1048576,'Mobile-Data'!$C$9:$C$1048576,'Mobile-Detail Calcs'!$B33,'Mobile-Data'!$G$9:$G$1048576,'Mobile-Detail Calcs'!J$21)","v":0},{"$f":"SUMIFS('Mobile-Data'!$H$9:$H$1048576,'Mobile-Data'!$C$9:$C$1048576,'Mobile-Detail Calcs'!$B33,'Mobile-Data'!$G$9:$G$1048576,'Mobile-Detail Calcs'!K$21)","v":0},{"$f":"SUMIFS('Mobile-Data'!$H$9:$H$1048576,'Mobile-Data'!$C$9:$C$1048576,'Mobile-Detail Calcs'!$B33,'Mobile-Data'!$G$9:$G$1048576,'Mobile-Detail Calcs'!L$21)","v":0},{"$f":"SUMIFS('Mobile-Data'!$H$9:$H$1048576,'Mobile-Data'!$C$9:$C$1048576,'Mobile-Detail Calcs'!$B33,'Mobile-Data'!$G$9:$G$1048576,'Mobile-Detail Calcs'!M$21)","v":0}]
[null,{"$f":"'Background Controls'!I16","v":0},{"$f":"SUMIFS('Mobile-Data'!$H$9:$H$1048576,'Mobile-Data'!$C$9:$C$1048576,'Mobile-Detail Calcs'!$B34,'Mobile-Data'!$G$9:$G$1048576,'Mobile-Detail Calcs'!C$21)","v":0},{"$f":"SUMIFS('Mobile-Data'!$H$9:$H$1048576,'Mobile-Data'!$C$9:$C$1048576,'Mobile-Detail Calcs'!$B34,'Mobile-Data'!$G$9:$G$1048576,'Mobile-Detail Calcs'!D$21)","v":0},{"$f":"SUMIFS('Mobile-Data'!$H$9:$H$1048576,'Mobile-Data'!$C$9:$C$1048576,'Mobile-Detail Calcs'!$B34,'Mobile-Data'!$G$9:$G$1048576,'Mobile-Detail Calcs'!E$21)","v":0},{"$f":"SUMIFS('Mobile-Data'!$H$9:$H$1048576,'Mobile-Data'!$C$9:$C$1048576,'Mobile-Detail Calcs'!$B34,'Mobile-Data'!$G$9:$G$1048576,'Mobile-Detail Calcs'!F$21)","v":0},{"$f":"SUMIFS('Mobile-Data'!$H$9:$H$1048576,'Mobile-Data'!$C$9:$C$1048576,'Mobile-Detail Calcs'!$B34,'Mobile-Data'!$G$9:$G$1048576,'Mobile-Detail Calcs'!G$21)","v":0},{"$f":"SUMIFS('Mobile-Data'!$H$9:$H$1048576,'Mobile-Data'!$C$9:$C$1048576,'Mobile-Detail Calcs'!$B34,'Mobile-Data'!$G$9:$G$1048576,'Mobile-Detail Calcs'!H$21)","v":0},{"$f":"SUMIFS('Mobile-Data'!$H$9:$H$1048576,'Mobile-Data'!$C$9:$C$1048576,'Mobile-Detail Calcs'!$B34,'Mobile-Data'!$G$9:$G$1048576,'Mobile-Detail Calcs'!I$21)","v":0},{"$f":"SUMIFS('Mobile-Data'!$H$9:$H$1048576,'Mobile-Data'!$C$9:$C$1048576,'Mobile-Detail Calcs'!$B34,'Mobile-Data'!$G$9:$G$1048576,'Mobile-Detail Calcs'!J$21)","v":0},{"$f":"SUMIFS('Mobile-Data'!$H$9:$H$1048576,'Mobile-Data'!$C$9:$C$1048576,'Mobile-Detail Calcs'!$B34,'Mobile-Data'!$G$9:$G$1048576,'Mobile-Detail Calcs'!K$21)","v":0},{"$f":"SUMIFS('Mobile-Data'!$H$9:$H$1048576,'Mobile-Data'!$C$9:$C$1048576,'Mobile-Detail Calcs'!$B34,'Mobile-Data'!$G$9:$G$1048576,'Mobile-Detail Calcs'!L$21)","v":0},{"$f":"SUMIFS('Mobile-Data'!$H$9:$H$1048576,'Mobile-Data'!$C$9:$C$1048576,'Mobile-Detail Calcs'!$B34,'Mobile-Data'!$G$9:$G$1048576,'Mobile-Detail Calcs'!M$21)","v":0}]
[null,{"$f":"'Background Controls'!I17","v":0},{"$f":"SUMIFS('Mobile-Data'!$H$9:$H$1048576,'Mobile-Data'!$C$9:$C$1048576,'Mobile-Detail Calcs'!$B35,'Mobile-Data'!$G$9:$G$1048576,'Mobile-Detail Calcs'!C$21)","v":0},{"$f":"SUMIFS('Mobile-Data'!$H$9:$H$1048576,'Mobile-Data'!$C$9:$C$1048576,'Mobile-Detail Calcs'!$B35,'Mobile-Data'!$G$9:$G$1048576,'Mobile-Detail Calcs'!D$21)","v":0},{"$f":"SUMIFS('Mobile-Data'!$H$9:$H$1048576,'Mobile-Data'!$C$9:$C$1048576,'Mobile-Detail Calcs'!$B35,'Mobile-Data'!$G$9:$G$1048576,'Mobile-Detail Calcs'!E$21)","v":0},{"$f":"SUMIFS('Mobile-Data'!$H$9:$H$1048576,'Mobile-Data'!$C$9:$C$1048576,'Mobile-Detail Calcs'!$B35,'Mobile-Data'!$G$9:$G$1048576,'Mobile-Detail Calcs'!F$21)","v":0},{"$f":"SUMIFS('Mobile-Data'!$H$9:$H$1048576,'Mobile-Data'!$C$9:$C$1048576,'Mobile-Detail Calcs'!$B35,'Mobile-Data'!$G$9:$G$1048576,'Mobile-Detail Calcs'!G$21)","v":0},{"$f":"SUMIFS('Mobile-Data'!$H$9:$H$1048576,'Mobile-Data'!$C$9:$C$1048576,'Mobile-Detail Calcs'!$B35,'Mobile-Data'!$G$9:$G$1048576,'Mobile-Detail Calcs'!H$21)","v":0},{"$f":"SUMIFS('Mobile-Data'!$H$9:$H$1048576,'Mobile-Data'!$C$9:$C$1048576,'Mobile-Detail Calcs'!$B35,'Mobile-Data'!$G$9:$G$1048576,'Mobile-Detail Calcs'!I$21)","v":0},{"$f":"SUMIFS('Mobile-Data'!$H$9:$H$1048576,'Mobile-Data'!$C$9:$C$1048576,'Mobile-Detail Calcs'!$B35,'Mobile-Data'!$G$9:$G$1048576,'Mobile-Detail Calcs'!J$21)","v":0},{"$f":"SUMIFS('Mobile-Data'!$H$9:$H$1048576,'Mobile-Data'!$C$9:$C$1048576,'Mobile-Detail Calcs'!$B35,'Mobile-Data'!$G$9:$G$1048576,'Mobile-Detail Calcs'!K$21)","v":0},{"$f":"SUMIFS('Mobile-Data'!$H$9:$H$1048576,'Mobile-Data'!$C$9:$C$1048576,'Mobile-Detail Calcs'!$B35,'Mobile-Data'!$G$9:$G$1048576,'Mobile-Detail Calcs'!L$21)","v":0},{"$f":"SUMIFS('Mobile-Data'!$H$9:$H$1048576,'Mobile-Data'!$C$9:$C$1048576,'Mobile-Detail Calcs'!$B35,'Mobile-Data'!$G$9:$G$1048576,'Mobile-Detail Calcs'!M$21)","v":0}]
[null,{"$f":"'Background Controls'!I18","v":0},{"$f":"SUMIFS('Mobile-Data'!$H$9:$H$1048576,'Mobile-Data'!$C$9:$C$1048576,'Mobile-Detail Calcs'!$B36,'Mobile-Data'!$G$9:$G$1048576,'Mobile-Detail Calcs'!C$21)","v":0},{"$f":"SUMIFS('Mobile-Data'!$H$9:$H$1048576,'Mobile-Data'!$C$9:$C$1048576,'Mobile-Detail Calcs'!$B36,'Mobile-Data'!$G$9:$G$1048576,'Mobile-Detail Calcs'!D$21)","v":0},{"$f":"SUMIFS('Mobile-Data'!$H$9:$H$1048576,'Mobile-Data'!$C$9:$C$1048576,'Mobile-Detail Calcs'!$B36,'Mobile-Data'!$G$9:$G$1048576,'Mobile-Detail Calcs'!E$21)","v":0},{"$f":"SUMIFS('Mobile-Data'!$H$9:$H$1048576,'Mobile-Data'!$C$9:$C$1048576,'Mobile-Detail Calcs'!$B36,'Mobile-Data'!$G$9:$G$1048576,'Mobile-Detail Calcs'!F$21)","v":0},{"$f":"SUMIFS('Mobile-Data'!$H$9:$H$1048576,'Mobile-Data'!$C$9:$C$1048576,'Mobile-Detail Calcs'!$B36,'Mobile-Data'!$G$9:$G$1048576,'Mobile-Detail Calcs'!G$21)","v":0},{"$f":"SUMIFS('Mobile-Data'!$H$9:$H$1048576,'Mobile-Data'!$C$9:$C$1048576,'Mobile-Detail Calcs'!$B36,'Mobile-Data'!$G$9:$G$1048576,'Mobile-Detail Calcs'!H$21)","v":0},{"$f":"SUMIFS('Mobile-Data'!$H$9:$H$1048576,'Mobile-Data'!$C$9:$C$1048576,'Mobile-Detail Calcs'!$B36,'Mobile-Data'!$G$9:$G$1048576,'Mobile-Detail Calcs'!I$21)","v":0},{"$f":"SUMIFS('Mobile-Data'!$H$9:$H$1048576,'Mobile-Data'!$C$9:$C$1048576,'Mobile-Detail Calcs'!$B36,'Mobile-Data'!$G$9:$G$1048576,'Mobile-Detail Calcs'!J$21)","v":0},{"$f":"SUMIFS('Mobile-Data'!$H$9:$H$1048576,'Mobile-Data'!$C$9:$C$1048576,'Mobile-Detail Calcs'!$B36,'Mobile-Data'!$G$9:$G$1048576,'Mobile-Detail Calcs'!K$21)","v":0},{"$f":"SUMIFS('Mobile-Data'!$H$9:$H$1048576,'Mobile-Data'!$C$9:$C$1048576,'Mobile-Detail Calcs'!$B36,'Mobile-Data'!$G$9:$G$1048576,'Mobile-Detail Calcs'!L$21)","v":0},{"$f":"SUMIFS('Mobile-Data'!$H$9:$H$1048576,'Mobile-Data'!$C$9:$C$1048576,'Mobile-Detail Calcs'!$B36,'Mobile-Data'!$G$9:$G$1048576,'Mobile-Detail Calcs'!M$21)","v":0}]
[null,{"$f":"'Background Controls'!I19","v":0},{"$f":"SUMIFS('Mobile-Data'!$H$9:$H$1048576,'Mobile-Data'!$C$9:$C$1048576,'Mobile-Detail Calcs'!$B37,'Mobile-Data'!$G$9:$G$1048576,'Mobile-Detail Calcs'!C$21)","v":0},{"$f":"SUMIFS('Mobile-Data'!$H$9:$H$1048576,'Mobile-Data'!$C$9:$C$1048576,'Mobile-Detail Calcs'!$B37,'Mobile-Data'!$G$9:$G$1048576,'Mobile-Detail Calcs'!D$21)","v":0},{"$f":"SUMIFS('Mobile-Data'!$H$9:$H$1048576,'Mobile-Data'!$C$9:$C$1048576,'Mobile-Detail Calcs'!$B37,'Mobile-Data'!$G$9:$G$1048576,'Mobile-Detail Calcs'!E$21)","v":0},{"$f":"SUMIFS('Mobile-Data'!$H$9:$H$1048576,'Mobile-Data'!$C$9:$C$1048576,'Mobile-Detail Calcs'!$B37,'Mobile-Data'!$G$9:$G$1048576,'Mobile-Detail Calcs'!F$21)","v":0},{"$f":"SUMIFS('Mobile-Data'!$H$9:$H$1048576,'Mobile-Data'!$C$9:$C$1048576,'Mobile-Detail Calcs'!$B37,'Mobile-Data'!$G$9:$G$1048576,'Mobile-Detail Calcs'!G$21)","v":0},{"$f":"SUMIFS('Mobile-Data'!$H$9:$H$1048576,'Mobile-Data'!$C$9:$C$1048576,'Mobile-Detail Calcs'!$B37,'Mobile-Data'!$G$9:$G$1048576,'Mobile-Detail Calcs'!H$21)","v":0},{"$f":"SUMIFS('Mobile-Data'!$H$9:$H$1048576,'Mobile-Data'!$C$9:$C$1048576,'Mobile-Detail Calcs'!$B37,'Mobile-Data'!$G$9:$G$1048576,'Mobile-Detail Calcs'!I$21)","v":0},{"$f":"SUMIFS('Mobile-Data'!$H$9:$H$1048576,'Mobile-Data'!$C$9:$C$1048576,'Mobile-Detail Calcs'!$B37,'Mobile-Data'!$G$9:$G$1048576,'Mobile-Detail Calcs'!J$21)","v":0},{"$f":"SUMIFS('Mobile-Data'!$H$9:$H$1048576,'Mobile-Data'!$C$9:$C$1048576,'Mobile-Detail Calcs'!$B37,'Mobile-Data'!$G$9:$G$1048576,'Mobile-Detail Calcs'!K$21)","v":0},{"$f":"SUMIFS('Mobile-Data'!$H$9:$H$1048576,'Mobile-Data'!$C$9:$C$1048576,'Mobile-Detail Calcs'!$B37,'Mobile-Data'!$G$9:$G$1048576,'Mobile-Detail Calcs'!L$21)","v":0},{"$f":"SUMIFS('Mobile-Data'!$H$9:$H$1048576,'Mobile-Data'!$C$9:$C$1048576,'Mobile-Detail Calcs'!$B37,'Mobile-Data'!$G$9:$G$1048576,'Mobile-Detail Calcs'!M$21)","v":0}]
[null,{"$f":"'Background Controls'!I20","v":0},{"$f":"SUMIFS('Mobile-Data'!$H$9:$H$1048576,'Mobile-Data'!$C$9:$C$1048576,'Mobile-Detail Calcs'!$B38,'Mobile-Data'!$G$9:$G$1048576,'Mobile-Detail Calcs'!C$21)","v":0},{"$f":"SUMIFS('Mobile-Data'!$H$9:$H$1048576,'Mobile-Data'!$C$9:$C$1048576,'Mobile-Detail Calcs'!$B38,'Mobile-Data'!$G$9:$G$1048576,'Mobile-Detail Calcs'!D$21)","v":0},{"$f":"SUMIFS('Mobile-Data'!$H$9:$H$1048576,'Mobile-Data'!$C$9:$C$1048576,'Mobile-Detail Calcs'!$B38,'Mobile-Data'!$G$9:$G$1048576,'Mobile-Detail Calcs'!E$21)","v":0},{"$f":"SUMIFS('Mobile-Data'!$H$9:$H$1048576,'Mobile-Data'!$C$9:$C$1048576,'Mobile-Detail Calcs'!$B38,'Mobile-Data'!$G$9:$G$1048576,'Mobile-Detail Calcs'!F$21)","v":0},{"$f":"SUMIFS('Mobile-Data'!$H$9:$H$1048576,'Mobile-Data'!$C$9:$C$1048576,'Mobile-Detail Calcs'!$B38,'Mobile-Data'!$G$9:$G$1048576,'Mobile-Detail Calcs'!G$21)","v":0},{"$f":"SUMIFS('Mobile-Data'!$H$9:$H$1048576,'Mobile-Data'!$C$9:$C$1048576,'Mobile-Detail Calcs'!$B38,'Mobile-Data'!$G$9:$G$1048576,'Mobile-Detail Calcs'!H$21)","v":0},{"$f":"SUMIFS('Mobile-Data'!$H$9:$H$1048576,'Mobile-Data'!$C$9:$C$1048576,'Mobile-Detail Calcs'!$B38,'Mobile-Data'!$G$9:$G$1048576,'Mobile-Detail Calcs'!I$21)","v":0},{"$f":"SUMIFS('Mobile-Data'!$H$9:$H$1048576,'Mobile-Data'!$C$9:$C$1048576,'Mobile-Detail Calcs'!$B38,'Mobile-Data'!$G$9:$G$1048576,'Mobile-Detail Calcs'!J$21)","v":0},{"$f":"SUMIFS('Mobile-Data'!$H$9:$H$1048576,'Mobile-Data'!$C$9:$C$1048576,'Mobile-Detail Calcs'!$B38,'Mobile-Data'!$G$9:$G$1048576,'Mobile-Detail Calcs'!K$21)","v":0},{"$f":"SUMIFS('Mobile-Data'!$H$9:$H$1048576,'Mobile-Data'!$C$9:$C$1048576,'Mobile-Detail Calcs'!$B38,'Mobile-Data'!$G$9:$G$1048576,'Mobile-Detail Calcs'!L$21)","v":0},{"$f":"SUMIFS('Mobile-Data'!$H$9:$H$1048576,'Mobile-Data'!$C$9:$C$1048576,'Mobile-Detail Calcs'!$B38,'Mobile-Data'!$G$9:$G$1048576,'Mobile-Detail Calcs'!M$21)","v":0}]
[null,{"$f":"'Background Controls'!I21","v":0},{"$f":"SUMIFS('Mobile-Data'!$H$9:$H$1048576,'Mobile-Data'!$C$9:$C$1048576,'Mobile-Detail Calcs'!$B39,'Mobile-Data'!$G$9:$G$1048576,'Mobile-Detail Calcs'!C$21)","v":0},{"$f":"SUMIFS('Mobile-Data'!$H$9:$H$1048576,'Mobile-Data'!$C$9:$C$1048576,'Mobile-Detail Calcs'!$B39,'Mobile-Data'!$G$9:$G$1048576,'Mobile-Detail Calcs'!D$21)","v":0},{"$f":"SUMIFS('Mobile-Data'!$H$9:$H$1048576,'Mobile-Data'!$C$9:$C$1048576,'Mobile-Detail Calcs'!$B39,'Mobile-Data'!$G$9:$G$1048576,'Mobile-Detail Calcs'!E$21)","v":0},{"$f":"SUMIFS('Mobile-Data'!$H$9:$H$1048576,'Mobile-Data'!$C$9:$C$1048576,'Mobile-Detail Calcs'!$B39,'Mobile-Data'!$G$9:$G$1048576,'Mobile-Detail Calcs'!F$21)","v":0},{"$f":"SUMIFS('Mobile-Data'!$H$9:$H$1048576,'Mobile-Data'!$C$9:$C$1048576,'Mobile-Detail Calcs'!$B39,'Mobile-Data'!$G$9:$G$1048576,'Mobile-Detail Calcs'!G$21)","v":0},{"$f":"SUMIFS('Mobile-Data'!$H$9:$H$1048576,'Mobile-Data'!$C$9:$C$1048576,'Mobile-Detail Calcs'!$B39,'Mobile-Data'!$G$9:$G$1048576,'Mobile-Detail Calcs'!H$21)","v":0},{"$f":"SUMIFS('Mobile-Data'!$H$9:$H$1048576,'Mobile-Data'!$C$9:$C$1048576,'Mobile-Detail Calcs'!$B39,'Mobile-Data'!$G$9:$G$1048576,'Mobile-Detail Calcs'!I$21)","v":0},{"$f":"SUMIFS('Mobile-Data'!$H$9:$H$1048576,'Mobile-Data'!$C$9:$C$1048576,'Mobile-Detail Calcs'!$B39,'Mobile-Data'!$G$9:$G$1048576,'Mobile-Detail Calcs'!J$21)","v":0},{"$f":"SUMIFS('Mobile-Data'!$H$9:$H$1048576,'Mobile-Data'!$C$9:$C$1048576,'Mobile-Detail Calcs'!$B39,'Mobile-Data'!$G$9:$G$1048576,'Mobile-Detail Calcs'!K$21)","v":0},{"$f":"SUMIFS('Mobile-Data'!$H$9:$H$1048576,'Mobile-Data'!$C$9:$C$1048576,'Mobile-Detail Calcs'!$B39,'Mobile-Data'!$G$9:$G$1048576,'Mobile-Detail Calcs'!L$21)","v":0},{"$f":"SUMIFS('Mobile-Data'!$H$9:$H$1048576,'Mobile-Data'!$C$9:$C$1048576,'Mobile-Detail Calcs'!$B39,'Mobile-Data'!$G$9:$G$1048576,'Mobile-Detail Calcs'!M$21)","v":0}]
[null,{"$f":"'Background Controls'!I22","v":0},{"$f":"SUMIFS('Mobile-Data'!$H$9:$H$1048576,'Mobile-Data'!$C$9:$C$1048576,'Mobile-Detail Calcs'!$B40,'Mobile-Data'!$G$9:$G$1048576,'Mobile-Detail Calcs'!C$21)","v":0},{"$f":"SUMIFS('Mobile-Data'!$H$9:$H$1048576,'Mobile-Data'!$C$9:$C$1048576,'Mobile-Detail Calcs'!$B40,'Mobile-Data'!$G$9:$G$1048576,'Mobile-Detail Calcs'!D$21)","v":0},{"$f":"SUMIFS('Mobile-Data'!$H$9:$H$1048576,'Mobile-Data'!$C$9:$C$1048576,'Mobile-Detail Calcs'!$B40,'Mobile-Data'!$G$9:$G$1048576,'Mobile-Detail Calcs'!E$21)","v":0},{"$f":"SUMIFS('Mobile-Data'!$H$9:$H$1048576,'Mobile-Data'!$C$9:$C$1048576,'Mobile-Detail Calcs'!$B40,'Mobile-Data'!$G$9:$G$1048576,'Mobile-Detail Calcs'!F$21)","v":0},{"$f":"SUMIFS('Mobile-Data'!$H$9:$H$1048576,'Mobile-Data'!$C$9:$C$1048576,'Mobile-Detail Calcs'!$B40,'Mobile-Data'!$G$9:$G$1048576,'Mobile-Detail Calcs'!G$21)","v":0},{"$f":"SUMIFS('Mobile-Data'!$H$9:$H$1048576,'Mobile-Data'!$C$9:$C$1048576,'Mobile-Detail Calcs'!$B40,'Mobile-Data'!$G$9:$G$1048576,'Mobile-Detail Calcs'!H$21)","v":0},{"$f":"SUMIFS('Mobile-Data'!$H$9:$H$1048576,'Mobile-Data'!$C$9:$C$1048576,'Mobile-Detail Calcs'!$B40,'Mobile-Data'!$G$9:$G$1048576,'Mobile-Detail Calcs'!I$21)","v":0},{"$f":"SUMIFS('Mobile-Data'!$H$9:$H$1048576,'Mobile-Data'!$C$9:$C$1048576,'Mobile-Detail Calcs'!$B40,'Mobile-Data'!$G$9:$G$1048576,'Mobile-Detail Calcs'!J$21)","v":0},{"$f":"SUMIFS('Mobile-Data'!$H$9:$H$1048576,'Mobile-Data'!$C$9:$C$1048576,'Mobile-Detail Calcs'!$B40,'Mobile-Data'!$G$9:$G$1048576,'Mobile-Detail Calcs'!K$21)","v":0},{"$f":"SUMIFS('Mobile-Data'!$H$9:$H$1048576,'Mobile-Data'!$C$9:$C$1048576,'Mobile-Detail Calcs'!$B40,'Mobile-Data'!$G$9:$G$1048576,'Mobile-Detail Calcs'!L$21)","v":0},{"$f":"SUMIFS('Mobile-Data'!$H$9:$H$1048576,'Mobile-Data'!$C$9:$C$1048576,'Mobile-Detail Calcs'!$B40,'Mobile-Data'!$G$9:$G$1048576,'Mobile-Detail Calcs'!M$21)","v":0}]
[null,{"$f":"'Background Controls'!I23","v":0},{"$f":"SUMIFS('Mobile-Data'!$H$9:$H$1048576,'Mobile-Data'!$C$9:$C$1048576,'Mobile-Detail Calcs'!$B41,'Mobile-Data'!$G$9:$G$1048576,'Mobile-Detail Calcs'!C$21)","v":0},{"$f":"SUMIFS('Mobile-Data'!$H$9:$H$1048576,'Mobile-Data'!$C$9:$C$1048576,'Mobile-Detail Calcs'!$B41,'Mobile-Data'!$G$9:$G$1048576,'Mobile-Detail Calcs'!D$21)","v":0},{"$f":"SUMIFS('Mobile-Data'!$H$9:$H$1048576,'Mobile-Data'!$C$9:$C$1048576,'Mobile-Detail Calcs'!$B41,'Mobile-Data'!$G$9:$G$1048576,'Mobile-Detail Calcs'!E$21)","v":0},{"$f":"SUMIFS('Mobile-Data'!$H$9:$H$1048576,'Mobile-Data'!$C$9:$C$1048576,'Mobile-Detail Calcs'!$B41,'Mobile-Data'!$G$9:$G$1048576,'Mobile-Detail Calcs'!F$21)","v":0},{"$f":"SUMIFS('Mobile-Data'!$H$9:$H$1048576,'Mobile-Data'!$C$9:$C$1048576,'Mobile-Detail Calcs'!$B41,'Mobile-Data'!$G$9:$G$1048576,'Mobile-Detail Calcs'!G$21)","v":0},{"$f":"SUMIFS('Mobile-Data'!$H$9:$H$1048576,'Mobile-Data'!$C$9:$C$1048576,'Mobile-Detail Calcs'!$B41,'Mobile-Data'!$G$9:$G$1048576,'Mobile-Detail Calcs'!H$21)","v":0},{"$f":"SUMIFS('Mobile-Data'!$H$9:$H$1048576,'Mobile-Data'!$C$9:$C$1048576,'Mobile-Detail Calcs'!$B41,'Mobile-Data'!$G$9:$G$1048576,'Mobile-Detail Calcs'!I$21)","v":0},{"$f":"SUMIFS('Mobile-Data'!$H$9:$H$1048576,'Mobile-Data'!$C$9:$C$1048576,'Mobile-Detail Calcs'!$B41,'Mobile-Data'!$G$9:$G$1048576,'Mobile-Detail Calcs'!J$21)","v":0},{"$f":"SUMIFS('Mobile-Data'!$H$9:$H$1048576,'Mobile-Data'!$C$9:$C$1048576,'Mobile-Detail Calcs'!$B41,'Mobile-Data'!$G$9:$G$1048576,'Mobile-Detail Calcs'!K$21)","v":0},{"$f":"SUMIFS('Mobile-Data'!$H$9:$H$1048576,'Mobile-Data'!$C$9:$C$1048576,'Mobile-Detail Calcs'!$B41,'Mobile-Data'!$G$9:$G$1048576,'Mobile-Detail Calcs'!L$21)","v":0},{"$f":"SUMIFS('Mobile-Data'!$H$9:$H$1048576,'Mobile-Data'!$C$9:$C$1048576,'Mobile-Detail Calcs'!$B41,'Mobile-Data'!$G$9:$G$1048576,'Mobile-Detail Calcs'!M$21)","v":0}]
[null,{"$f":"'Background Controls'!I24","v":0},{"$f":"SUMIFS('Mobile-Data'!$H$9:$H$1048576,'Mobile-Data'!$C$9:$C$1048576,'Mobile-Detail Calcs'!$B42,'Mobile-Data'!$G$9:$G$1048576,'Mobile-Detail Calcs'!C$21)","v":0},{"$f":"SUMIFS('Mobile-Data'!$H$9:$H$1048576,'Mobile-Data'!$C$9:$C$1048576,'Mobile-Detail Calcs'!$B42,'Mobile-Data'!$G$9:$G$1048576,'Mobile-Detail Calcs'!D$21)","v":0},{"$f":"SUMIFS('Mobile-Data'!$H$9:$H$1048576,'Mobile-Data'!$C$9:$C$1048576,'Mobile-Detail Calcs'!$B42,'Mobile-Data'!$G$9:$G$1048576,'Mobile-Detail Calcs'!E$21)","v":0},{"$f":"SUMIFS('Mobile-Data'!$H$9:$H$1048576,'Mobile-Data'!$C$9:$C$1048576,'Mobile-Detail Calcs'!$B42,'Mobile-Data'!$G$9:$G$1048576,'Mobile-Detail Calcs'!F$21)","v":0},{"$f":"SUMIFS('Mobile-Data'!$H$9:$H$1048576,'Mobile-Data'!$C$9:$C$1048576,'Mobile-Detail Calcs'!$B42,'Mobile-Data'!$G$9:$G$1048576,'Mobile-Detail Calcs'!G$21)","v":0},{"$f":"SUMIFS('Mobile-Data'!$H$9:$H$1048576,'Mobile-Data'!$C$9:$C$1048576,'Mobile-Detail Calcs'!$B42,'Mobile-Data'!$G$9:$G$1048576,'Mobile-Detail Calcs'!H$21)","v":0},{"$f":"SUMIFS('Mobile-Data'!$H$9:$H$1048576,'Mobile-Data'!$C$9:$C$1048576,'Mobile-Detail Calcs'!$B42,'Mobile-Data'!$G$9:$G$1048576,'Mobile-Detail Calcs'!I$21)","v":0},{"$f":"SUMIFS('Mobile-Data'!$H$9:$H$1048576,'Mobile-Data'!$C$9:$C$1048576,'Mobile-Detail Calcs'!$B42,'Mobile-Data'!$G$9:$G$1048576,'Mobile-Detail Calcs'!J$21)","v":0},{"$f":"SUMIFS('Mobile-Data'!$H$9:$H$1048576,'Mobile-Data'!$C$9:$C$1048576,'Mobile-Detail Calcs'!$B42,'Mobile-Data'!$G$9:$G$1048576,'Mobile-Detail Calcs'!K$21)","v":0},{"$f":"SUMIFS('Mobile-Data'!$H$9:$H$1048576,'Mobile-Data'!$C$9:$C$1048576,'Mobile-Detail Calcs'!$B42,'Mobile-Data'!$G$9:$G$1048576,'Mobile-Detail Calcs'!L$21)","v":0},{"$f":"SUMIFS('Mobile-Data'!$H$9:$H$1048576,'Mobile-Data'!$C$9:$C$1048576,'Mobile-Detail Calcs'!$B42,'Mobile-Data'!$G$9:$G$1048576,'Mobile-Detail Calcs'!M$21)","v":0}]
[null,"Total",{"$f":"SUM(C23:C42)","v":11581919},7026817,0,0,0,0,0,0,0,0,0]
[]
["Energy Use by Sector and Fuel Type"]
["This table summarizes energy use by sector (MMBtu)."]
[null,null,"Gasoline","Diesel","Biodiesel (B5)","Biodiesel (B20)","Ethanol (E85)","CNG","LNG","LPG","Residual Fuel","Jet Fuel","Aviation Gasoline","TOTAL"]
["Dstart",{"$f":"'Background Controls'!I5","v":"Residential"},{"$f":"C23*VLOOKUP(C$47, mob_fuel_CO2_efs, 5, FALSE)","v":0},0,0,0,0,0,0,0,0,0,0,{"$f":"SUM(C48:M48)","v":0}]
[null,{"$f":"'Background Controls'!I6","v":"Commercial/Institutional"},{"$f":"C24*VLOOKUP(C$47, mob_fuel_CO2_efs, 5, FALSE)","v":1447739.875},970369.96666666667,0,0,0,0,0,0,0,0,0,{"$f":"SUM(C49:M49)","v":2418109.8416666668}]
[null,{"$f":"'Background Controls'!I7","v":"Industrial"},{"$f":"C25*VLOOKUP(C$47, mob_fuel_CO2_efs, 5, FALSE)","v":0},0,0,0,0,0,0,0,0,0,0,0]
[null,{"$f":"'Background Controls'!I8","v":"Energy Generation"},{"$f":"C26*VLOOKUP(C$47, mob_fuel_CO2_efs, 5, FALSE)","v":0},0,0,0,0,0,0,0,0,0,0,0]
[null,{"$f":"'Background Controls'!I9","v":0},{"$f":"C27*VLOOKUP(C$47, mob_fuel_CO2_efs, 5, FALSE)","v":0},0,0,0,0,0,0,0,0,0,0,0]
[null,{"$f":"'Background Controls'!I10","v":0},{"$f":"C28*VLOOKUP(C$47, mob_fuel_CO2_efs, 5, FALSE)","v":0},0,0,0,0,0,0,0,0,0,0,0]
[null,{"$f":"'Background Controls'!I11","v":0},{"$f":"C29*VLOOKUP(C$47, mob_fuel_CO2_efs, 5, FALSE)","v":0},0,0,0,0,0,0,0,0,0,0,0]
[null,{"$f":"'Background Controls'!I12","v":0},{"$f":"C30*VLOOKUP(C$47, mob_fuel_CO2_efs, 5, FALSE)","v":0},0,0,0,0,0,0,0,0,0,0,0]
[null,{"$f":"'Background Controls'!I13","v":0},{"$f":"C31*VLOOKUP(C$47, mob_fuel_CO2_efs, 5, FALSE)","v":0},0,0,0,0,0,0,0,0,0,0,0]
[null,{"$f":"'Background Controls'!I14","v":0},{"$f":"C32*VLOOKUP(C$47, mob_fuel_CO2_efs, 5, FALSE)","v":0},0,0,0,0,0,0,0,0,0,0,0]
[null,{"$f":"'Background Controls'!I15","v":0},{"$f":"C33*VLOOKUP(C$47, mob_fuel_CO2_efs, 5, FALSE)","v":0},0,0,0,0,0,0,0,0,0,0,0]
[null,{"$f":"'Background Controls'!I16","v":0},{"$f":"C34*VLOOKUP(C$47, mob_fuel_CO2_efs, 5, FALSE)","v":0},0,0,0,0,0,0,0,0,0,0,0]
[null,{"$f":"'Background Controls'!I17","v":0},{"$f":"C35*VLOOKUP(C$47, mob_fuel_CO2_efs, 5, FALSE)","v":0},0,0,0,0,0,0,0,0,0,0,0]
[null,{"$f":"'Background Controls'!I18","v":0},{"$f":"C36*VLOOKUP(C$47, mob_fuel_CO2_efs, 5, FALSE)","v":0},0,0,0,0,0,0,0,0,0,0,0]
[null,{"$f":"'Background Controls'!I19","v":0},{"$f":"C37*VLOOKUP(C$47, mob_fuel_CO2_efs, 5, FALSE)","v":0},0,0,0,0,0,0,0,0,0,0,0]
[null,{"$f":"'Background Controls'!I20","v":0},{"$f":"C38*VLOOKUP(C$47, mob_fuel_CO2_efs, 5, FALSE)","v":0},0,0,0,0,0,0,0,0,0,0,0]
[null,{"$f":"'Background Controls'!I21","v":0},{"$f":"C39*VLOOKUP(C$47, mob_fuel_CO2_efs, 5, FALSE)","v":0},0,0,0,0,0,0,0,0,0,0,0]
[null,{"$f":"'Background Controls'!I22","v":0},{"$f":"C40*VLOOKUP(C$47, mob_fuel_CO2_efs, 5, FALSE)","v":0},0,0,0,0,0,0,0,0,0,0,0]
[null,{"$f":"'Background Controls'!I23","v":0},{"$f":"C41*VLOOKUP(C$47, mob_fuel_CO2_efs, 5, FALSE)","v":0},0,0,0,0,0,0,0,0,0,0,0]
[null,{"$f":"'Background Controls'!I24","v":0},{"$f":"C42*VLOOKUP(C$47, mob_fuel_CO2_efs, 5, FALSE)","v":0},0,0,0,0,0,0,0,0,0,0,0]
[null,"Total",{"$f":"SUM(C48:C67)","v":1447739.875},970369.96666666667,0,0,0,0,0,0,0,0,0,2418109.8416666668]
[]
[]
["CO2 Calculations"]
[]
["Gross CO2 Emissions"]
["CO2 Emissions (MT) = Fuel use × kg CO2/unit of fuel × MT/kg"]
[null,null,"Gasoline","Diesel","Biodiesel (B5)","Biodiesel (B20)","Ethanol (E85)","CNG","LNG","LPG","Residual Fuel","Jet Fuel","Aviation Gasoline","TOTAL"]
[null,"EF: kg CO2/gal (or g.g.e.)",{"$f":"VLOOKUP(C21,mob_fuel_CO2_efs,2,FALSE)","v":8.7799999999999994},10.210000000000001,{"$f":"VLOOKUP(E21,mob_fuel_CO2_efs,2,FALSE)","v":10.172000000000001},10.058000000000002,6.2045000000000003,6.8401800000000001,4.46,5.79,11.8,9.57,8.31]
["Dstart",{"$f":"B23","v":"Residential"},{"$f":"C23*C$76*kg_mt","v":0},0,0,0,0,0,0,0,0,0,0,{"$f":"SUM(C77:M77)","v":0}]
[null,{"$f":"B24","v":"Commercial/Institutional"},{"$f":"C24*C$76*kg_mt","v":101689.24881999999},71743.801570000011,0,0,0,0,0,0,0,0,0,{"$f":"SUM(C78:M78)","v":173433.05038999999}]
[null,"Industrial",{"$f":"C25*C$76*kg_mt","v":0},0,0,0,0,0,0,0,0,0,0,0]
[null,"Energy Generation",{"$f":"C26*C$76*kg_mt","v":0},0,0,0,0,0,0,0,0,0,0,0]
[null,0,{"$f":"C27*C$76*kg_mt","v":0},0,0,0,0,0,0,0,0,0,0,0]
[null,0,{"$f":"C28*C$76*kg_mt","v":0},0,0,0,0,0,0,0,0,0,0,0]
[null,0,{"$f":"C29*C$76*kg_mt","v":0},0,0,0,0,0,0,0,0,0,0,0]
[null,0,{"$f":"C30*C$76*kg_mt","v":0},0,0,0,0,0,0,0,0,0,0,0]
[null,0,{"$f":"C31*C$76*kg_mt","v":0},0,0,0,0,0,0,0,0,0,0,0]
[null,0,{"$f":"C32*C$76*kg_mt","v":0},0,0,0,0,0,0,0,0,0,0,0]
[null,0,{"$f":"C33*C$76*kg_mt","v":0},0,0,0,0,0,0,0,0,0,0,0]
[null,0,{"$f":"C34*C$76*kg_mt","v":0},0,0,0,0,0,0,0,0,0,0,0]
[null,0,{"$f":"C35*C$76*kg_mt","v":0},0,0,0,0,0,0,0,0,0,0,0]
[null,0,{"$f":"C36*C$76*kg_mt","v":0},0,0,0,0,0,0,0,0,0,0,0]
[null,0,{"$f":"C37*C$76*kg_mt","v":0},0,0,0,0,0,0,0,0,0,0,0]
[null,0,{"$f":"C38*C$76*kg_mt","v":0},0,0,0,0,0,0,0,0,0,0,0]
[null,0,{"$f":"C39*C$76*kg_mt","v":0},0,0,0,0,0,0,0,0,0,0,0]
[null,0,{"$f":"C40*C$76*kg_mt","v":0},0,0,0,0,0,0,0,0,0,0,0]
[null,0,{"$f":"C41*C$76*kg_mt","v":0},0,0,0,0,0,0,0,0,0,0,0]
[null,0,{"$f":"C42*C$76*kg_mt","v":0},0,0,0,0,0,0,0,0,0,0,0]
[null,"Total",{"$f":"SUM(C77:C96)","v":101689.24881999999},71743.801570000011,0,0,0,0,0,0,0,0,0,173433.05038999999]
[]
["Biogenic CO2 Emissions"]
["Biogenic CO2 (MT) = Fuel use × Biogenic kg CO2/unit of fuel × MT/kg"]
[null,null,"Gasoline","Diesel","Biodiesel (B5)","Biodiesel (B20)","Ethanol (E85)","CNG","LNG","LPG","Residual Fuel","Jet Fuel","Aviation Gasoline","TOTAL"]
[null,"EF: kg CO2/gal (or g.g.e.)",{"$f":"VLOOKUP(C101,mob_fuel_CO2_efs,3,FALSE)","v":0},0,0.47249999999999998,1.89,4.8875000000000002,0,0,0,0,0,0]
["Dstart",{"$f":"B77","v":"Residential"},{"$f":"C23*C$102*kg_mt","v":0},0,0,0,0,0,0,0,0,0,0,{"$f":"SUM(C103:M103)","v":0}]
[null,{"$f":"B78","v":"Commercial/Institutional"},{"$f":"C24*C$102*kg_mt","v":0},0,0,0,0,0,0,0,0,0,0,{"$f":"SUM(C104:M104)","v":0}]
[null,"Industrial",{"$f":"C25*C$102*kg_mt","v":0},0,0,0,0,0,0,0,0,0,0,0]
[null,"Energy Generation",{"$f":"C26*C$102*kg_mt","v":0},0,0,0,0,0,0,0,0,0,0,0]
[null,0,{"$f":"C27*C$102*kg_mt","v":0},0,0,0,0,0,0,0,0,0,0,0]
[null,0,{"$f":"C28*C$102*kg_mt","v":0},0,0,0,0,0,0,0,0,0,0,0]
[null,0,{"$f":"C29*C$102*kg_mt","v":0},0,0,0,0,0,0,0,0,0,0,0]
[null,0,{"$f":"C30*C$102*kg_mt","v":0},0,0,0,0,0,0,0,0,0,0,0]
[null,0,{"$f":"C31*C$102*kg_mt","v":0},0,0,0,0,0,0,0,0,0,0,0]
[null,0,{"$f":"C32*C$102*kg_mt","v":0},0,0,0,0,0,0,0,0,0,0,0]
[null,0,{"$f":"C33*C$102*kg_mt","v":0},0,0,0,0,0,0,0,0,0,0,0]
[null,0,{"$f":"C34*C$102*kg_mt","v":0},0,0,0,0,0,0,0,0,0,0,0]
[null,0,{"$f":"C35*C$102*kg_mt","v":0},0,0,0,0,0,0,0,0,0,0,0]
[null,0,{"$f":"C36*C$102*kg_mt","v":0},0,0,0,0,0,0,0,0,0,0,0]
[null,0,{"$f":"C37*C$102*kg_mt","v":0},0,0,0,0,0,0,0,0,0,0,0]
[null,0,{"$f":"C38*C$102*kg_mt","v":0},0,0,0,0,0,0,0,0,0,0,0]
[null,0,{"$f":"C39*C$102*kg_mt","v":0},0,0,0,0,0,0,0,0,0,0,0]
[null,0,{"$f":"C40*C$102*kg_mt","v":0},0,0,0,0,0,0,0,0,0,0,0]
[null,0,{"$f":"C41*C$102*kg_mt","v":0},0,0,0,0,0,0,0,0,0,0,0]
[null,0,{"$f":"C42*C$102*kg_mt","v":0},0,0,0,0,0,0,0,0,0,0,0]
[null,"Total",{"$f":"SUM(C103:C122)","v":0},0,0,0,0,0,0,0,0,0,0,0]
[]
[]
["Net CO2 Emissions"]
["Net CO2 Emissions (MT) = Gross CO2 Emissions - Biogenic CO2 Emissions"]
[null,null,"Gasoline","Diesel","Biodiesel (B5)","Biodiesel (B20)","Ethanol (E85)","CNG","LNG","LPG","Residual Fuel","Jet Fuel","Aviation Gasoline","TOTAL"]
["Dstart",{"$f":"B103","v":"Residential"},{"$f":"C77-C103","v":0},0,0,0,0,0,0,0,0,0,0,{"$f":"SUM(C129:M129)","v":0}]
[null,{"$f":"B104","v":"Commercial/Institutional"},{"$f":"C78-C104","v":101689.24881999999},71743.801570000011,0,0,0,0,0,0,0,0,0,{"$f":"SUM(C130:M130)","v":173433.05038999999}]
[null,"Industrial",{"$f":"C79-C105","v":0},0,0,0,0,0,0,0,0,0,0,0]
[null,"Energy Generation",{"$f":"C80-C106","v":0},0,0,0,0,0,0,0,0,0,0,0]
[null,0,{"$f":"C81-C107","v":0},0,0,0,0,0,0,0,0,0,0,0]
[null,0,{"$f":"C82-C108","v":0},0,0,0,0,0,0,0,0,0,0,0]
[null,0,{"$f":"C83-C109","v":0},0,0,0,0,0,0,0,0,0,0,0]
[null,0,{"$f":"C84-C110","v":0},0,0,0,0,0,0,0,0,0,0,0]
[null,0,{"$f":"C85-C111","v":0},0,0,0,0,0,0,0,0,0,0,0]
[null,0,{"$f":"C86-C112","v":0},0,0,0,0,0,0,0,0,0,0,0]
[null,0,{"$f":"C87-C113","v":0},0,0,0,0,0,0,0,0,0,0,0]
[null,0,{"$f":"C88-C114","v":0},0,0,0,0,0,0,0,0,0,0,0]
[null,0,{"$f":"C89-C115","v":0},0,0,0,0,0,0,0,0,0,0,0]
[null,0,{"$f":"C90-C116","v":0},0,0,0,0,0,0,0,0,0,0,0]
[null,0,{"$f":"C91-C117","v":0},0,0,0,0,0,0,0,0,0,0,0]
[null,0,{"$f":"C92-C118","v":0},0,0,0,0,0,0,0,0,0,0,0]
[null,0,{"$f":"C93-C119","v":0},0,0,0,0,0,0,0,0,0,0,0]
[null,0,{"$f":"C94-C120","v":0},0,0,0,0,0,0,0,0,0,0,0]
[null,0,{"$f":"C95-C121","v":0},0,0,0,0,0,0,0,0,0,0,0]
[null,0,{"$f":"C96-C122","v":0},0,0,0,0,0,0,0,0,0,0,0]
[null,"Total",{"$f":"SUM(C129:C148)","v":101689.24881999999},71743.801570000011,0,0,0,0,0,0,0,0,0,{"$f":"SUM(C149:M149)","v":173433.05038999999}]
[]
[]
[]
["Non-CO2 Calculations"]
[]
[]
[]
[]
[]
[]
[]
[]
[null,"Current sector:","Energy Generation",null,null,"The \"Update Calculations\" function on the Mobile-Entry sheet automatically runs these calculations for each sector."]
[null,null,null,null,null,"To view the calculations below for an individual sector, select the sector from the drop-down list in the shaded cell."]
["1) Highway Vehicles"]
[null,"VMT by Model Year and Vehicle Type",null,null,null,null,null,null,null,null,"CH4 Emissions by Model Year and Vehicle Type",null,null,null,null,null,null,null,null,"N2O Emissions by Model Year and Vehicle Type"]
[null,"Vehicle activity data by Model Year and vehicle type for the selected sector (miles).",null,null,null,null,null,null,null,null,"CH4 Emissions = VMT × Highway Emissions Factor (g/mi) × MT/g × GWP CH4",null,null,null,null,null,null,null,null,"N2O emissions = VMT × Highway Emissions Factor (g/mi) × MT/g × GWP N2O"]
[null,null,"Passenger Car","Light Truck (Vans, Pickup Trucks, SUVs)","Heavy-Duty Vehicle","Passenger Car","Light Truck (Vans, Pickup Trucks, SUVs)","Heavy-Duty Vehicle","TOTAL",null,null,"Passenger Car","Light Truck (Vans, Pickup Trucks, SUVs)","Heavy-Duty Vehicle","Passenger Car","Light Truck (Vans, Pickup Trucks, SUVs)","Heavy-Duty Vehicle","TOTAL",null,null,"Passenger Car","Light Truck (Vans, Pickup Trucks, SUVs)","Heavy-Duty Vehicle","Passenger Car","Light Truck (Vans, Pickup Trucks, SUVs)","Heavy-Duty Vehicle","TOTAL"]
[null,"Model Year","Gasoline","Gasoline","Gasoline","Diesel","Diesel","Diesel",null,null,"MY","Gasoline","Gasoline","Gasoline","Diesel","Diesel","Diesel",null,null,"MY","Gasoline","Gasoline","Gasoline","Diesel","Diesel","Diesel"]
[null,"1980 & earlier",{"$f":"SUMIFS('Mobile-Data'!$I$9:$I$1048576,'Mobile-Data'!$D$9:$D$1048576,\"<=1980\",'Mobile-Data'!$E$9:$E$1048576,'Mobile-Detail Calcs'!C$167,'Mobile-Data'!$G$9:$G$1048576,'Mobile-Detail Calcs'!C$168,'Mobile-Data'!$C$9:$C$1048576,'Mobile-Detail Calcs'!$C$162)","v":0},{"$f":"SUMIFS('Mobile-Data'!$I$9:$I$1048576,'Mobile-Data'!$D$9:$D$1048576,\"<=1980\",'Mobile-Data'!$E$9:$E$1048576,'Mobile-Detail Calcs'!D$167,'Mobile-Data'!$G$9:$G$1048576,'Mobile-Detail Calcs'!D$168,'Mobile-Data'!$C$9:$C$1048576,'Mobile-Detail Calcs'!$C$162)","v":0},{"$f":"SUMIFS('Mobile-Data'!$I$9:$I$1048576,'Mobile-Data'!$D$9:$D$1048576,\"<=1980\",'Mobile-Data'!$E$9:$E$1048576,'Mobile-Detail Calcs'!E$167,'Mobile-Data'!$G$9:$G$1048576,'Mobile-Detail Calcs'!E$168,'Mobile-Data'!$C$9:$C$1048576,'Mobile-Detail Calcs'!$C$162)","v":0},{"$f":"SUMIFS('Mobile-Data'!$I$9:$I$1048576,'Mobile-Data'!$D$9:$D$1048576,\"<=1980\",'Mobile-Data'!$E$9:$E$1048576,'Mobile-Detail Calcs'!F$167,'Mobile-Data'!$G$9:$G$1048576,'Mobile-Detail Calcs'!F$168,'Mobile-Data'!$C$9:$C$1048576,'Mobile-Detail Calcs'!$C$162)","v":0},{"$f":"SUMIFS('Mobile-Data'!$I$9:$I$1048576,'Mobile-Data'!$D$9:$D$1048576,\"<=1980\",'Mobile-Data'!$E$9:$E$1048576,'Mobile-Detail Calcs'!G$167,'Mobile-Data'!$G$9:$G$1048576,'Mobile-Detail Calcs'!G$168,'Mobile-Data'!$C$9:$C$1048576,'Mobile-Detail Calcs'!$C$162)","v":0},{"$f":"SUMIFS('Mobile-Data'!$I$9:$I$1048576,'Mobile-Data'!$D$9:$D$1048576,\"<=1980\",'Mobile-Data'!$E$9:$E$1048576,'Mobile-Detail Calcs'!H$167,'Mobile-Data'!$G$9:$G$1048576,'Mobile-Detail Calcs'!H$168,'Mobile-Data'!$C$9:$C$1048576,'Mobile-Detail Calcs'!$C$162)","v":0},{"$f":"SUM(C169:H169)","v":0},null,"1980 & earlier",{"$f":"C169*Factors!C209*g_kg*kg_mt*GWP_CH4","v":0},{"$f":"D169*Factors!D209*g_kg*kg_mt*GWP_CH4","v":0},{"$f":"E169*Factors!E209*g_kg*kg_mt*GWP_CH4","v":0},{"$f":"F169*Factors!F209*g_kg*kg_mt*GWP_CH4","v":0},{"$f":"G169*Factors!G209*g_kg*kg_mt*GWP_CH4","v":0},{"$f":"H169*Factors!H209*g_kg*kg_mt*GWP_CH4","v":0},{"$f":"SUM(L169:Q169)","v":0},null,"1980 & earlier",{"$f":"C169*Factors!K209*g_kg*kg_mt*GWP_N2O","v":0},{"$f":"D169*Factors!L209*g_kg*kg_mt*GWP_N2O","v":0},{"$f":"E169*Factors!M209*g_kg*kg_mt*GWP_N2O","v":0},{"$f":"F169*Factors!N209*g_kg*kg_mt*GWP_N2O","v":0},{"$f":"G169*Factors!O209*g_kg*kg_mt*GWP_N2O","v":0},{"$f":"H169*Factors!P209*g_kg*kg_mt*GWP_N2O","v":0},{"$f":"SUM(U169:Z169)","v":0}]
[null,1981,{"$f":"SUMIFS('Mobile-Data'!$I$9:$I$1048576,'Mobile-Data'!$D$9:$D$1048576,$B170,'Mobile-Data'!$E$9:$E$1048576,'Mobile-Detail Calcs'!C$167,'Mobile-Data'!$G$9:$G$1048576,'Mobile-Detail Calcs'!C$168,'Mobile-Data'!$C$9:$C$1048576,'Mobile-Detail Calcs'!$C$162)","v":0},{"$f":"SUMIFS('Mobile-Data'!$I$9:$I$1048576,'Mobile-Data'!$D$9:$D$1048576,$B170,'Mobile-Data'!$E$9:$E$1048576,'Mobile-Detail Calcs'!D$167,'Mobile-Data'!$G$9:$G$1048576,'Mobile-Detail Calcs'!D$168,'Mobile-Data'!$C$9:$C$1048576,'Mobile-Detail Calcs'!$C$162)","v":0},{"$f":"SUMIFS('Mobile-Data'!$I$9:$I$1048576,'Mobile-Data'!$D$9:$D$1048576,$B170,'Mobile-Data'!$E$9:$E$1048576,'Mobile-Detail Calcs'!E$167,'Mobile-Data'!$G$9:$G$1048576,'Mobile-Detail Calcs'!E$168,'Mobile-Data'!$C$9:$C$1048576,'Mobile-Detail Calcs'!$C$162)","v":0},{"$f":"SUMIFS('Mobile-Data'!$I$9:$I$1048576,'Mobile-Data'!$D$9:$D$1048576,$B170,'Mobile-Data'!$E$9:$E$1048576,'Mobile-Detail Calcs'!F$167,'Mobile-Data'!$G$9:$G$1048576,'Mobile-Detail Calcs'!F$168,'Mobile-Data'!$C$9:$C$1048576,'Mobile-Detail Calcs'!$C$162)","v":0},{"$f":"SUMIFS('Mobile-Data'!$I$9:$I$1048576,'Mobile-Data'!$D$9:$D$1048576,$B170,'Mobile-Data'!$E$9:$E$1048576,'Mobile-Detail Calcs'!G$167,'Mobile-Data'!$G$9:$G$1048576,'Mobile-Detail Calcs'!G$168,'Mobile-Data'!$C$9:$C$1048576,'Mobile-Detail Calcs'!$C$162)","v":0},{"$f":"SUMIFS('Mobile-Data'!$I$9:$I$1048576,'Mobile-Data'!$D$9:$D$1048576,$B170,'Mobile-Data'!$E$9:$E$1048576,'Mobile-Detail Calcs'!H$167,'Mobile-Data'!$G$9:$G$1048576,'Mobile-Detail Calcs'!H$168,'Mobile-Data'!$C$9:$C$1048576,'Mobile-Detail Calcs'!$C$162)","v":0},{"$f":"SUM(C170:H170)","v":0},null,1981,{"$f":"C170*Factors!C210*g_kg*kg_mt*GWP_CH4","v":0},{"$f":"D170*Factors!D210*g_kg*kg_mt*GWP_CH4","v":0},{"$f":"E170*Factors!E210*g_kg*kg_mt*GWP_CH4","v":0},{"$f":"F170*Factors!F210*g_kg*kg_mt*GWP_CH4","v":0},{"$f":"G170*Factors!G210*g_kg*kg_mt*GWP_CH4","v":0},{"$f":"H170*Factors!H210*g_kg*kg_mt*GWP_CH4","v":0},{"$f":"SUM(L170:Q170)","v":0},null,1981,{"$f":"C170*Factors!K210*g_kg*kg_mt*GWP_N2O","v":0},{"$f":"D170*Factors!L210*g_kg*kg_mt*GWP_N2O","v":0},{"$f":"E170*Factors!M210*g_kg*kg_mt*GWP_N2O","v":0},{"$f":"F170*Factors!N210*g_kg*kg_mt*GWP_N2O","v":0},{"$f":"G170*Factors!O210*g_kg*kg_mt*GWP_N2O","v":0},{"$f":"H170*Factors!P210*g_kg*kg_mt*GWP_N2O","v":0},{"$f":"SUM(U170:Z170)","v":0}]
[null,1982,{"$f":"SUMIFS('Mobile-Data'!$I$9:$I$1048576,'Mobile-Data'!$D$9:$D$1048576,$B171,'Mobile-Data'!$E$9:$E$1048576,'Mobile-Detail Calcs'!C$167,'Mobile-Data'!$G$9:$G$1048576,'Mobile-Detail Calcs'!C$168,'Mobile-Data'!$C$9:$C$1048576,'Mobile-Detail Calcs'!$C$162)","v":0},{"$f":"SUMIFS('Mobile-Data'!$I$9:$I$1048576,'Mobile-Data'!$D$9:$D$1048576,$B171,'Mobile-Data'!$E$9:$E$1048576,'Mobile-Detail Calcs'!D$167,'Mobile-Data'!$G$9:$G$1048576,'Mobile-Detail Calcs'!D$168,'Mobile-Data'!$C$9:$C$1048576,'Mobile-Detail Calcs'!$C$162)","v":0},{"$f":"SUMIFS('Mobile-Data'!$I$9:$I$1048576,'Mobile-Data'!$D$9:$D$1048576,$B171,'Mobile-Data'!$E$9:$E$1048576,'Mobile-Detail Calcs'!E$167,'Mobile-Data'!$G$9:$G$1048576,'Mobile-Detail Calcs'!E$168,'Mobile-Data'!$C$9:$C$1048576,'Mobile-Detail Calcs'!$C$162)","v":0},{"$f":"SUMIFS('Mobile-Data'!$I$9:$I$1048576,'Mobile-Data'!$D$9:$D$1048576,$B171,'Mobile-Data'!$E$9:$E$1048576,'Mobile-Detail Calcs'!F$167,'Mobile-Data'!$G$9:$G$1048576,'Mobile-Detail Calcs'!F$168,'Mobile-Data'!$C$9:$C$1048576,'Mobile-Detail Calcs'!$C$162)","v":0},{"$f":"SUMIFS('Mobile-Data'!$I$9:$I$1048576,'Mobile-Data'!$D$9:$D$1048576,$B171,'Mobile-Data'!$E$9:$E$1048576,'Mobile-Detail Calcs'!G$167,'Mobile-Data'!$G$9:$G$1048576,'Mobile-Detail Calcs'!G$168,'Mobile-Data'!$C$9:$C$1048576,'Mobile-Detail Calcs'!$C$162)","v":0},{"$f":"SUMIFS('Mobile-Data'!$I$9:$I$1048576,'Mobile-Data'!$D$9:$D$1048576,$B171,'Mobile-Data'!$E$9:$E$1048576,'Mobile-Detail Calcs'!H$167,'Mobile-Data'!$G$9:$G$1048576,'Mobile-Detail Calcs'!H$168,'Mobile-Data'!$C$9:$C$1048576,'Mobile-Detail Calcs'!$C$162)","v":0},0,null,1982,{"$f":"C171*Factors!C211*g_kg*kg_mt*GWP_CH4","v":0},{"$f":"D171*Factors!D211*g_kg*kg_mt*GWP_CH4","v":0},{"$f":"E171*Factors!E211*g_kg*kg_mt*GWP_CH4","v":0},{"$f":"F171*Factors!F211*g_kg*kg_mt*GWP_CH4","v":0},{"$f":"G171*Factors!G211*g_kg*kg_mt*GWP_CH4","v":0},{"$f":"H171*Factors!H211*g_kg*kg_mt*GWP_CH4","v":0},0,null,1982,{"$f":"C171*Factors!K211*g_kg*kg_mt*GWP_N2O","v":0},{"$f":"D171*Factors!L211*g_kg*kg_mt*GWP_N2O","v":0},{"$f":"E171*Factors!M211*g_kg*kg_mt*GWP_N2O","v":0},{"$f":"F171*Factors!N211*g_kg*kg_mt*GWP_N2O","v":0},{"$f":"G171*Factors!O211*g_kg*kg_mt*GWP_N2O","v":0},{"$f":"H171*Factors!P211*g_kg*kg_mt*GWP_N2O","v":0},0]
[null,1983,{"$f":"SUMIFS('Mobile-Data'!$I$9:$I$1048576,'Mobile-Data'!$D$9:$D$1048576,$B172,'Mobile-Data'!$E$9:$E$1048576,'Mobile-Detail Calcs'!C$167,'Mobile-Data'!$G$9:$G$1048576,'Mobile-Detail Calcs'!C$168,'Mobile-Data'!$C$9:$C$1048576,'Mobile-Detail Calcs'!$C$162)","v":0},{"$f":"SUMIFS('Mobile-Data'!$I$9:$I$1048576,'Mobile-Data'!$D$9:$D$1048576,$B172,'Mobile-Data'!$E$9:$E$1048576,'Mobile-Detail Calcs'!D$167,'Mobile-Data'!$G$9:$G$1048576,'Mobile-Detail Calcs'!D$168,'Mobile-Data'!$C$9:$C$1048576,'Mobile-Detail Calcs'!$C$162)","v":0},{"$f":"SUMIFS('Mobile-Data'!$I$9:$I$1048576,'Mobile-Data'!$D$9:$D$1048576,$B172,'Mobile-Data'!$E$9:$E$1048576,'Mobile-Detail Calcs'!E$167,'Mobile-Data'!$G$9:$G$1048576,'Mobile-Detail Calcs'!E$168,'Mobile-Data'!$C$9:$C$1048576,'Mobile-Detail Calcs'!$C$162)","v":0},{"$f":"SUMIFS('Mobile-Data'!$I$9:$I$1048576,'Mobile-Data'!$D$9:$D$1048576,$B172,'Mobile-Data'!$E$9:$E$1048576,'Mobile-Detail Calcs'!F$167,'Mobile-Data'!$G$9:$G$1048576,'Mobile-Detail Calcs'!F$168,'Mobile-Data'!$C$9:$C$1048576,'Mobile-Detail Calcs'!$C$162)","v":0},{"$f":"SUMIFS('Mobile-Data'!$I$9:$I$1048576,'Mobile-Data'!$D$9:$D$1048576,$B172,'Mobile-Data'!$E$9:$E$1048576,'Mobile-Detail Calcs'!G$167,'Mobile-Data'!$G$9:$G$1048576,'Mobile-Detail Calcs'!G$168,'Mobile-Data'!$C$9:$C$1048576,'Mobile-Detail Calcs'!$C$162)","v":0},{"$f":"SUMIFS('Mobile-Data'!$I$9:$I$1048576,'Mobile-Data'!$D$9:$D$1048576,$B172,'Mobile-Data'!$E$9:$E$1048576,'Mobile-Detail Calcs'!H$167,'Mobile-Data'!$G$9:$G$1048576,'Mobile-Detail Calcs'!H$168,'Mobile-Data'!$C$9:$C$1048576,'Mobile-Detail Calcs'!$C$162)","v":0},0,null,1983,{"$f":"C172*Factors!C212*g_kg*kg_mt*GWP_CH4","v":0},{"$f":"D172*Factors!D212*g_kg*kg_mt*GWP_CH4","v":0},{"$f":"E172*Factors!E212*g_kg*kg_mt*GWP_CH4","v":0},{"$f":"F172*Factors!F212*g_kg*kg_mt*GWP_CH4","v":0},{"$f":"G172*Factors!G212*g_kg*kg_mt*GWP_CH4","v":0},{"$f":"H172*Factors!H212*g_kg*kg_mt*GWP_CH4","v":0},0,null,1983,{"$f":"C172*Factors!K212*g_kg*kg_mt*GWP_N2O","v":0},{"$f":"D172*Factors!L212*g_kg*kg_mt*GWP_N2O","v":0},{"$f":"E172*Factors!M212*g_kg*kg_mt*GWP_N2O","v":0},{"$f":"F172*Factors!N212*g_kg*kg_mt*GWP_N2O","v":0},{"$f":"G172*Factors!O212*g_kg*kg_mt*GWP_N2O","v":0},{"$f":"H172*Factors!P212*g_kg*kg_mt*GWP_N2O","v":0},0]
[null,1984,{"$f":"SUMIFS('Mobile-Data'!$I$9:$I$1048576,'Mobile-Data'!$D$9:$D$1048576,$B173,'Mobile-Data'!$E$9:$E$1048576,'Mobile-Detail Calcs'!C$167,'Mobile-Data'!$G$9:$G$1048576,'Mobile-Detail Calcs'!C$168,'Mobile-Data'!$C$9:$C$1048576,'Mobile-Detail Calcs'!$C$162)","v":0},{"$f":"SUMIFS('Mobile-Data'!$I$9:$I$1048576,'Mobile-Data'!$D$9:$D$1048576,$B173,'Mobile-Data'!$E$9:$E$1048576,'Mobile-Detail Calcs'!D$167,'Mobile-Data'!$G$9:$G$1048576,'Mobile-Detail Calcs'!D$168,'Mobile-Data'!$C$9:$C$1048576,'Mobile-Detail Calcs'!$C$162)","v":0},{"$f":"SUMIFS('Mobile-Data'!$I$9:$I$1048576,'Mobile-Data'!$D$9:$D$1048576,$B173,'Mobile-Data'!$E$9:$E$1048576,'Mobile-Detail Calcs'!E$167,'Mobile-Data'!$G$9:$G$1048576,'Mobile-Detail Calcs'!E$168,'Mobile-Data'!$C$9:$C$1048576,'Mobile-Detail Calcs'!$C$162)","v":0},{"$f":"SUMIFS('Mobile-Data'!$I$9:$I$1048576,'Mobile-Data'!$D$9:$D$1048576,$B173,'Mobile-Data'!$E$9:$E$1048576,'Mobile-Detail Calcs'!F$167,'Mobile-Data'!$G$9:$G$1048576,'Mobile-Detail Calcs'!F$168,'Mobile-Data'!$C$9:$C$1048576,'Mobile-Detail Calcs'!$C$162)","v":0},{"$f":"SUMIFS('Mobile-Data'!$I$9:$I$1048576,'Mobile-Data'!$D$9:$D$1048576,$B173,'Mobile-Data'!$E$9:$E$1048576,'Mobile-Detail Calcs'!G$167,'Mobile-Data'!$G$9:$G$1048576,'Mobile-Detail Calcs'!G$168,'Mobile-Data'!$C$9:$C$1048576,'Mobile-Detail Calcs'!$C$162)","v":0},{"$f":"SUMIFS('Mobile-Data'!$I$9:$I$1048576,'Mobile-Data'!$D$9:$D$1048576,$B173,'Mobile-Data'!$E$9:$E$1048576,'Mobile-Detail Calcs'!H$167,'Mobile-Data'!$G$9:$G$1048576,'Mobile-Detail Calcs'!H$168,'Mobile-Data'!$C$9:$C$1048576,'Mobile-Detail Calcs'!$C$162)","v":0},0,null,1984,{"$f":"C173*Factors!C213*g_kg*kg_mt*GWP_CH4","v":0},{"$f":"D173*Factors!D213*g_kg*kg_mt*GWP_CH4","v":0},{"$f":"E173*Factors!E213*g_kg*kg_mt*GWP_CH4","v":0},{"$f":"F173*Factors!F213*g_kg*kg_mt*GWP_CH4","v":0},{"$f":"G173*Factors!G213*g_kg*kg_mt*GWP_CH4","v":0},{"$f":"H173*Factors!H213*g_kg*kg_mt*GWP_CH4","v":0},0,null,1984,{"$f":"C173*Factors!K213*g_kg*kg_mt*GWP_N2O","v":0},{"$f":"D173*Factors!L213*g_kg*kg_mt*GWP_N2O","v":0},{"$f":"E173*Factors!M213*g_kg*kg_mt*GWP_N2O","v":0},{"$f":"F173*Factors!N213*g_kg*kg_mt*GWP_N2O","v":0},{"$f":"G173*Factors!O213*g_kg*kg_mt*GWP_N2O","v":0},{"$f":"H173*Factors!P213*g_kg*kg_mt*GWP_N2O","v":0},0]
[null,1985,{"$f":"SUMIFS('Mobile-Data'!$I$9:$I$1048576,'Mobile-Data'!$D$9:$D$1048576,$B174,'Mobile-Data'!$E$9:$E$1048576,'Mobile-Detail Calcs'!C$167,'Mobile-Data'!$G$9:$G$1048576,'Mobile-Detail Calcs'!C$168,'Mobile-Data'!$C$9:$C$1048576,'Mobile-Detail Calcs'!$C$162)","v":0},{"$f":"SUMIFS('Mobile-Data'!$I$9:$I$1048576,'Mobile-Data'!$D$9:$D$1048576,$B174,'Mobile-Data'!$E$9:$E$1048576,'Mobile-Detail Calcs'!D$167,'Mobile-Data'!$G$9:$G$1048576,'Mobile-Detail Calcs'!D$168,'Mobile-Data'!$C$9:$C$1048576,'Mobile-Detail Calcs'!$C$162)","v":0},{"$f":"SUMIFS('Mobile-Data'!$I$9:$I$1048576,'Mobile-Data'!$D$9:$D$1048576,$B174,'Mobile-Data'!$E$9:$E$1048576,'Mobile-Detail Calcs'!E$167,'Mobile-Data'!$G$9:$G$1048576,'Mobile-Detail Calcs'!E$168,'Mobile-Data'!$C$9:$C$1048576,'Mobile-Detail Calcs'!$C$162)","v":0},{"$f":"SUMIFS('Mobile-Data'!$I$9:$I$1048576,'Mobile-Data'!$D$9:$D$1048576,$B174,'Mobile-Data'!$E$9:$E$1048576,'Mobile-Detail Calcs'!F$167,'Mobile-Data'!$G$9:$G$1048576,'Mobile-Detail Calcs'!F$168,'Mobile-Data'!$C$9:$C$1048576,'Mobile-Detail Calcs'!$C$162)","v":0},{"$f":"SUMIFS('Mobile-Data'!$I$9:$I$1048576,'Mobile-Data'!$D$9:$D$1048576,$B174,'Mobile-Data'!$E$9:$E$1048576,'Mobile-Detail Calcs'!G$167,'Mobile-Data'!$G$9:$G$1048576,'Mobile-Detail Calcs'!G$168,'Mobile-Data'!$C$9:$C$1048576,'Mobile-Detail Calcs'!$C$162)","v":0},{"$f":"SUMIFS('Mobile-Data'!$I$9:$I$1048576,'Mobile-Data'!$D$9:$D$1048576,$B174,'Mobile-Data'!$E$9:$E$1048576,'Mobile-Detail Calcs'!H$167,'Mobile-Data'!$G$9:$G$1048576,'Mobile-Detail Calcs'!H$168,'Mobile-Data'!$C$9:$C$1048576,'Mobile-Detail Calcs'!$C$162)","v":0},0,null,1985,{"$f":"C174*Factors!C214*g_kg*kg_mt*GWP_CH4","v":0},{"$f":"D174*Factors!D214*g_kg*kg_mt*GWP_CH4","v":0},{"$f":"E174*Factors!E214*g_kg*kg_mt*GWP_CH4","v":0},{"$f":"F174*Factors!F214*g_kg*kg_mt*GWP_CH4","v":0},{"$f":"G174*Factors!G214*g_kg*kg_mt*GWP_CH4","v":0},{"$f":"H174*Factors!H214*g_kg*kg_mt*GWP_CH4","v":0},0,null,1985,{"$f":"C174*Factors!K214*g_kg*kg_mt*GWP_N2O","v":0},{"$f":"D174*Factors!L214*g_kg*kg_mt*GWP_N2O","v":0},{"$f":"E174*Factors!M214*g_kg*kg_mt*GWP_N2O","v":0},{"$f":"F174*Factors!N214*g_kg*kg_mt*GWP_N2O","v":0},{"$f":"G174*Factors!O214*g_kg*kg_mt*GWP_N2O","v":0},{"$f":"H174*Factors!P214*g_kg*kg_mt*GWP_N2O","v":0},0]
[null,1986,{"$f":"SUMIFS('Mobile-Data'!$I$9:$I$1048576,'Mobile-Data'!$D$9:$D$1048576,$B175,'Mobile-Data'!$E$9:$E$1048576,'Mobile-Detail Calcs'!C$167,'Mobile-Data'!$G$9:$G$1048576,'Mobile-Detail Calcs'!C$168,'Mobile-Data'!$C$9:$C$1048576,'Mobile-Detail Calcs'!$C$162)","v":0},{"$f":"SUMIFS('Mobile-Data'!$I$9:$I$1048576,'Mobile-Data'!$D$9:$D$1048576,$B175,'Mobile-Data'!$E$9:$E$1048576,'Mobile-Detail Calcs'!D$167,'Mobile-Data'!$G$9:$G$1048576,'Mobile-Detail Calcs'!D$168,'Mobile-Data'!$C$9:$C$1048576,'Mobile-Detail Calcs'!$C$162)","v":0},{"$f":"SUMIFS('Mobile-Data'!$I$9:$I$1048576,'Mobile-Data'!$D$9:$D$1048576,$B175,'Mobile-Data'!$E$9:$E$1048576,'Mobile-Detail Calcs'!E$167,'Mobile-Data'!$G$9:$G$1048576,'Mobile-Detail Calcs'!E$168,'Mobile-Data'!$C$9:$C$1048576,'Mobile-Detail Calcs'!$C$162)","v":0},{"$f":"SUMIFS('Mobile-Data'!$I$9:$I$1048576,'Mobile-Data'!$D$9:$D$1048576,$B175,'Mobile-Data'!$E$9:$E$1048576,'Mobile-Detail Calcs'!F$167,'Mobile-Data'!$G$9:$G$1048576,'Mobile-Detail Calcs'!F$168,'Mobile-Data'!$C$9:$C$1048576,'Mobile-Detail Calcs'!$C$162)","v":0},{"$f":"SUMIFS('Mobile-Data'!$I$9:$I$1048576,'Mobile-Data'!$D$9:$D$1048576,$B175,'Mobile-Data'!$E$9:$E$1048576,'Mobile-Detail Calcs'!G$167,'Mobile-Data'!$G$9:$G$1048576,'Mobile-Detail Calcs'!G$168,'Mobile-Data'!$C$9:$C$1048576,'Mobile-Detail Calcs'!$C$162)","v":0},{"$f":"SUMIFS('Mobile-Data'!$I$9:$I$1048576,'Mobile-Data'!$D$9:$D$1048576,$B175,'Mobile-Data'!$E$9:$E$1048576,'Mobile-Detail Calcs'!H$167,'Mobile-Data'!$G$9:$G$1048576,'Mobile-Detail Calcs'!H$168,'Mobile-Data'!$C$9:$C$1048576,'Mobile-Detail Calcs'!$C$162)","v":0},0,null,1986,{"$f":"C175*Factors!C215*g_kg*kg_mt*GWP_CH4","v":0},{"$f":"D175*Factors!D215*g_kg*kg_mt*GWP_CH4","v":0},{"$f":"E175*Factors!E215*g_kg*kg_mt*GWP_CH4","v":0},{"$f":"F175*Factors!F215*g_kg*kg_mt*GWP_CH4","v":0},{"$f":"G175*Factors!G215*g_kg*kg_mt*GWP_CH4","v":0},{"$f":"H175*Factors!H215*g_kg*kg_mt*GWP_CH4","v":0},0,null,1986,{"$f":"C175*Factors!K215*g_kg*kg_mt*GWP_N2O","v":0},{"$f":"D175*Factors!L215*g_kg*kg_mt*GWP_N2O","v":0},{"$f":"E175*Factors!M215*g_kg*kg_mt*GWP_N2O","v":0},{"$f":"F175*Factors!N215*g_kg*kg_mt*GWP_N2O","v":0},{"$f":"G175*Factors!O215*g_kg*kg_mt*GWP_N2O","v":0},{"$f":"H175*Factors!P215*g_kg*kg_mt*GWP_N2O","v":0},0]
[null,1987,{"$f":"SUMIFS('Mobile-Data'!$I$9:$I$1048576,'Mobile-Data'!$D$9:$D$1048576,$B176,'Mobile-Data'!$E$9:$E$1048576,'Mobile-Detail Calcs'!C$167,'Mobile-Data'!$G$9:$G$1048576,'Mobile-Detail Calcs'!C$168,'Mobile-Data'!$C$9:$C$1048576,'Mobile-Detail Calcs'!$C$162)","v":0},{"$f":"SUMIFS('Mobile-Data'!$I$9:$I$1048576,'Mobile-Data'!$D$9:$D$1048576,$B176,'Mobile-Data'!$E$9:$E$1048576,'Mobile-Detail Calcs'!D$167,'Mobile-Data'!$G$9:$G$1048576,'Mobile-Detail Calcs'!D$168,'Mobile-Data'!$C$9:$C$1048576,'Mobile-Detail Calcs'!$C$162)","v":0},{"$f":"SUMIFS('Mobile-Data'!$I$9:$I$1048576,'Mobile-Data'!$D$9:$D$1048576,$B176,'Mobile-Data'!$E$9:$E$1048576,'Mobile-Detail Calcs'!E$167,'Mobile-Data'!$G$9:$G$1048576,'Mobile-Detail Calcs'!E$168,'Mobile-Data'!$C$9:$C$1048576,'Mobile-Detail Calcs'!$C$162)","v":0},{"$f":"SUMIFS('Mobile-Data'!$I$9:$I$1048576,'Mobile-Data'!$D$9:$D$1048576,$B176,'Mobile-Data'!$E$9:$E$1048576,'Mobile-Detail Calcs'!F$167,'Mobile-Data'!$G$9:$G$1048576,'Mobile-Detail Calcs'!F$168,'Mobile-Data'!$C$9:$C$1048576,'Mobile-Detail Calcs'!$C$162)","v":0},{"$f":"SUMIFS('Mobile-Data'!$I$9:$I$1048576,'Mobile-Data'!$D$9:$D$1048576,$B176,'Mobile-Data'!$E$9:$E$1048576,'Mobile-Detail Calcs'!G$167,'Mobile-Data'!$G$9:$G$1048576,'Mobile-Detail Calcs'!G$168,'Mobile-Data'!$C$9:$C$1048576,'Mobile-Detail Calcs'!$C$162)","v":0},{"$f":"SUMIFS('Mobile-Data'!$I$9:$I$1048576,'Mobile-Data'!$D$9:$D$1048576,$B176,'Mobile-Data'!$E$9:$E$1048576,'Mobile-Detail Calcs'!H$167,'Mobile-Data'!$G$9:$G$1048576,'Mobile-Detail Calcs'!H$168,'Mobile-Data'!$C$9:$C$1048576,'Mobile-Detail Calcs'!$C$162)","v":0},0,null,1987,{"$f":"C176*Factors!C216*g_kg*kg_mt*GWP_CH4","v":0},{"$f":"D176*Factors!D216*g_kg*kg_mt*GWP_CH4","v":0},{"$f":"E176*Factors!E216*g_kg*kg_mt*GWP_CH4","v":0},{"$f":"F176*Factors!F216*g_kg*kg_mt*GWP_CH4","v":0},{"$f":"G176*Factors!G216*g_kg*kg_mt*GWP_CH4","v":0},{"$f":"H176*Factors!H216*g_kg*kg_mt*GWP_CH4","v":0},0,null,1987,{"$f":"C176*Factors!K216*g_kg*kg_mt*GWP_N2O","v":0},{"$f":"D176*Factors!L216*g_kg*kg_mt*GWP_N2O","v":0},{"$f":"E176*Factors!M216*g_kg*kg_mt*GWP_N2O","v":0},{"$f":"F176*Factors!N216*g_kg*kg_mt*GWP_N2O","v":0},{"$f":"G176*Factors!O216*g_kg*kg_mt*GWP_N2O","v":0},{"$f":"H176*Factors!P216*g_kg*kg_mt*GWP_N2O","v":0},0]
[null,1988,{"$f":"SUMIFS('Mobile-Data'!$I$9:$I$1048576,'Mobile-Data'!$D$9:$D$1048576,$B177,'Mobile-Data'!$E$9:$E$1048576,'Mobile-Detail Calcs'!C$167,'Mobile-Data'!$G$9:$G$1048576,'Mobile-Detail Calcs'!C$168,'Mobile-Data'!$C$9:$C$1048576,'Mobile-Detail Calcs'!$C$162)","v":0},{"$f":"SUMIFS('Mobile-Data'!$I$9:$I$1048576,'Mobile-Data'!$D$9:$D$1048576,$B177,'Mobile-Data'!$E$9:$E$1048576,'Mobile-Detail Calcs'!D$167,'Mobile-Data'!$G$9:$G$1048576,'Mobile-Detail Calcs'!D$168,'Mobile-Data'!$C$9:$C$1048576,'Mobile-Detail Calcs'!$C$162)","v":0},{"$f":"SUMIFS('Mobile-Data'!$I$9:$I$1048576,'Mobile-Data'!$D$9:$D$1048576,$B177,'Mobile-Data'!$E$9:$E$1048576,'Mobile-Detail Calcs'!E$167,'Mobile-Data'!$G$9:$G$1048576,'Mobile-Detail Calcs'!E$168,'Mobile-Data'!$C$9:$C$1048576,'Mobile-Detail Calcs'!$C$162)","v":0},{"$f":"SUMIFS('Mobile-Data'!$I$9:$I$1048576,'Mobile-Data'!$D$9:$D$1048576,$B177,'Mobile-Data'!$E$9:$E$1048576,'Mobile-Detail Calcs'!F$167,'Mobile-Data'!$G$9:$G$1048576,'Mobile-Detail Calcs'!F$168,'Mobile-Data'!$C$9:$C$1048576,'Mobile-Detail Calcs'!$C$162)","v":0},{"$f":"SUMIFS('Mobile-Data'!$I$9:$I$1048576,'Mobile-Data'!$D$9:$D$1048576,$B177,'Mobile-Data'!$E$9:$E$1048576,'Mobile-Detail Calcs'!G$167,'Mobile-Data'!$G$9:$G$1048576,'Mobile-Detail Calcs'!G$168,'Mobile-Data'!$C$9:$C$1048576,'Mobile-Detail Calcs'!$C$162)","v":0},{"$f":"SUMIFS('Mobile-Data'!$I$9:$I$1048576,'Mobile-Data'!$D$9:$D$1048576,$B177,'Mobile-Data'!$E$9:$E$1048576,'Mobile-Detail Calcs'!H$167,'Mobile-Data'!$G$9:$G$1048576,'Mobile-Detail Calcs'!H$168,'Mobile-Data'!$C$9:$C$1048576,'Mobile-Detail Calcs'!$C$162)","v":0},0,null,1988,{"$f":"C177*Factors!C217*g_kg*kg_mt*GWP_CH4","v":0},{"$f":"D177*Factors!D217*g_kg*kg_mt*GWP_CH4","v":0},{"$f":"E177*Factors!E217*g_kg*kg_mt*GWP_CH4","v":0},{"$f":"F177*Factors!F217*g_kg*kg_mt*GWP_CH4","v":0},{"$f":"G177*Factors!G217*g_kg*kg_mt*GWP_CH4","v":0},{"$f":"H177*Factors!H217*g_kg*kg_mt*GWP_CH4","v":0},0,null,1988,{"$f":"C177*Factors!K217*g_kg*kg_mt*GWP_N2O","v":0},{"$f":"D177*Factors!L217*g_kg*kg_mt*GWP_N2O","v":0},{"$f":"E177*Factors!M217*g_kg*kg_mt*GWP_N2O","v":0},{"$f":"F177*Factors!N217*g_kg*kg_mt*GWP_N2O","v":0},{"$f":"G177*Factors!O217*g_kg*kg_mt*GWP_N2O","v":0},{"$f":"H177*Factors!P217*g_kg*kg_mt*GWP_N2O","v":0},0]
[null,1989,{"$f":"SUMIFS('Mobile-Data'!$I$9:$I$1048576,'Mobile-Data'!$D$9:$D$1048576,$B178,'Mobile-Data'!$E$9:$E$1048576,'Mobile-Detail Calcs'!C$167,'Mobile-Data'!$G$9:$G$1048576,'Mobile-Detail Calcs'!C$168,'Mobile-Data'!$C$9:$C$1048576,'Mobile-Detail Calcs'!$C$162)","v":0},{"$f":"SUMIFS('Mobile-Data'!$I$9:$I$1048576,'Mobile-Data'!$D$9:$D$1048576,$B178,'Mobile-Data'!$E$9:$E$1048576,'Mobile-Detail Calcs'!D$167,'Mobile-Data'!$G$9:$G$1048576,'Mobile-Detail Calcs'!D$168,'Mobile-Data'!$C$9:$C$1048576,'Mobile-Detail Calcs'!$C$162)","v":0},{"$f":"SUMIFS('Mobile-Data'!$I$9:$I$1048576,'Mobile-Data'!$D$9:$D$1048576,$B178,'Mobile-Data'!$E$9:$E$1048576,'Mobile-Detail Calcs'!E$167,'Mobile-Data'!$G$9:$G$1048576,'Mobile-Detail Calcs'!E$168,'Mobile-Data'!$C$9:$C$1048576,'Mobile-Detail Calcs'!$C$162)","v":0},{"$f":"SUMIFS('Mobile-Data'!$I$9:$I$1048576,'Mobile-Data'!$D$9:$D$1048576,$B178,'Mobile-Data'!$E$9:$E$1048576,'Mobile-Detail Calcs'!F$167,'Mobile-Data'!$G$9:$G$1048576,'Mobile-Detail Calcs'!F$168,'Mobile-Data'!$C$9:$C$1048576,'Mobile-Detail Calcs'!$C$162)","v":0},{"$f":"SUMIFS('Mobile-Data'!$I$9:$I$1048576,'Mobile-Data'!$D$9:$D$1048576,$B178,'Mobile-Data'!$E$9:$E$1048576,'Mobile-Detail Calcs'!G$167,'Mobile-Data'!$G$9:$G$1048576,'Mobile-Detail Calcs'!G$168,'Mobile-Data'!$C$9:$C$1048576,'Mobile-Detail Calcs'!$C$162)","v":0},{"$f":"SUMIFS('Mobile-Data'!$I$9:$I$1048576,'Mobile-Data'!$D$9:$D$1048576,$B178,'Mobile-Data'!$E$9:$E$1048576,'Mobile-Detail Calcs'!H$167,'Mobile-Data'!$G$9:$G$1048576,'Mobile-Detail Calcs'!H$168,'Mobile-Data'!$C$9:$C$1048576,'Mobile-Detail Calcs'!$C$162)","v":0},0,null,1989,{"$f":"C178*Factors!C218*g_kg*kg_mt*GWP_CH4","v":0},{"$f":"D178*Factors!D218*g_kg*kg_mt*GWP_CH4","v":0},{"$f":"E178*Factors!E218*g_kg*kg_mt*GWP_CH4","v":0},{"$f":"F178*Factors!F218*g_kg*kg_mt*GWP_CH4","v":0},{"$f":"G178*Factors!G218*g_kg*kg_mt*GWP_CH4","v":0},{"$f":"H178*Factors!H218*g_kg*kg_mt*GWP_CH4","v":0},0,null,1989,{"$f":"C178*Factors!K218*g_kg*kg_mt*GWP_N2O","v":0},{"$f":"D178*Factors!L218*g_kg*kg_mt*GWP_N2O","v":0},{"$f":"E178*Factors!M218*g_kg*kg_mt*GWP_N2O","v":0},{"$f":"F178*Factors!N218*g_kg*kg_mt*GWP_N2O","v":0},{"$f":"G178*Factors!O218*g_kg*kg_mt*GWP_N2O","v":0},{"$f":"H178*Factors!P218*g_kg*kg_mt*GWP_N2O","v":0},0]
[null,1990,{"$f":"SUMIFS('Mobile-Data'!$I$9:$I$1048576,'Mobile-Data'!$D$9:$D$1048576,$B179,'Mobile-Data'!$E$9:$E$1048576,'Mobile-Detail Calcs'!C$167,'Mobile-Data'!$G$9:$G$1048576,'Mobile-Detail Calcs'!C$168,'Mobile-Data'!$C$9:$C$1048576,'Mobile-Detail Calcs'!$C$162)","v":0},{"$f":"SUMIFS('Mobile-Data'!$I$9:$I$1048576,'Mobile-Data'!$D$9:$D$1048576,$B179,'Mobile-Data'!$E$9:$E$1048576,'Mobile-Detail Calcs'!D$167,'Mobile-Data'!$G$9:$G$1048576,'Mobile-Detail Calcs'!D$168,'Mobile-Data'!$C$9:$C$1048576,'Mobile-Detail Calcs'!$C$162)","v":0},{"$f":"SUMIFS('Mobile-Data'!$I$9:$I$1048576,'Mobile-Data'!$D$9:$D$1048576,$B179,'Mobile-Data'!$E$9:$E$1048576,'Mobile-Detail Calcs'!E$167,'Mobile-Data'!$G$9:$G$1048576,'Mobile-Detail Calcs'!E$168,'Mobile-Data'!$C$9:$C$1048576,'Mobile-Detail Calcs'!$C$162)","v":0},{"$f":"SUMIFS('Mobile-Data'!$I$9:$I$1048576,'Mobile-Data'!$D$9:$D$1048576,$B179,'Mobile-Data'!$E$9:$E$1048576,'Mobile-Detail Calcs'!F$167,'Mobile-Data'!$G$9:$G$1048576,'Mobile-Detail Calcs'!F$168,'Mobile-Data'!$C$9:$C$1048576,'Mobile-Detail Calcs'!$C$162)","v":0},{"$f":"SUMIFS('Mobile-Data'!$I$9:$I$1048576,'Mobile-Data'!$D$9:$D$1048576,$B179,'Mobile-Data'!$E$9:$E$1048576,'Mobile-Detail Calcs'!G$167,'Mobile-Data'!$G$9:$G$1048576,'Mobile-Detail Calcs'!G$168,'Mobile-Data'!$C$9:$C$1048576,'Mobile-Detail Calcs'!$C$162)","v":0},{"$f":"SUMIFS('Mobile-Data'!$I$9:$I$1048576,'Mobile-Data'!$D$9:$D$1048576,$B179,'Mobile-Data'!$E$9:$E$1048576,'Mobile-Detail Calcs'!H$167,'Mobile-Data'!$G$9:$G$1048576,'Mobile-Detail Calcs'!H$168,'Mobile-Data'!$C$9:$C$1048576,'Mobile-Detail Calcs'!$C$162)","v":0},0,null,1990,{"$f":"C179*Factors!C219*g_kg*kg_mt*GWP_CH4","v":0},{"$f":"D179*Factors!D219*g_kg*kg_mt*GWP_CH4","v":0},{"$f":"E179*Factors!E219*g_kg*kg_mt*GWP_CH4","v":0},{"$f":"F179*Factors!F219*g_kg*kg_mt*GWP_CH4","v":0},{"$f":"G179*Factors!G219*g_kg*kg_mt*GWP_CH4","v":0},{"$f":"H179*Factors!H219*g_kg*kg_mt*GWP_CH4","v":0},0,null,1990,{"$f":"C179*Factors!K219*g_kg*kg_mt*GWP_N2O","v":0},{"$f":"D179*Factors!L219*g_kg*kg_mt*GWP_N2O","v":0},{"$f":"E179*Factors!M219*g_kg*kg_mt*GWP_N2O","v":0},{"$f":"F179*Factors!N219*g_kg*kg_mt*GWP_N2O","v":0},{"$f":"G179*Factors!O219*g_kg*kg_mt*GWP_N2O","v":0},{"$f":"H179*Factors!P219*g_kg*kg_mt*GWP_N2O","v":0},0]
[null,1991,{"$f":"SUMIFS('Mobile-Data'!$I$9:$I$1048576,'Mobile-Data'!$D$9:$D$1048576,$B180,'Mobile-Data'!$E$9:$E$1048576,'Mobile-Detail Calcs'!C$167,'Mobile-Data'!$G$9:$G$1048576,'Mobile-Detail Calcs'!C$168,'Mobile-Data'!$C$9:$C$1048576,'Mobile-Detail Calcs'!$C$162)","v":0},{"$f":"SUMIFS('Mobile-Data'!$I$9:$I$1048576,'Mobile-Data'!$D$9:$D$1048576,$B180,'Mobile-Data'!$E$9:$E$1048576,'Mobile-Detail Calcs'!D$167,'Mobile-Data'!$G$9:$G$1048576,'Mobile-Detail Calcs'!D$168,'Mobile-Data'!$C$9:$C$1048576,'Mobile-Detail Calcs'!$C$162)","v":0},{"$f":"SUMIFS('Mobile-Data'!$I$9:$I$1048576,'Mobile-Data'!$D$9:$D$1048576,$B180,'Mobile-Data'!$E$9:$E$1048576,'Mobile-Detail Calcs'!E$167,'Mobile-Data'!$G$9:$G$1048576,'Mobile-Detail Calcs'!E$168,'Mobile-Data'!$C$9:$C$1048576,'Mobile-Detail Calcs'!$C$162)","v":0},{"$f":"SUMIFS('Mobile-Data'!$I$9:$I$1048576,'Mobile-Data'!$D$9:$D$1048576,$B180,'Mobile-Data'!$E$9:$E$1048576,'Mobile-Detail Calcs'!F$167,'Mobile-Data'!$G$9:$G$1048576,'Mobile-Detail Calcs'!F$168,'Mobile-Data'!$C$9:$C$1048576,'Mobile-Detail Calcs'!$C$162)","v":0},{"$f":"SUMIFS('Mobile-Data'!$I$9:$I$1048576,'Mobile-Data'!$D$9:$D$1048576,$B180,'Mobile-Data'!$E$9:$E$1048576,'Mobile-Detail Calcs'!G$167,'Mobile-Data'!$G$9:$G$1048576,'Mobile-Detail Calcs'!G$168,'Mobile-Data'!$C$9:$C$1048576,'Mobile-Detail Calcs'!$C$162)","v":0},{"$f":"SUMIFS('Mobile-Data'!$I$9:$I$1048576,'Mobile-Data'!$D$9:$D$1048576,$B180,'Mobile-Data'!$E$9:$E$1048576,'Mobile-Detail Calcs'!H$167,'Mobile-Data'!$G$9:$G$1048576,'Mobile-Detail Calcs'!H$168,'Mobile-Data'!$C$9:$C$1048576,'Mobile-Detail Calcs'!$C$162)","v":0},0,null,1991,{"$f":"C180*Factors!C220*g_kg*kg_mt*GWP_CH4","v":0},{"$f":"D180*Factors!D220*g_kg*kg_mt*GWP_CH4","v":0},{"$f":"E180*Factors!E220*g_kg*kg_mt*GWP_CH4","v":0},{"$f":"F180*Factors!F220*g_kg*kg_mt*GWP_CH4","v":0},{"$f":"G180*Factors!G220*g_kg*kg_mt*GWP_CH4","v":0},{"$f":"H180*Factors!H220*g_kg*kg_mt*GWP_CH4","v":0},0,null,1991,{"$f":"C180*Factors!K220*g_kg*kg_mt*GWP_N2O","v":0},{"$f":"D180*Factors!L220*g_kg*kg_mt*GWP_N2O","v":0},{"$f":"E180*Factors!M220*g_kg*kg_mt*GWP_N2O","v":0},{"$f":"F180*Factors!N220*g_kg*kg_mt*GWP_N2O","v":0},{"$f":"G180*Factors!O220*g_kg*kg_mt*GWP_N2O","v":0},{"$f":"H180*Factors!P220*g_kg*kg_mt*GWP_N2O","v":0},0]
[null,1992,{"$f":"SUMIFS('Mobile-Data'!$I$9:$I$1048576,'Mobile-Data'!$D$9:$D$1048576,$B181,'Mobile-Data'!$E$9:$E$1048576,'Mobile-Detail Calcs'!C$167,'Mobile-Data'!$G$9:$G$1048576,'Mobile-Detail Calcs'!C$168,'Mobile-Data'!$C$9:$C$1048576,'Mobile-Detail Calcs'!$C$162)","v":0},{"$f":"SUMIFS('Mobile-Data'!$I$9:$I$1048576,'Mobile-Data'!$D$9:$D$1048576,$B181,'Mobile-Data'!$E$9:$E$1048576,'Mobile-Detail Calcs'!D$167,'Mobile-Data'!$G$9:$G$1048576,'Mobile-Detail Calcs'!D$168,'Mobile-Data'!$C$9:$C$1048576,'Mobile-Detail Calcs'!$C$162)","v":0},{"$f":"SUMIFS('Mobile-Data'!$I$9:$I$1048576,'Mobile-Data'!$D$9:$D$1048576,$B181,'Mobile-Data'!$E$9:$E$1048576,'Mobile-Detail Calcs'!E$167,'Mobile-Data'!$G$9:$G$1048576,'Mobile-Detail Calcs'!E$168,'Mobile-Data'!$C$9:$C$1048576,'Mobile-Detail Calcs'!$C$162)","v":0},{"$f":"SUMIFS('Mobile-Data'!$I$9:$I$1048576,'Mobile-Data'!$D$9:$D$1048576,$B181,'Mobile-Data'!$E$9:$E$1048576,'Mobile-Detail Calcs'!F$167,'Mobile-Data'!$G$9:$G$1048576,'Mobile-Detail Calcs'!F$168,'Mobile-Data'!$C$9:$C$1048576,'Mobile-Detail Calcs'!$C$162)","v":0},{"$f":"SUMIFS('Mobile-Data'!$I$9:$I$1048576,'Mobile-Data'!$D$9:$D$1048576,$B181,'Mobile-Data'!$E$9:$E$1048576,'Mobile-Detail Calcs'!G$167,'Mobile-Data'!$G$9:$G$1048576,'Mobile-Detail Calcs'!G$168,'Mobile-Data'!$C$9:$C$1048576,'Mobile-Detail Calcs'!$C$162)","v":0},{"$f":"SUMIFS('Mobile-Data'!$I$9:$I$1048576,'Mobile-Data'!$D$9:$D$1048576,$B181,'Mobile-Data'!$E$9:$E$1048576,'Mobile-Detail Calcs'!H$167,'Mobile-Data'!$G$9:$G$1048576,'Mobile-Detail Calcs'!H$168,'Mobile-Data'!$C$9:$C$1048576,'Mobile-Detail Calcs'!$C$162)","v":0},0,null,1992,{"$f":"C181*Factors!C221*g_kg*kg_mt*GWP_CH4","v":0},{"$f":"D181*Factors!D221*g_kg*kg_mt*GWP_CH4","v":0},{"$f":"E181*Factors!E221*g_kg*kg_mt*GWP_CH4","v":0},{"$f":"F181*Factors!F221*g_kg*kg_mt*GWP_CH4","v":0},{"$f":"G181*Factors!G221*g_kg*kg_mt*GWP_CH4","v":0},{"$f":"H181*Factors!H221*g_kg*kg_mt*GWP_CH4","v":0},0,null,1992,{"$f":"C181*Factors!K221*g_kg*kg_mt*GWP_N2O","v":0},{"$f":"D181*Factors!L221*g_kg*kg_mt*GWP_N2O","v":0},{"$f":"E181*Factors!M221*g_kg*kg_mt*GWP_N2O","v":0},{"$f":"F181*Factors!N221*g_kg*kg_mt*GWP_N2O","v":0},{"$f":"G181*Factors!O221*g_kg*kg_mt*GWP_N2O","v":0},{"$f":"H181*Factors!P221*g_kg*kg_mt*GWP_N2O","v":0},0]
[null,1993,{"$f":"SUMIFS('Mobile-Data'!$I$9:$I$1048576,'Mobile-Data'!$D$9:$D$1048576,$B182,'Mobile-Data'!$E$9:$E$1048576,'Mobile-Detail Calcs'!C$167,'Mobile-Data'!$G$9:$G$1048576,'Mobile-Detail Calcs'!C$168,'Mobile-Data'!$C$9:$C$1048576,'Mobile-Detail Calcs'!$C$162)","v":0},{"$f":"SUMIFS('Mobile-Data'!$I$9:$I$1048576,'Mobile-Data'!$D$9:$D$1048576,$B182,'Mobile-Data'!$E$9:$E$1048576,'Mobile-Detail Calcs'!D$167,'Mobile-Data'!$G$9:$G$1048576,'Mobile-Detail Calcs'!D$168,'Mobile-Data'!$C$9:$C$1048576,'Mobile-Detail Calcs'!$C$162)","v":0},{"$f":"SUMIFS('Mobile-Data'!$I$9:$I$1048576,'Mobile-Data'!$D$9:$D$1048576,$B182,'Mobile-Data'!$E$9:$E$1048576,'Mobile-Detail Calcs'!E$167,'Mobile-Data'!$G$9:$G$1048576,'Mobile-Detail Calcs'!E$168,'Mobile-Data'!$C$9:$C$1048576,'Mobile-Detail Calcs'!$C$162)","v":0},{"$f":"SUMIFS('Mobile-Data'!$I$9:$I$1048576,'Mobile-Data'!$D$9:$D$1048576,$B182,'Mobile-Data'!$E$9:$E$1048576,'Mobile-Detail Calcs'!F$167,'Mobile-Data'!$G$9:$G$1048576,'Mobile-Detail Calcs'!F$168,'Mobile-Data'!$C$9:$C$1048576,'Mobile-Detail Calcs'!$C$162)","v":0},{"$f":"SUMIFS('Mobile-Data'!$I$9:$I$1048576,'Mobile-Data'!$D$9:$D$1048576,$B182,'Mobile-Data'!$E$9:$E$1048576,'Mobile-Detail Calcs'!G$167,'Mobile-Data'!$G$9:$G$1048576,'Mobile-Detail Calcs'!G$168,'Mobile-Data'!$C$9:$C$1048576,'Mobile-Detail Calcs'!$C$162)","v":0},{"$f":"SUMIFS('Mobile-Data'!$I$9:$I$1048576,'Mobile-Data'!$D$9:$D$1048576,$B182,'Mobile-Data'!$E$9:$E$1048576,'Mobile-Detail Calcs'!H$167,'Mobile-Data'!$G$9:$G$1048576,'Mobile-Detail Calcs'!H$168,'Mobile-Data'!$C$9:$C$1048576,'Mobile-Detail Calcs'!$C$162)","v":0},0,null,1993,{"$f":"C182*Factors!C222*g_kg*kg_mt*GWP_CH4","v":0},{"$f":"D182*Factors!D222*g_kg*kg_mt*GWP_CH4","v":0},{"$f":"E182*Factors!E222*g_kg*kg_mt*GWP_CH4","v":0},{"$f":"F182*Factors!F222*g_kg*kg_mt*GWP_CH4","v":0},{"$f":"G182*Factors!G222*g_kg*kg_mt*GWP_CH4","v":0},{"$f":"H182*Factors!H222*g_kg*kg_mt*GWP_CH4","v":0},0,null,1993,{"$f":"C182*Factors!K222*g_kg*kg_mt*GWP_N2O","v":0},{"$f":"D182*Factors!L222*g_kg*kg_mt*GWP_N2O","v":0},{"$f":"E182*Factors!M222*g_kg*kg_mt*GWP_N2O","v":0},{"$f":"F182*Factors!N222*g_kg*kg_mt*GWP_N2O","v":0},{"$f":"G182*Factors!O222*g_kg*kg_mt*GWP_N2O","v":0},{"$f":"H182*Factors!P222*g_kg*kg_mt*GWP_N2O","v":0},0]
[null,1994,{"$f":"SUMIFS('Mobile-Data'!$I$9:$I$1048576,'Mobile-Data'!$D$9:$D$1048576,$B183,'Mobile-Data'!$E$9:$E$1048576,'Mobile-Detail Calcs'!C$167,'Mobile-Data'!$G$9:$G$1048576,'Mobile-Detail Calcs'!C$168,'Mobile-Data'!$C$9:$C$1048576,'Mobile-Detail Calcs'!$C$162)","v":0},{"$f":"SUMIFS('Mobile-Data'!$I$9:$I$1048576,'Mobile-Data'!$D$9:$D$1048576,$B183,'Mobile-Data'!$E$9:$E$1048576,'Mobile-Detail Calcs'!D$167,'Mobile-Data'!$G$9:$G$1048576,'Mobile-Detail Calcs'!D$168,'Mobile-Data'!$C$9:$C$1048576,'Mobile-Detail Calcs'!$C$162)","v":0},{"$f":"SUMIFS('Mobile-Data'!$I$9:$I$1048576,'Mobile-Data'!$D$9:$D$1048576,$B183,'Mobile-Data'!$E$9:$E$1048576,'Mobile-Detail Calcs'!E$167,'Mobile-Data'!$G$9:$G$1048576,'Mobile-Detail Calcs'!E$168,'Mobile-Data'!$C$9:$C$1048576,'Mobile-Detail Calcs'!$C$162)","v":0},{"$f":"SUMIFS('Mobile-Data'!$I$9:$I$1048576,'Mobile-Data'!$D$9:$D$1048576,$B183,'Mobile-Data'!$E$9:$E$1048576,'Mobile-Detail Calcs'!F$167,'Mobile-Data'!$G$9:$G$1048576,'Mobile-Detail Calcs'!F$168,'Mobile-Data'!$C$9:$C$1048576,'Mobile-Detail Calcs'!$C$162)","v":0},{"$f":"SUMIFS('Mobile-Data'!$I$9:$I$1048576,'Mobile-Data'!$D$9:$D$1048576,$B183,'Mobile-Data'!$E$9:$E$1048576,'Mobile-Detail Calcs'!G$167,'Mobile-Data'!$G$9:$G$1048576,'Mobile-Detail Calcs'!G$168,'Mobile-Data'!$C$9:$C$1048576,'Mobile-Detail Calcs'!$C$162)","v":0},{"$f":"SUMIFS('Mobile-Data'!$I$9:$I$1048576,'Mobile-Data'!$D$9:$D$1048576,$B183,'Mobile-Data'!$E$9:$E$1048576,'Mobile-Detail Calcs'!H$167,'Mobile-Data'!$G$9:$G$1048576,'Mobile-Detail Calcs'!H$168,'Mobile-Data'!$C$9:$C$1048576,'Mobile-Detail Calcs'!$C$162)","v":0},0,null,1994,{"$f":"C183*Factors!C223*g_kg*kg_mt*GWP_CH4","v":0},{"$f":"D183*Factors!D223*g_kg*kg_mt*GWP_CH4","v":0},{"$f":"E183*Factors!E223*g_kg*kg_mt*GWP_CH4","v":0},{"$f":"F183*Factors!F223*g_kg*kg_mt*GWP_CH4","v":0},{"$f":"G183*Factors!G223*g_kg*kg_mt*GWP_CH4","v":0},{"$f":"H183*Factors!H223*g_kg*kg_mt*GWP_CH4","v":0},0,null,1994,{"$f":"C183*Factors!K223*g_kg*kg_mt*GWP_N2O","v":0},{"$f":"D183*Factors!L223*g_kg*kg_mt*GWP_N2O","v":0},{"$f":"E183*Factors!M223*g_kg*kg_mt*GWP_N2O","v":0},{"$f":"F183*Factors!N223*g_kg*kg_mt*GWP_N2O","v":0},{"$f":"G183*Factors!O223*g_kg*kg_mt*GWP_N2O","v":0},{"$f":"H183*Factors!P223*g_kg*kg_mt*GWP_N2O","v":0},0]
[null,1995,{"$f":"SUMIFS('Mobile-Data'!$I$9:$I$1048576,'Mobile-Data'!$D$9:$D$1048576,$B184,'Mobile-Data'!$E$9:$E$1048576,'Mobile-Detail Calcs'!C$167,'Mobile-Data'!$G$9:$G$1048576,'Mobile-Detail Calcs'!C$168,'Mobile-Data'!$C$9:$C$1048576,'Mobile-Detail Calcs'!$C$162)","v":0},{"$f":"SUMIFS('Mobile-Data'!$I$9:$I$1048576,'Mobile-Data'!$D$9:$D$1048576,$B184,'Mobile-Data'!$E$9:$E$1048576,'Mobile-Detail Calcs'!D$167,'Mobile-Data'!$G$9:$G$1048576,'Mobile-Detail Calcs'!D$168,'Mobile-Data'!$C$9:$C$1048576,'Mobile-Detail Calcs'!$C$162)","v":0},{"$f":"SUMIFS('Mobile-Data'!$I$9:$I$1048576,'Mobile-Data'!$D$9:$D$1048576,$B184,'Mobile-Data'!$E$9:$E$1048576,'Mobile-Detail Calcs'!E$167,'Mobile-Data'!$G$9:$G$1048576,'Mobile-Detail Calcs'!E$168,'Mobile-Data'!$C$9:$C$1048576,'Mobile-Detail Calcs'!$C$162)","v":0},{"$f":"SUMIFS('Mobile-Data'!$I$9:$I$1048576,'Mobile-Data'!$D$9:$D$1048576,$B184,'Mobile-Data'!$E$9:$E$1048576,'Mobile-Detail Calcs'!F$167,'Mobile-Data'!$G$9:$G$1048576,'Mobile-Detail Calcs'!F$168,'Mobile-Data'!$C$9:$C$1048576,'Mobile-Detail Calcs'!$C$162)","v":0},{"$f":"SUMIFS('Mobile-Data'!$I$9:$I$1048576,'Mobile-Data'!$D$9:$D$1048576,$B184,'Mobile-Data'!$E$9:$E$1048576,'Mobile-Detail Calcs'!G$167,'Mobile-Data'!$G$9:$G$1048576,'Mobile-Detail Calcs'!G$168,'Mobile-Data'!$C$9:$C$1048576,'Mobile-Detail Calcs'!$C$162)","v":0},{"$f":"SUMIFS('Mobile-Data'!$I$9:$I$1048576,'Mobile-Data'!$D$9:$D$1048576,$B184,'Mobile-Data'!$E$9:$E$1048576,'Mobile-Detail Calcs'!H$167,'Mobile-Data'!$G$9:$G$1048576,'Mobile-Detail Calcs'!H$168,'Mobile-Data'!$C$9:$C$1048576,'Mobile-Detail Calcs'!$C$162)","v":0},0,null,1995,{"$f":"C184*Factors!C224*g_kg*kg_mt*GWP_CH4","v":0},{"$f":"D184*Factors!D224*g_kg*kg_mt*GWP_CH4","v":0},{"$f":"E184*Factors!E224*g_kg*kg_mt*GWP_CH4","v":0},{"$f":"F184*Factors!F224*g_kg*kg_mt*GWP_CH4","v":0},{"$f":"G184*Factors!G224*g_kg*kg_mt*GWP_CH4","v":0},{"$f":"H184*Factors!H224*g_kg*kg_mt*GWP_CH4","v":0},0,null,1995,{"$f":"C184*Factors!K224*g_kg*kg_mt*GWP_N2O","v":0},{"$f":"D184*Factors!L224*g_kg*kg_mt*GWP_N2O","v":0},{"$f":"E184*Factors!M224*g_kg*kg_mt*GWP_N2O","v":0},{"$f":"F184*Factors!N224*g_kg*kg_mt*GWP_N2O","v":0},{"$f":"G184*Factors!O224*g_kg*kg_mt*GWP_N2O","v":0},{"$f":"H184*Factors!P224*g_kg*kg_mt*GWP_N2O","v":0},0]
[null,1996,{"$f":"SUMIFS('Mobile-Data'!$I$9:$I$1048576,'Mobile-Data'!$D$9:$D$1048576,$B185,'Mobile-Data'!$E$9:$E$1048576,'Mobile-Detail Calcs'!C$167,'Mobile-Data'!$G$9:$G$1048576,'Mobile-Detail Calcs'!C$168,'Mobile-Data'!$C$9:$C$1048576,'Mobile-Detail Calcs'!$C$162)","v":0},{"$f":"SUMIFS('Mobile-Data'!$I$9:$I$1048576,'Mobile-Data'!$D$9:$D$1048576,$B185,'Mobile-Data'!$E$9:$E$1048576,'Mobile-Detail Calcs'!D$167,'Mobile-Data'!$G$9:$G$1048576,'Mobile-Detail Calcs'!D$168,'Mobile-Data'!$C$9:$C$1048576,'Mobile-Detail Calcs'!$C$162)","v":0},{"$f":"SUMIFS('Mobile-Data'!$I$9:$I$1048576,'Mobile-Data'!$D$9:$D$1048576,$B185,'Mobile-Data'!$E$9:$E$1048576,'Mobile-Detail Calcs'!E$167,'Mobile-Data'!$G$9:$G$1048576,'Mobile-Detail Calcs'!E$168,'Mobile-Data'!$C$9:$C$1048576,'Mobile-Detail Calcs'!$C$162)","v":0},{"$f":"SUMIFS('Mobile-Data'!$I$9:$I$1048576,'Mobile-Data'!$D$9:$D$1048576,$B185,'Mobile-Data'!$E$9:$E$1048576,'Mobile-Detail Calcs'!F$167,'Mobile-Data'!$G$9:$G$1048576,'Mobile-Detail Calcs'!F$168,'Mobile-Data'!$C$9:$C$1048576,'Mobile-Detail Calcs'!$C$162)","v":0},{"$f":"SUMIFS('Mobile-Data'!$I$9:$I$1048576,'Mobile-Data'!$D$9:$D$1048576,$B185,'Mobile-Data'!$E$9:$E$1048576,'Mobile-Detail Calcs'!G$167,'Mobile-Data'!$G$9:$G$1048576,'Mobile-Detail Calcs'!G$168,'Mobile-Data'!$C$9:$C$1048576,'Mobile-Detail Calcs'!$C$162)","v":0},{"$f":"SUMIFS('Mobile-Data'!$I$9:$I$1048576,'Mobile-Data'!$D$9:$D$1048576,$B185,'Mobile-Data'!$E$9:$E$1048576,'Mobile-Detail Calcs'!H$167,'Mobile-Data'!$G$9:$G$1048576,'Mobile-Detail Calcs'!H$168,'Mobile-Data'!$C$9:$C$1048576,'Mobile-Detail Calcs'!$C$162)","v":0},0,null,1996,{"$f":"C185*Factors!C225*g_kg*kg_mt*GWP_CH4","v":0},{"$f":"D185*Factors!D225*g_kg*kg_mt*GWP_CH4","v":0},{"$f":"E185*Factors!E225*g_kg*kg_mt*GWP_CH4","v":0},{"$f":"F185*Factors!F225*g_kg*kg_mt*GWP_CH4","v":0},{"$f":"G185*Factors!G225*g_kg*kg_mt*GWP_CH4","v":0},{"$f":"H185*Factors!H225*g_kg*kg_mt*GWP_CH4","v":0},0,null,1996,{"$f":"C185*Factors!K225*g_kg*kg_mt*GWP_N2O","v":0},{"$f":"D185*Factors!L225*g_kg*kg_mt*GWP_N2O","v":0},{"$f":"E185*Factors!M225*g_kg*kg_mt*GWP_N2O","v":0},{"$f":"F185*Factors!N225*g_kg*kg_mt*GWP_N2O","v":0},{"$f":"G185*Factors!O225*g_kg*kg_mt*GWP_N2O","v":0},{"$f":"H185*Factors!P225*g_kg*kg_mt*GWP_N2O","v":0},0]
[null,1997,{"$f":"SUMIFS('Mobile-Data'!$I$9:$I$1048576,'Mobile-Data'!$D$9:$D$1048576,$B186,'Mobile-Data'!$E$9:$E$1048576,'Mobile-Detail Calcs'!C$167,'Mobile-Data'!$G$9:$G$1048576,'Mobile-Detail Calcs'!C$168,'Mobile-Data'!$C$9:$C$1048576,'Mobile-Detail Calcs'!$C$162)","v":0},{"$f":"SUMIFS('Mobile-Data'!$I$9:$I$1048576,'Mobile-Data'!$D$9:$D$1048576,$B186,'Mobile-Data'!$E$9:$E$1048576,'Mobile-Detail Calcs'!D$167,'Mobile-Data'!$G$9:$G$1048576,'Mobile-Detail Calcs'!D$168,'Mobile-Data'!$C$9:$C$1048576,'Mobile-Detail Calcs'!$C$162)","v":0},{"$f":"SUMIFS('Mobile-Data'!$I$9:$I$1048576,'Mobile-Data'!$D$9:$D$1048576,$B186,'Mobile-Data'!$E$9:$E$1048576,'Mobile-Detail Calcs'!E$167,'Mobile-Data'!$G$9:$G$1048576,'Mobile-Detail Calcs'!E$168,'Mobile-Data'!$C$9:$C$1048576,'Mobile-Detail Calcs'!$C$162)","v":0},{"$f":"SUMIFS('Mobile-Data'!$I$9:$I$1048576,'Mobile-Data'!$D$9:$D$1048576,$B186,'Mobile-Data'!$E$9:$E$1048576,'Mobile-Detail Calcs'!F$167,'Mobile-Data'!$G$9:$G$1048576,'Mobile-Detail Calcs'!F$168,'Mobile-Data'!$C$9:$C$1048576,'Mobile-Detail Calcs'!$C$162)","v":0},{"$f":"SUMIFS('Mobile-Data'!$I$9:$I$1048576,'Mobile-Data'!$D$9:$D$1048576,$B186,'Mobile-Data'!$E$9:$E$1048576,'Mobile-Detail Calcs'!G$167,'Mobile-Data'!$G$9:$G$1048576,'Mobile-Detail Calcs'!G$168,'Mobile-Data'!$C$9:$C$1048576,'Mobile-Detail Calcs'!$C$162)","v":0},{"$f":"SUMIFS('Mobile-Data'!$I$9:$I$1048576,'Mobile-Data'!$D$9:$D$1048576,$B186,'Mobile-Data'!$E$9:$E$1048576,'Mobile-Detail Calcs'!H$167,'Mobile-Data'!$G$9:$G$1048576,'Mobile-Detail Calcs'!H$168,'Mobile-Data'!$C$9:$C$1048576,'Mobile-Detail Calcs'!$C$162)","v":0},0,null,1997,{"$f":"C186*Factors!C226*g_kg*kg_mt*GWP_CH4","v":0},{"$f":"D186*Factors!D226*g_kg*kg_mt*GWP_CH4","v":0},{"$f":"E186*Factors!E226*g_kg*kg_mt*GWP_CH4","v":0},{"$f":"F186*Factors!F226*g_kg*kg_mt*GWP_CH4","v":0},{"$f":"G186*Factors!G226*g_kg*kg_mt*GWP_CH4","v":0},{"$f":"H186*Factors!H226*g_kg*kg_mt*GWP_CH4","v":0},0,null,1997,{"$f":"C186*Factors!K226*g_kg*kg_mt*GWP_N2O","v":0},{"$f":"D186*Factors!L226*g_kg*kg_mt*GWP_N2O","v":0},{"$f":"E186*Factors!M226*g_kg*kg_mt*GWP_N2O","v":0},{"$f":"F186*Factors!N226*g_kg*kg_mt*GWP_N2O","v":0},{"$f":"G186*Factors!O226*g_kg*kg_mt*GWP_N2O","v":0},{"$f":"H186*Factors!P226*g_kg*kg_mt*GWP_N2O","v":0},0]
[null,1998,{"$f":"SUMIFS('Mobile-Data'!$I$9:$I$1048576,'Mobile-Data'!$D$9:$D$1048576,$B187,'Mobile-Data'!$E$9:$E$1048576,'Mobile-Detail Calcs'!C$167,'Mobile-Data'!$G$9:$G$1048576,'Mobile-Detail Calcs'!C$168,'Mobile-Data'!$C$9:$C$1048576,'Mobile-Detail Calcs'!$C$162)","v":0},{"$f":"SUMIFS('Mobile-Data'!$I$9:$I$1048576,'Mobile-Data'!$D$9:$D$1048576,$B187,'Mobile-Data'!$E$9:$E$1048576,'Mobile-Detail Calcs'!D$167,'Mobile-Data'!$G$9:$G$1048576,'Mobile-Detail Calcs'!D$168,'Mobile-Data'!$C$9:$C$1048576,'Mobile-Detail Calcs'!$C$162)","v":0},{"$f":"SUMIFS('Mobile-Data'!$I$9:$I$1048576,'Mobile-Data'!$D$9:$D$1048576,$B187,'Mobile-Data'!$E$9:$E$1048576,'Mobile-Detail Calcs'!E$167,'Mobile-Data'!$G$9:$G$1048576,'Mobile-Detail Calcs'!E$168,'Mobile-Data'!$C$9:$C$1048576,'Mobile-Detail Calcs'!$C$162)","v":0},{"$f":"SUMIFS('Mobile-Data'!$I$9:$I$1048576,'Mobile-Data'!$D$9:$D$1048576,$B187,'Mobile-Data'!$E$9:$E$1048576,'Mobile-Detail Calcs'!F$167,'Mobile-Data'!$G$9:$G$1048576,'Mobile-Detail Calcs'!F$168,'Mobile-Data'!$C$9:$C$1048576,'Mobile-Detail Calcs'!$C$162)","v":0},{"$f":"SUMIFS('Mobile-Data'!$I$9:$I$1048576,'Mobile-Data'!$D$9:$D$1048576,$B187,'Mobile-Data'!$E$9:$E$1048576,'Mobile-Detail Calcs'!G$167,'Mobile-Data'!$G$9:$G$1048576,'Mobile-Detail Calcs'!G$168,'Mobile-Data'!$C$9:$C$1048576,'Mobile-Detail Calcs'!$C$162)","v":0},{"$f":"SUMIFS('Mobile-Data'!$I$9:$I$1048576,'Mobile-Data'!$D$9:$D$1048576,$B187,'Mobile-Data'!$E$9:$E$1048576,'Mobile-Detail Calcs'!H$167,'Mobile-Data'!$G$9:$G$1048576,'Mobile-Detail Calcs'!H$168,'Mobile-Data'!$C$9:$C$1048576,'Mobile-Detail Calcs'!$C$162)","v":0},0,null,1998,{"$f":"C187*Factors!C227*g_kg*kg_mt*GWP_CH4","v":0},{"$f":"D187*Factors!D227*g_kg*kg_mt*GWP_CH4","v":0},{"$f":"E187*Factors!E227*g_kg*kg_mt*GWP_CH4","v":0},{"$f":"F187*Factors!F227*g_kg*kg_mt*GWP_CH4","v":0},{"$f":"G187*Factors!G227*g_kg*kg_mt*GWP_CH4","v":0},{"$f":"H187*Factors!H227*g_kg*kg_mt*GWP_CH4","v":0},0,null,1998,{"$f":"C187*Factors!K227*g_kg*kg_mt*GWP_N2O","v":0},{"$f":"D187*Factors!L227*g_kg*kg_mt*GWP_N2O","v":0},{"$f":"E187*Factors!M227*g_kg*kg_mt*GWP_N2O","v":0},{"$f":"F187*Factors!N227*g_kg*kg_mt*GWP_N2O","v":0},{"$f":"G187*Factors!O227*g_kg*kg_mt*GWP_N2O","v":0},{"$f":"H187*Factors!P227*g_kg*kg_mt*GWP_N2O","v":0},0]
[null,1999,{"$f":"SUMIFS('Mobile-Data'!$I$9:$I$1048576,'Mobile-Data'!$D$9:$D$1048576,$B188,'Mobile-Data'!$E$9:$E$1048576,'Mobile-Detail Calcs'!C$167,'Mobile-Data'!$G$9:$G$1048576,'Mobile-Detail Calcs'!C$168,'Mobile-Data'!$C$9:$C$1048576,'Mobile-Detail Calcs'!$C$162)","v":0},{"$f":"SUMIFS('Mobile-Data'!$I$9:$I$1048576,'Mobile-Data'!$D$9:$D$1048576,$B188,'Mobile-Data'!$E$9:$E$1048576,'Mobile-Detail Calcs'!D$167,'Mobile-Data'!$G$9:$G$1048576,'Mobile-Detail Calcs'!D$168,'Mobile-Data'!$C$9:$C$1048576,'Mobile-Detail Calcs'!$C$162)","v":0},{"$f":"SUMIFS('Mobile-Data'!$I$9:$I$1048576,'Mobile-Data'!$D$9:$D$1048576,$B188,'Mobile-Data'!$E$9:$E$1048576,'Mobile-Detail Calcs'!E$167,'Mobile-Data'!$G$9:$G$1048576,'Mobile-Detail Calcs'!E$168,'Mobile-Data'!$C$9:$C$1048576,'Mobile-Detail Calcs'!$C$162)","v":0},{"$f":"SUMIFS('Mobile-Data'!$I$9:$I$1048576,'Mobile-Data'!$D$9:$D$1048576,$B188,'Mobile-Data'!$E$9:$E$1048576,'Mobile-Detail Calcs'!F$167,'Mobile-Data'!$G$9:$G$1048576,'Mobile-Detail Calcs'!F$168,'Mobile-Data'!$C$9:$C$1048576,'Mobile-Detail Calcs'!$C$162)","v":0},{"$f":"SUMIFS('Mobile-Data'!$I$9:$I$1048576,'Mobile-Data'!$D$9:$D$1048576,$B188,'Mobile-Data'!$E$9:$E$1048576,'Mobile-Detail Calcs'!G$167,'Mobile-Data'!$G$9:$G$1048576,'Mobile-Detail Calcs'!G$168,'Mobile-Data'!$C$9:$C$1048576,'Mobile-Detail Calcs'!$C$162)","v":0},{"$f":"SUMIFS('Mobile-Data'!$I$9:$I$1048576,'Mobile-Data'!$D$9:$D$1048576,$B188,'Mobile-Data'!$E$9:$E$1048576,'Mobile-Detail Calcs'!H$167,'Mobile-Data'!$G$9:$G$1048576,'Mobile-Detail Calcs'!H$168,'Mobile-Data'!$C$9:$C$1048576,'Mobile-Detail Calcs'!$C$162)","v":0},0,null,1999,{"$f":"C188*Factors!C228*g_kg*kg_mt*GWP_CH4","v":0},{"$f":"D188*Factors!D228*g_kg*kg_mt*GWP_CH4","v":0},{"$f":"E188*Factors!E228*g_kg*kg_mt*GWP_CH4","v":0},{"$f":"F188*Factors!F228*g_kg*kg_mt*GWP_CH4","v":0},{"$f":"G188*Factors!G228*g_kg*kg_mt*GWP_CH4","v":0},{"$f":"H188*Factors!H228*g_kg*kg_mt*GWP_CH4","v":0},0,null,1999,{"$f":"C188*Factors!K228*g_kg*kg_mt*GWP_N2O","v":0},{"$f":"D188*Factors!L228*g_kg*kg_mt*GWP_N2O","v":0},{"$f":"E188*Factors!M228*g_kg*kg_mt*GWP_N2O","v":0},{"$f":"F188*Factors!N228*g_kg*kg_mt*GWP_N2O","v":0},{"$f":"G188*Factors!O228*g_kg*kg_mt*GWP_N2O","v":0},{"$f":"H188*Factors!P228*g_kg*kg_mt*GWP_N2O","v":0},0]
[null,2000,{"$f":"SUMIFS('Mobile-Data'!$I$9:$I$1048576,'Mobile-Data'!$D$9:$D$1048576,$B189,'Mobile-Data'!$E$9:$E$1048576,'Mobile-Detail Calcs'!C$167,'Mobile-Data'!$G$9:$G$1048576,'Mobile-Detail Calcs'!C$168,'Mobile-Data'!$C$9:$C$1048576,'Mobile-Detail Calcs'!$C$162)","v":0},{"$f":"SUMIFS('Mobile-Data'!$I$9:$I$1048576,'Mobile-Data'!$D$9:$D$1048576,$B189,'Mobile-Data'!$E$9:$E$1048576,'Mobile-Detail Calcs'!D$167,'Mobile-Data'!$G$9:$G$1048576,'Mobile-Detail Calcs'!D$168,'Mobile-Data'!$C$9:$C$1048576,'Mobile-Detail Calcs'!$C$162)","v":0},{"$f":"SUMIFS('Mobile-Data'!$I$9:$I$1048576,'Mobile-Data'!$D$9:$D$1048576,$B189,'Mobile-Data'!$E$9:$E$1048576,'Mobile-Detail Calcs'!E$167,'Mobile-Data'!$G$9:$G$1048576,'Mobile-Detail Calcs'!E$168,'Mobile-Data'!$C$9:$C$1048576,'Mobile-Detail Calcs'!$C$162)","v":0},{"$f":"SUMIFS('Mobile-Data'!$I$9:$I$1048576,'Mobile-Data'!$D$9:$D$1048576,$B189,'Mobile-Data'!$E$9:$E$1048576,'Mobile-Detail Calcs'!F$167,'Mobile-Data'!$G$9:$G$1048576,'Mobile-Detail Calcs'!F$168,'Mobile-Data'!$C$9:$C$1048576,'Mobile-Detail Calcs'!$C$162)","v":0},{"$f":"SUMIFS('Mobile-Data'!$I$9:$I$1048576,'Mobile-Data'!$D$9:$D$1048576,$B189,'Mobile-Data'!$E$9:$E$1048576,'Mobile-Detail Calcs'!G$167,'Mobile-Data'!$G$9:$G$1048576,'Mobile-Detail Calcs'!G$168,'Mobile-Data'!$C$9:$C$1048576,'Mobile-Detail Calcs'!$C$162)","v":0},{"$f":"SUMIFS('Mobile-Data'!$I$9:$I$1048576,'Mobile-Data'!$D$9:$D$1048576,$B189,'Mobile-Data'!$E$9:$E$1048576,'Mobile-Detail Calcs'!H$167,'Mobile-Data'!$G$9:$G$1048576,'Mobile-Detail Calcs'!H$168,'Mobile-Data'!$C$9:$C$1048576,'Mobile-Detail Calcs'!$C$162)","v":0},0,null,2000,{"$f":"C189*Factors!C229*g_kg*kg_mt*GWP_CH4","v":0},{"$f":"D189*Factors!D229*g_kg*kg_mt*GWP_CH4","v":0},{"$f":"E189*Factors!E229*g_kg*kg_mt*GWP_CH4","v":0},{"$f":"F189*Factors!F229*g_kg*kg_mt*GWP_CH4","v":0},{"$f":"G189*Factors!G229*g_kg*kg_mt*GWP_CH4","v":0},{"$f":"H189*Factors!H229*g_kg*kg_mt*GWP_CH4","v":0},0,null,2000,{"$f":"C189*Factors!K229*g_kg*kg_mt*GWP_N2O","v":0},{"$f":"D189*Factors!L229*g_kg*kg_mt*GWP_N2O","v":0},{"$f":"E189*Factors!M229*g_kg*kg_mt*GWP_N2O","v":0},{"$f":"F189*Factors!N229*g_kg*kg_mt*GWP_N2O","v":0},{"$f":"G189*Factors!O229*g_kg*kg_mt*GWP_N2O","v":0},{"$f":"H189*Factors!P229*g_kg*kg_mt*GWP_N2O","v":0},0]
[null,2001,{"$f":"SUMIFS('Mobile-Data'!$I$9:$I$1048576,'Mobile-Data'!$D$9:$D$1048576,$B190,'Mobile-Data'!$E$9:$E$1048576,'Mobile-Detail Calcs'!C$167,'Mobile-Data'!$G$9:$G$1048576,'Mobile-Detail Calcs'!C$168,'Mobile-Data'!$C$9:$C$1048576,'Mobile-Detail Calcs'!$C$162)","v":0},{"$f":"SUMIFS('Mobile-Data'!$I$9:$I$1048576,'Mobile-Data'!$D$9:$D$1048576,$B190,'Mobile-Data'!$E$9:$E$1048576,'Mobile-Detail Calcs'!D$167,'Mobile-Data'!$G$9:$G$1048576,'Mobile-Detail Calcs'!D$168,'Mobile-Data'!$C$9:$C$1048576,'Mobile-Detail Calcs'!$C$162)","v":0},{"$f":"SUMIFS('Mobile-Data'!$I$9:$I$1048576,'Mobile-Data'!$D$9:$D$1048576,$B190,'Mobile-Data'!$E$9:$E$1048576,'Mobile-Detail Calcs'!E$167,'Mobile-Data'!$G$9:$G$1048576,'Mobile-Detail Calcs'!E$168,'Mobile-Data'!$C$9:$C$1048576,'Mobile-Detail Calcs'!$C$162)","v":0},{"$f":"SUMIFS('Mobile-Data'!$I$9:$I$1048576,'Mobile-Data'!$D$9:$D$1048576,$B190,'Mobile-Data'!$E$9:$E$1048576,'Mobile-Detail Calcs'!F$167,'Mobile-Data'!$G$9:$G$1048576,'Mobile-Detail Calcs'!F$168,'Mobile-Data'!$C$9:$C$1048576,'Mobile-Detail Calcs'!$C$162)","v":0},{"$f":"SUMIFS('Mobile-Data'!$I$9:$I$1048576,'Mobile-Data'!$D$9:$D$1048576,$B190,'Mobile-Data'!$E$9:$E$1048576,'Mobile-Detail Calcs'!G$167,'Mobile-Data'!$G$9:$G$1048576,'Mobile-Detail Calcs'!G$168,'Mobile-Data'!$C$9:$C$1048576,'Mobile-Detail Calcs'!$C$162)","v":0},{"$f":"SUMIFS('Mobile-Data'!$I$9:$I$1048576,'Mobile-Data'!$D$9:$D$1048576,$B190,'Mobile-Data'!$E$9:$E$1048576,'Mobile-Detail Calcs'!H$167,'Mobile-Data'!$G$9:$G$1048576,'Mobile-Detail Calcs'!H$168,'Mobile-Data'!$C$9:$C$1048576,'Mobile-Detail Calcs'!$C$162)","v":0},0,null,2001,{"$f":"C190*Factors!C230*g_kg*kg_mt*GWP_CH4","v":0},{"$f":"D190*Factors!D230*g_kg*kg_mt*GWP_CH4","v":0},{"$f":"E190*Factors!E230*g_kg*kg_mt*GWP_CH4","v":0},{"$f":"F190*Factors!F230*g_kg*kg_mt*GWP_CH4","v":0},{"$f":"G190*Factors!G230*g_kg*kg_mt*GWP_CH4","v":0},{"$f":"H190*Factors!H230*g_kg*kg_mt*GWP_CH4","v":0},0,null,2001,{"$f":"C190*Factors!K230*g_kg*kg_mt*GWP_N2O","v":0},{"$f":"D190*Factors!L230*g_kg*kg_mt*GWP_N2O","v":0},{"$f":"E190*Factors!M230*g_kg*kg_mt*GWP_N2O","v":0},{"$f":"F190*Factors!N230*g_kg*kg_mt*GWP_N2O","v":0},{"$f":"G190*Factors!O230*g_kg*kg_mt*GWP_N2O","v":0},{"$f":"H190*Factors!P230*g_kg*kg_mt*GWP_N2O","v":0},0]
[null,2002,{"$f":"SUMIFS('Mobile-Data'!$I$9:$I$1048576,'Mobile-Data'!$D$9:$D$1048576,$B191,'Mobile-Data'!$E$9:$E$1048576,'Mobile-Detail Calcs'!C$167,'Mobile-Data'!$G$9:$G$1048576,'Mobile-Detail Calcs'!C$168,'Mobile-Data'!$C$9:$C$1048576,'Mobile-Detail Calcs'!$C$162)","v":0},{"$f":"SUMIFS('Mobile-Data'!$I$9:$I$1048576,'Mobile-Data'!$D$9:$D$1048576,$B191,'Mobile-Data'!$E$9:$E$1048576,'Mobile-Detail Calcs'!D$167,'Mobile-Data'!$G$9:$G$1048576,'Mobile-Detail Calcs'!D$168,'Mobile-Data'!$C$9:$C$1048576,'Mobile-Detail Calcs'!$C$162)","v":0},{"$f":"SUMIFS('Mobile-Data'!$I$9:$I$1048576,'Mobile-Data'!$D$9:$D$1048576,$B191,'Mobile-Data'!$E$9:$E$1048576,'Mobile-Detail Calcs'!E$167,'Mobile-Data'!$G$9:$G$1048576,'Mobile-Detail Calcs'!E$168,'Mobile-Data'!$C$9:$C$1048576,'Mobile-Detail Calcs'!$C$162)","v":0},{"$f":"SUMIFS('Mobile-Data'!$I$9:$I$1048576,'Mobile-Data'!$D$9:$D$1048576,$B191,'Mobile-Data'!$E$9:$E$1048576,'Mobile-Detail Calcs'!F$167,'Mobile-Data'!$G$9:$G$1048576,'Mobile-Detail Calcs'!F$168,'Mobile-Data'!$C$9:$C$1048576,'Mobile-Detail Calcs'!$C$162)","v":0},{"$f":"SUMIFS('Mobile-Data'!$I$9:$I$1048576,'Mobile-Data'!$D$9:$D$1048576,$B191,'Mobile-Data'!$E$9:$E$1048576,'Mobile-Detail Calcs'!G$167,'Mobile-Data'!$G$9:$G$1048576,'Mobile-Detail Calcs'!G$168,'Mobile-Data'!$C$9:$C$1048576,'Mobile-Detail Calcs'!$C$162)","v":0},{"$f":"SUMIFS('Mobile-Data'!$I$9:$I$1048576,'Mobile-Data'!$D$9:$D$1048576,$B191,'Mobile-Data'!$E$9:$E$1048576,'Mobile-Detail Calcs'!H$167,'Mobile-Data'!$G$9:$G$1048576,'Mobile-Detail Calcs'!H$168,'Mobile-Data'!$C$9:$C$1048576,'Mobile-Detail Calcs'!$C$162)","v":0},0,null,2002,{"$f":"C191*Factors!C231*g_kg*kg_mt*GWP_CH4","v":0},{"$f":"D191*Factors!D231*g_kg*kg_mt*GWP_CH4","v":0},{"$f":"E191*Factors!E231*g_kg*kg_mt*GWP_CH4","v":0},{"$f":"F191*Factors!F231*g_kg*kg_mt*GWP_CH4","v":0},{"$f":"G191*Factors!G231*g_kg*kg_mt*GWP_CH4","v":0},{"$f":"H191*Factors!H231*g_kg*kg_mt*GWP_CH4","v":0},0,null,2002,{"$f":"C191*Factors!K231*g_kg*kg_mt*GWP_N2O","v":0},{"$f":"D191*Factors!L231*g_kg*kg_mt*GWP_N2O","v":0},{"$f":"E191*Factors!M231*g_kg*kg_mt*GWP_N2O","v":0},{"$f":"F191*Factors!N231*g_kg*kg_mt*GWP_N2O","v":0},{"$f":"G191*Factors!O231*g_kg*kg_mt*GWP_N2O","v":0},{"$f":"H191*Factors!P231*g_kg*kg_mt*GWP_N2O","v":0},0]
[null,2003,{"$f":"SUMIFS('Mobile-Data'!$I$9:$I$1048576,'Mobile-Data'!$D$9:$D$1048576,$B192,'Mobile-Data'!$E$9:$E$1048576,'Mobile-Detail Calcs'!C$167,'Mobile-Data'!$G$9:$G$1048576,'Mobile-Detail Calcs'!C$168,'Mobile-Data'!$C$9:$C$1048576,'Mobile-Detail Calcs'!$C$162)","v":0},{"$f":"SUMIFS('Mobile-Data'!$I$9:$I$1048576,'Mobile-Data'!$D$9:$D$1048576,$B192,'Mobile-Data'!$E$9:$E$1048576,'Mobile-Detail Calcs'!D$167,'Mobile-Data'!$G$9:$G$1048576,'Mobile-Detail Calcs'!D$168,'Mobile-Data'!$C$9:$C$1048576,'Mobile-Detail Calcs'!$C$162)","v":0},{"$f":"SUMIFS('Mobile-Data'!$I$9:$I$1048576,'Mobile-Data'!$D$9:$D$1048576,$B192,'Mobile-Data'!$E$9:$E$1048576,'Mobile-Detail Calcs'!E$167,'Mobile-Data'!$G$9:$G$1048576,'Mobile-Detail Calcs'!E$168,'Mobile-Data'!$C$9:$C$1048576,'Mobile-Detail Calcs'!$C$162)","v":0},{"$f":"SUMIFS('Mobile-Data'!$I$9:$I$1048576,'Mobile-Data'!$D$9:$D$1048576,$B192,'Mobile-Data'!$E$9:$E$1048576,'Mobile-Detail Calcs'!F$167,'Mobile-Data'!$G$9:$G$1048576,'Mobile-Detail Calcs'!F$168,'Mobile-Data'!$C$9:$C$1048576,'Mobile-Detail Calcs'!$C$162)","v":0},{"$f":"SUMIFS('Mobile-Data'!$I$9:$I$1048576,'Mobile-Data'!$D$9:$D$1048576,$B192,'Mobile-Data'!$E$9:$E$1048576,'Mobile-Detail Calcs'!G$167,'Mobile-Data'!$G$9:$G$1048576,'Mobile-Detail Calcs'!G$168,'Mobile-Data'!$C$9:$C$1048576,'Mobile-Detail Calcs'!$C$162)","v":0},{"$f":"SUMIFS('Mobile-Data'!$I$9:$I$1048576,'Mobile-Data'!$D$9:$D$1048576,$B192,'Mobile-Data'!$E$9:$E$1048576,'Mobile-Detail Calcs'!H$167,'Mobile-Data'!$G$9:$G$1048576,'Mobile-Detail Calcs'!H$168,'Mobile-Data'!$C$9:$C$1048576,'Mobile-Detail Calcs'!$C$162)","v":0},0,null,2003,{"$f":"C192*Factors!C232*g_kg*kg_mt*GWP_CH4","v":0},{"$f":"D192*Factors!D232*g_kg*kg_mt*GWP_CH4","v":0},{"$f":"E192*Factors!E232*g_kg*kg_mt*GWP_CH4","v":0},{"$f":"F192*Factors!F232*g_kg*kg_mt*GWP_CH4","v":0},{"$f":"G192*Factors!G232*g_kg*kg_mt*GWP_CH4","v":0},{"$f":"H192*Factors!H232*g_kg*kg_mt*GWP_CH4","v":0},0,null,2003,{"$f":"C192*Factors!K232*g_kg*kg_mt*GWP_N2O","v":0},{"$f":"D192*Factors!L232*g_kg*kg_mt*GWP_N2O","v":0},{"$f":"E192*Factors!M232*g_kg*kg_mt*GWP_N2O","v":0},{"$f":"F192*Factors!N232*g_kg*kg_mt*GWP_N2O","v":0},{"$f":"G192*Factors!O232*g_kg*kg_mt*GWP_N2O","v":0},{"$f":"H192*Factors!P232*g_kg*kg_mt*GWP_N2O","v":0},0]
[null,2004,{"$f":"SUMIFS('Mobile-Data'!$I$9:$I$1048576,'Mobile-Data'!$D$9:$D$1048576,$B193,'Mobile-Data'!$E$9:$E$1048576,'Mobile-Detail Calcs'!C$167,'Mobile-Data'!$G$9:$G$1048576,'Mobile-Detail Calcs'!C$168,'Mobile-Data'!$C$9:$C$1048576,'Mobile-Detail Calcs'!$C$162)","v":0},{"$f":"SUMIFS('Mobile-Data'!$I$9:$I$1048576,'Mobile-Data'!$D$9:$D$1048576,$B193,'Mobile-Data'!$E$9:$E$1048576,'Mobile-Detail Calcs'!D$167,'Mobile-Data'!$G$9:$G$1048576,'Mobile-Detail Calcs'!D$168,'Mobile-Data'!$C$9:$C$1048576,'Mobile-Detail Calcs'!$C$162)","v":0},{"$f":"SUMIFS('Mobile-Data'!$I$9:$I$1048576,'Mobile-Data'!$D$9:$D$1048576,$B193,'Mobile-Data'!$E$9:$E$1048576,'Mobile-Detail Calcs'!E$167,'Mobile-Data'!$G$9:$G$1048576,'Mobile-Detail Calcs'!E$168,'Mobile-Data'!$C$9:$C$1048576,'Mobile-Detail Calcs'!$C$162)","v":0},{"$f":"SUMIFS('Mobile-Data'!$I$9:$I$1048576,'Mobile-Data'!$D$9:$D$1048576,$B193,'Mobile-Data'!$E$9:$E$1048576,'Mobile-Detail Calcs'!F$167,'Mobile-Data'!$G$9:$G$1048576,'Mobile-Detail Calcs'!F$168,'Mobile-Data'!$C$9:$C$1048576,'Mobile-Detail Calcs'!$C$162)","v":0},{"$f":"SUMIFS('Mobile-Data'!$I$9:$I$1048576,'Mobile-Data'!$D$9:$D$1048576,$B193,'Mobile-Data'!$E$9:$E$1048576,'Mobile-Detail Calcs'!G$167,'Mobile-Data'!$G$9:$G$1048576,'Mobile-Detail Calcs'!G$168,'Mobile-Data'!$C$9:$C$1048576,'Mobile-Detail Calcs'!$C$162)","v":0},{"$f":"SUMIFS('Mobile-Data'!$I$9:$I$1048576,'Mobile-Data'!$D$9:$D$1048576,$B193,'Mobile-Data'!$E$9:$E$1048576,'Mobile-Detail Calcs'!H$167,'Mobile-Data'!$G$9:$G$1048576,'Mobile-Detail Calcs'!H$168,'Mobile-Data'!$C$9:$C$1048576,'Mobile-Detail Calcs'!$C$162)","v":0},0,null,2004,{"$f":"C193*Factors!C233*g_kg*kg_mt*GWP_CH4","v":0},{"$f":"D193*Factors!D233*g_kg*kg_mt*GWP_CH4","v":0},{"$f":"E193*Factors!E233*g_kg*kg_mt*GWP_CH4","v":0},{"$f":"F193*Factors!F233*g_kg*kg_mt*GWP_CH4","v":0},{"$f":"G193*Factors!G233*g_kg*kg_mt*GWP_CH4","v":0},{"$f":"H193*Factors!H233*g_kg*kg_mt*GWP_CH4","v":0},0,null,2004,{"$f":"C193*Factors!K233*g_kg*kg_mt*GWP_N2O","v":0},{"$f":"D193*Factors!L233*g_kg*kg_mt*GWP_N2O","v":0},{"$f":"E193*Factors!M233*g_kg*kg_mt*GWP_N2O","v":0},{"$f":"F193*Factors!N233*g_kg*kg_mt*GWP_N2O","v":0},{"$f":"G193*Factors!O233*g_kg*kg_mt*GWP_N2O","v":0},{"$f":"H193*Factors!P233*g_kg*kg_mt*GWP_N2O","v":0},0]
[null,2005,{"$f":"SUMIFS('Mobile-Data'!$I$9:$I$1048576,'Mobile-Data'!$D$9:$D$1048576,$B194,'Mobile-Data'!$E$9:$E$1048576,'Mobile-Detail Calcs'!C$167,'Mobile-Data'!$G$9:$G$1048576,'Mobile-Detail Calcs'!C$168,'Mobile-Data'!$C$9:$C$1048576,'Mobile-Detail Calcs'!$C$162)","v":0},{"$f":"SUMIFS('Mobile-Data'!$I$9:$I$1048576,'Mobile-Data'!$D$9:$D$1048576,$B194,'Mobile-Data'!$E$9:$E$1048576,'Mobile-Detail Calcs'!D$167,'Mobile-Data'!$G$9:$G$1048576,'Mobile-Detail Calcs'!D$168,'Mobile-Data'!$C$9:$C$1048576,'Mobile-Detail Calcs'!$C$162)","v":0},{"$f":"SUMIFS('Mobile-Data'!$I$9:$I$1048576,'Mobile-Data'!$D$9:$D$1048576,$B194,'Mobile-Data'!$E$9:$E$1048576,'Mobile-Detail Calcs'!E$167,'Mobile-Data'!$G$9:$G$1048576,'Mobile-Detail Calcs'!E$168,'Mobile-Data'!$C$9:$C$1048576,'Mobile-Detail Calcs'!$C$162)","v":0},{"$f":"SUMIFS('Mobile-Data'!$I$9:$I$1048576,'Mobile-Data'!$D$9:$D$1048576,$B194,'Mobile-Data'!$E$9:$E$1048576,'Mobile-Detail Calcs'!F$167,'Mobile-Data'!$G$9:$G$1048576,'Mobile-Detail Calcs'!F$168,'Mobile-Data'!$C$9:$C$1048576,'Mobile-Detail Calcs'!$C$162)","v":0},{"$f":"SUMIFS('Mobile-Data'!$I$9:$I$1048576,'Mobile-Data'!$D$9:$D$1048576,$B194,'Mobile-Data'!$E$9:$E$1048576,'Mobile-Detail Calcs'!G$167,'Mobile-Data'!$G$9:$G$1048576,'Mobile-Detail Calcs'!G$168,'Mobile-Data'!$C$9:$C$1048576,'Mobile-Detail Calcs'!$C$162)","v":0},{"$f":"SUMIFS('Mobile-Data'!$I$9:$I$1048576,'Mobile-Data'!$D$9:$D$1048576,$B194,'Mobile-Data'!$E$9:$E$1048576,'Mobile-Detail Calcs'!H$167,'Mobile-Data'!$G$9:$G$1048576,'Mobile-Detail Calcs'!H$168,'Mobile-Data'!$C$9:$C$1048576,'Mobile-Detail Calcs'!$C$162)","v":0},0,null,2005,{"$f":"C194*Factors!C234*g_kg*kg_mt*GWP_CH4","v":0},{"$f":"D194*Factors!D234*g_kg*kg_mt*GWP_CH4","v":0},{"$f":"E194*Factors!E234*g_kg*kg_mt*GWP_CH4","v":0},{"$f":"F194*Factors!F234*g_kg*kg_mt*GWP_CH4","v":0},{"$f":"G194*Factors!G234*g_kg*kg_mt*GWP_CH4","v":0},{"$f":"H194*Factors!H234*g_kg*kg_mt*GWP_CH4","v":0},0,null,2005,{"$f":"C194*Factors!K234*g_kg*kg_mt*GWP_N2O","v":0},{"$f":"D194*Factors!L234*g_kg*kg_mt*GWP_N2O","v":0},{"$f":"E194*Factors!M234*g_kg*kg_mt*GWP_N2O","v":0},{"$f":"F194*Factors!N234*g_kg*kg_mt*GWP_N2O","v":0},{"$f":"G194*Factors!O234*g_kg*kg_mt*GWP_N2O","v":0},{"$f":"H194*Factors!P234*g_kg*kg_mt*GWP_N2O","v":0},0]
[null,2006,{"$f":"SUMIFS('Mobile-Data'!$I$9:$I$1048576,'Mobile-Data'!$D$9:$D$1048576,$B195,'Mobile-Data'!$E$9:$E$1048576,'Mobile-Detail Calcs'!C$167,'Mobile-Data'!$G$9:$G$1048576,'Mobile-Detail Calcs'!C$168,'Mobile-Data'!$C$9:$C$1048576,'Mobile-Detail Calcs'!$C$162)","v":0},{"$f":"SUMIFS('Mobile-Data'!$I$9:$I$1048576,'Mobile-Data'!$D$9:$D$1048576,$B195,'Mobile-Data'!$E$9:$E$1048576,'Mobile-Detail Calcs'!D$167,'Mobile-Data'!$G$9:$G$1048576,'Mobile-Detail Calcs'!D$168,'Mobile-Data'!$C$9:$C$1048576,'Mobile-Detail Calcs'!$C$162)","v":0},{"$f":"SUMIFS('Mobile-Data'!$I$9:$I$1048576,'Mobile-Data'!$D$9:$D$1048576,$B195,'Mobile-Data'!$E$9:$E$1048576,'Mobile-Detail Calcs'!E$167,'Mobile-Data'!$G$9:$G$1048576,'Mobile-Detail Calcs'!E$168,'Mobile-Data'!$C$9:$C$1048576,'Mobile-Detail Calcs'!$C$162)","v":0},{"$f":"SUMIFS('Mobile-Data'!$I$9:$I$1048576,'Mobile-Data'!$D$9:$D$1048576,$B195,'Mobile-Data'!$E$9:$E$1048576,'Mobile-Detail Calcs'!F$167,'Mobile-Data'!$G$9:$G$1048576,'Mobile-Detail Calcs'!F$168,'Mobile-Data'!$C$9:$C$1048576,'Mobile-Detail Calcs'!$C$162)","v":0},{"$f":"SUMIFS('Mobile-Data'!$I$9:$I$1048576,'Mobile-Data'!$D$9:$D$1048576,$B195,'Mobile-Data'!$E$9:$E$1048576,'Mobile-Detail Calcs'!G$167,'Mobile-Data'!$G$9:$G$1048576,'Mobile-Detail Calcs'!G$168,'Mobile-Data'!$C$9:$C$1048576,'Mobile-Detail Calcs'!$C$162)","v":0},{"$f":"SUMIFS('Mobile-Data'!$I$9:$I$1048576,'Mobile-Data'!$D$9:$D$1048576,$B195,'Mobile-Data'!$E$9:$E$1048576,'Mobile-Detail Calcs'!H$167,'Mobile-Data'!$G$9:$G$1048576,'Mobile-Detail Calcs'!H$168,'Mobile-Data'!$C$9:$C$1048576,'Mobile-Detail Calcs'!$C$162)","v":0},0,null,2006,{"$f":"C195*Factors!C235*g_kg*kg_mt*GWP_CH4","v":0},{"$f":"D195*Factors!D235*g_kg*kg_mt*GWP_CH4","v":0},{"$f":"E195*Factors!E235*g_kg*kg_mt*GWP_CH4","v":0},{"$f":"F195*Factors!F235*g_kg*kg_mt*GWP_CH4","v":0},{"$f":"G195*Factors!G235*g_kg*kg_mt*GWP_CH4","v":0},{"$f":"H195*Factors!H235*g_kg*kg_mt*GWP_CH4","v":0},0,null,2006,{"$f":"C195*Factors!K235*g_kg*kg_mt*GWP_N2O","v":0},{"$f":"D195*Factors!L235*g_kg*kg_mt*GWP_N2O","v":0},{"$f":"E195*Factors!M235*g_kg*kg_mt*GWP_N2O","v":0},{"$f":"F195*Factors!N235*g_kg*kg_mt*GWP_N2O","v":0},{"$f":"G195*Factors!O235*g_kg*kg_mt*GWP_N2O","v":0},{"$f":"H195*Factors!P235*g_kg*kg_mt*GWP_N2O","v":0},0]
[null,2007,{"$f":"SUMIFS('Mobile-Data'!$I$9:$I$1048576,'Mobile-Data'!$D$9:$D$1048576,$B196,'Mobile-Data'!$E$9:$E$1048576,'Mobile-Detail Calcs'!C$167,'Mobile-Data'!$G$9:$G$1048576,'Mobile-Detail Calcs'!C$168,'Mobile-Data'!$C$9:$C$1048576,'Mobile-Detail Calcs'!$C$162)","v":0},{"$f":"SUMIFS('Mobile-Data'!$I$9:$I$1048576,'Mobile-Data'!$D$9:$D$1048576,$B196,'Mobile-Data'!$E$9:$E$1048576,'Mobile-Detail Calcs'!D$167,'Mobile-Data'!$G$9:$G$1048576,'Mobile-Detail Calcs'!D$168,'Mobile-Data'!$C$9:$C$1048576,'Mobile-Detail Calcs'!$C$162)","v":0},{"$f":"SUMIFS('Mobile-Data'!$I$9:$I$1048576,'Mobile-Data'!$D$9:$D$1048576,$B196,'Mobile-Data'!$E$9:$E$1048576,'Mobile-Detail Calcs'!E$167,'Mobile-Data'!$G$9:$G$1048576,'Mobile-Detail Calcs'!E$168,'Mobile-Data'!$C$9:$C$1048576,'Mobile-Detail Calcs'!$C$162)","v":0},{"$f":"SUMIFS('Mobile-Data'!$I$9:$I$1048576,'Mobile-Data'!$D$9:$D$1048576,$B196,'Mobile-Data'!$E$9:$E$1048576,'Mobile-Detail Calcs'!F$167,'Mobile-Data'!$G$9:$G$1048576,'Mobile-Detail Calcs'!F$168,'Mobile-Data'!$C$9:$C$1048576,'Mobile-Detail Calcs'!$C$162)","v":0},{"$f":"SUMIFS('Mobile-Data'!$I$9:$I$1048576,'Mobile-Data'!$D$9:$D$1048576,$B196,'Mobile-Data'!$E$9:$E$1048576,'Mobile-Detail Calcs'!G$167,'Mobile-Data'!$G$9:$G$1048576,'Mobile-Detail Calcs'!G$168,'Mobile-Data'!$C$9:$C$1048576,'Mobile-Detail Calcs'!$C$162)","v":0},{"$f":"SUMIFS('Mobile-Data'!$I$9:$I$1048576,'Mobile-Data'!$D$9:$D$1048576,$B196,'Mobile-Data'!$E$9:$E$1048576,'Mobile-Detail Calcs'!H$167,'Mobile-Data'!$G$9:$G$1048576,'Mobile-Detail Calcs'!H$168,'Mobile-Data'!$C$9:$C$1048576,'Mobile-Detail Calcs'!$C$162)","v":0},0,null,2007,{"$f":"C196*Factors!C236*g_kg*kg_mt*GWP_CH4","v":0},{"$f":"D196*Factors!D236*g_kg*kg_mt*GWP_CH4","v":0},{"$f":"E196*Factors!E236*g_kg*kg_mt*GWP_CH4","v":0},{"$f":"F196*Factors!F236*g_kg*kg_mt*GWP_CH4","v":0},{"$f":"G196*Factors!G236*g_kg*kg_mt*GWP_CH4","v":0},{"$f":"H196*Factors!H236*g_kg*kg_mt*GWP_CH4","v":0},0,null,2007,{"$f":"C196*Factors!K236*g_kg*kg_mt*GWP_N2O","v":0},{"$f":"D196*Factors!L236*g_kg*kg_mt*GWP_N2O","v":0},{"$f":"E196*Factors!M236*g_kg*kg_mt*GWP_N2O","v":0},{"$f":"F196*Factors!N236*g_kg*kg_mt*GWP_N2O","v":0},{"$f":"G196*Factors!O236*g_kg*kg_mt*GWP_N2O","v":0},{"$f":"H196*Factors!P236*g_kg*kg_mt*GWP_N2O","v":0},0]
[null,2008,{"$f":"SUMIFS('Mobile-Data'!$I$9:$I$1048576,'Mobile-Data'!$D$9:$D$1048576,$B197,'Mobile-Data'!$E$9:$E$1048576,'Mobile-Detail Calcs'!C$167,'Mobile-Data'!$G$9:$G$1048576,'Mobile-Detail Calcs'!C$168,'Mobile-Data'!$C$9:$C$1048576,'Mobile-Detail Calcs'!$C$162)","v":0},{"$f":"SUMIFS('Mobile-Data'!$I$9:$I$1048576,'Mobile-Data'!$D$9:$D$1048576,$B197,'Mobile-Data'!$E$9:$E$1048576,'Mobile-Detail Calcs'!D$167,'Mobile-Data'!$G$9:$G$1048576,'Mobile-Detail Calcs'!D$168,'Mobile-Data'!$C$9:$C$1048576,'Mobile-Detail Calcs'!$C$162)","v":0},{"$f":"SUMIFS('Mobile-Data'!$I$9:$I$1048576,'Mobile-Data'!$D$9:$D$1048576,$B197,'Mobile-Data'!$E$9:$E$1048576,'Mobile-Detail Calcs'!E$167,'Mobile-Data'!$G$9:$G$1048576,'Mobile-Detail Calcs'!E$168,'Mobile-Data'!$C$9:$C$1048576,'Mobile-Detail Calcs'!$C$162)","v":0},{"$f":"SUMIFS('Mobile-Data'!$I$9:$I$1048576,'Mobile-Data'!$D$9:$D$1048576,$B197,'Mobile-Data'!$E$9:$E$1048576,'Mobile-Detail Calcs'!F$167,'Mobile-Data'!$G$9:$G$1048576,'Mobile-Detail Calcs'!F$168,'Mobile-Data'!$C$9:$C$1048576,'Mobile-Detail Calcs'!$C$162)","v":0},{"$f":"SUMIFS('Mobile-Data'!$I$9:$I$1048576,'Mobile-Data'!$D$9:$D$1048576,$B197,'Mobile-Data'!$E$9:$E$1048576,'Mobile-Detail Calcs'!G$167,'Mobile-Data'!$G$9:$G$1048576,'Mobile-Detail Calcs'!G$168,'Mobile-Data'!$C$9:$C$1048576,'Mobile-Detail Calcs'!$C$162)","v":0},{"$f":"SUMIFS('Mobile-Data'!$I$9:$I$1048576,'Mobile-Data'!$D$9:$D$1048576,$B197,'Mobile-Data'!$E$9:$E$1048576,'Mobile-Detail Calcs'!H$167,'Mobile-Data'!$G$9:$G$1048576,'Mobile-Detail Calcs'!H$168,'Mobile-Data'!$C$9:$C$1048576,'Mobile-Detail Calcs'!$C$162)","v":0},0,null,2008,{"$f":"C197*Factors!C237*g_kg*kg_mt*GWP_CH4","v":0},{"$f":"D197*Factors!D237*g_kg*kg_mt*GWP_CH4","v":0},{"$f":"E197*Factors!E237*g_kg*kg_mt*GWP_CH4","v":0},{"$f":"F197*Factors!F237*g_kg*kg_mt*GWP_CH4","v":0},{"$f":"G197*Factors!G237*g_kg*kg_mt*GWP_CH4","v":0},{"$f":"H197*Factors!H237*g_kg*kg_mt*GWP_CH4","v":0},0,null,2008,{"$f":"C197*Factors!K237*g_kg*kg_mt*GWP_N2O","v":0},{"$f":"D197*Factors!L237*g_kg*kg_mt*GWP_N2O","v":0},{"$f":"E197*Factors!M237*g_kg*kg_mt*GWP_N2O","v":0},{"$f":"F197*Factors!N237*g_kg*kg_mt*GWP_N2O","v":0},{"$f":"G197*Factors!O237*g_kg*kg_mt*GWP_N2O","v":0},{"$f":"H197*Factors!P237*g_kg*kg_mt*GWP_N2O","v":0},0]
[null,2009,{"$f":"SUMIFS('Mobile-Data'!$I$9:$I$1048576,'Mobile-Data'!$D$9:$D$1048576,$B198,'Mobile-Data'!$E$9:$E$1048576,'Mobile-Detail Calcs'!C$167,'Mobile-Data'!$G$9:$G$1048576,'Mobile-Detail Calcs'!C$168,'Mobile-Data'!$C$9:$C$1048576,'Mobile-Detail Calcs'!$C$162)","v":0},{"$f":"SUMIFS('Mobile-Data'!$I$9:$I$1048576,'Mobile-Data'!$D$9:$D$1048576,$B198,'Mobile-Data'!$E$9:$E$1048576,'Mobile-Detail Calcs'!D$167,'Mobile-Data'!$G$9:$G$1048576,'Mobile-Detail Calcs'!D$168,'Mobile-Data'!$C$9:$C$1048576,'Mobile-Detail Calcs'!$C$162)","v":0},{"$f":"SUMIFS('Mobile-Data'!$I$9:$I$1048576,'Mobile-Data'!$D$9:$D$1048576,$B198,'Mobile-Data'!$E$9:$E$1048576,'Mobile-Detail Calcs'!E$167,'Mobile-Data'!$G$9:$G$1048576,'Mobile-Detail Calcs'!E$168,'Mobile-Data'!$C$9:$C$1048576,'Mobile-Detail Calcs'!$C$162)","v":0},{"$f":"SUMIFS('Mobile-Data'!$I$9:$I$1048576,'Mobile-Data'!$D$9:$D$1048576,$B198,'Mobile-Data'!$E$9:$E$1048576,'Mobile-Detail Calcs'!F$167,'Mobile-Data'!$G$9:$G$1048576,'Mobile-Detail Calcs'!F$168,'Mobile-Data'!$C$9:$C$1048576,'Mobile-Detail Calcs'!$C$162)","v":0},{"$f":"SUMIFS('Mobile-Data'!$I$9:$I$1048576,'Mobile-Data'!$D$9:$D$1048576,$B198,'Mobile-Data'!$E$9:$E$1048576,'Mobile-Detail Calcs'!G$167,'Mobile-Data'!$G$9:$G$1048576,'Mobile-Detail Calcs'!G$168,'Mobile-Data'!$C$9:$C$1048576,'Mobile-Detail Calcs'!$C$162)","v":0},{"$f":"SUMIFS('Mobile-Data'!$I$9:$I$1048576,'Mobile-Data'!$D$9:$D$1048576,$B198,'Mobile-Data'!$E$9:$E$1048576,'Mobile-Detail Calcs'!H$167,'Mobile-Data'!$G$9:$G$1048576,'Mobile-Detail Calcs'!H$168,'Mobile-Data'!$C$9:$C$1048576,'Mobile-Detail Calcs'!$C$162)","v":0},0,null,2009,{"$f":"C198*Factors!C238*g_kg*kg_mt*GWP_CH4","v":0},{"$f":"D198*Factors!D238*g_kg*kg_mt*GWP_CH4","v":0},{"$f":"E198*Factors!E238*g_kg*kg_mt*GWP_CH4","v":0},{"$f":"F198*Factors!F238*g_kg*kg_mt*GWP_CH4","v":0},{"$f":"G198*Factors!G238*g_kg*kg_mt*GWP_CH4","v":0},{"$f":"H198*Factors!H238*g_kg*kg_mt*GWP_CH4","v":0},0,null,2009,{"$f":"C198*Factors!K238*g_kg*kg_mt*GWP_N2O","v":0},{"$f":"D198*Factors!L238*g_kg*kg_mt*GWP_N2O","v":0},{"$f":"E198*Factors!M238*g_kg*kg_mt*GWP_N2O","v":0},{"$f":"F198*Factors!N238*g_kg*kg_mt*GWP_N2O","v":0},{"$f":"G198*Factors!O238*g_kg*kg_mt*GWP_N2O","v":0},{"$f":"H198*Factors!P238*g_kg*kg_mt*GWP_N2O","v":0},0]
[null,2010,{"$f":"SUMIFS('Mobile-Data'!$I$9:$I$1048576,'Mobile-Data'!$D$9:$D$1048576,$B199,'Mobile-Data'!$E$9:$E$1048576,'Mobile-Detail Calcs'!C$167,'Mobile-Data'!$G$9:$G$1048576,'Mobile-Detail Calcs'!C$168,'Mobile-Data'!$C$9:$C$1048576,'Mobile-Detail Calcs'!$C$162)","v":0},{"$f":"SUMIFS('Mobile-Data'!$I$9:$I$1048576,'Mobile-Data'!$D$9:$D$1048576,$B199,'Mobile-Data'!$E$9:$E$1048576,'Mobile-Detail Calcs'!D$167,'Mobile-Data'!$G$9:$G$1048576,'Mobile-Detail Calcs'!D$168,'Mobile-Data'!$C$9:$C$1048576,'Mobile-Detail Calcs'!$C$162)","v":0},{"$f":"SUMIFS('Mobile-Data'!$I$9:$I$1048576,'Mobile-Data'!$D$9:$D$1048576,$B199,'Mobile-Data'!$E$9:$E$1048576,'Mobile-Detail Calcs'!E$167,'Mobile-Data'!$G$9:$G$1048576,'Mobile-Detail Calcs'!E$168,'Mobile-Data'!$C$9:$C$1048576,'Mobile-Detail Calcs'!$C$162)","v":0},{"$f":"SUMIFS('Mobile-Data'!$I$9:$I$1048576,'Mobile-Data'!$D$9:$D$1048576,$B199,'Mobile-Data'!$E$9:$E$1048576,'Mobile-Detail Calcs'!F$167,'Mobile-Data'!$G$9:$G$1048576,'Mobile-Detail Calcs'!F$168,'Mobile-Data'!$C$9:$C$1048576,'Mobile-Detail Calcs'!$C$162)","v":0},{"$f":"SUMIFS('Mobile-Data'!$I$9:$I$1048576,'Mobile-Data'!$D$9:$D$1048576,$B199,'Mobile-Data'!$E$9:$E$1048576,'Mobile-Detail Calcs'!G$167,'Mobile-Data'!$G$9:$G$1048576,'Mobile-Detail Calcs'!G$168,'Mobile-Data'!$C$9:$C$1048576,'Mobile-Detail Calcs'!$C$162)","v":0},{"$f":"SUMIFS('Mobile-Data'!$I$9:$I$1048576,'Mobile-Data'!$D$9:$D$1048576,$B199,'Mobile-Data'!$E$9:$E$1048576,'Mobile-Detail Calcs'!H$167,'Mobile-Data'!$G$9:$G$1048576,'Mobile-Detail Calcs'!H$168,'Mobile-Data'!$C$9:$C$1048576,'Mobile-Detail Calcs'!$C$162)","v":0},0,null,2010,{"$f":"C199*Factors!C239*g_kg*kg_mt*GWP_CH4","v":0},{"$f":"D199*Factors!D239*g_kg*kg_mt*GWP_CH4","v":0},{"$f":"E199*Factors!E239*g_kg*kg_mt*GWP_CH4","v":0},{"$f":"F199*Factors!F239*g_kg*kg_mt*GWP_CH4","v":0},{"$f":"G199*Factors!G239*g_kg*kg_mt*GWP_CH4","v":0},{"$f":"H199*Factors!H239*g_kg*kg_mt*GWP_CH4","v":0},0,null,2010,{"$f":"C199*Factors!K239*g_kg*kg_mt*GWP_N2O","v":0},{"$f":"D199*Factors!L239*g_kg*kg_mt*GWP_N2O","v":0},{"$f":"E199*Factors!M239*g_kg*kg_mt*GWP_N2O","v":0},{"$f":"F199*Factors!N239*g_kg*kg_mt*GWP_N2O","v":0},{"$f":"G199*Factors!O239*g_kg*kg_mt*GWP_N2O","v":0},{"$f":"H199*Factors!P239*g_kg*kg_mt*GWP_N2O","v":0},0]
[null,2011,{"$f":"SUMIFS('Mobile-Data'!$I$9:$I$1048576,'Mobile-Data'!$D$9:$D$1048576,$B200,'Mobile-Data'!$E$9:$E$1048576,'Mobile-Detail Calcs'!C$167,'Mobile-Data'!$G$9:$G$1048576,'Mobile-Detail Calcs'!C$168,'Mobile-Data'!$C$9:$C$1048576,'Mobile-Detail Calcs'!$C$162)","v":0},{"$f":"SUMIFS('Mobile-Data'!$I$9:$I$1048576,'Mobile-Data'!$D$9:$D$1048576,$B200,'Mobile-Data'!$E$9:$E$1048576,'Mobile-Detail Calcs'!D$167,'Mobile-Data'!$G$9:$G$1048576,'Mobile-Detail Calcs'!D$168,'Mobile-Data'!$C$9:$C$1048576,'Mobile-Detail Calcs'!$C$162)","v":0},{"$f":"SUMIFS('Mobile-Data'!$I$9:$I$1048576,'Mobile-Data'!$D$9:$D$1048576,$B200,'Mobile-Data'!$E$9:$E$1048576,'Mobile-Detail Calcs'!E$167,'Mobile-Data'!$G$9:$G$1048576,'Mobile-Detail Calcs'!E$168,'Mobile-Data'!$C$9:$C$1048576,'Mobile-Detail Calcs'!$C$162)","v":0},{"$f":"SUMIFS('Mobile-Data'!$I$9:$I$1048576,'Mobile-Data'!$D$9:$D$1048576,$B200,'Mobile-Data'!$E$9:$E$1048576,'Mobile-Detail Calcs'!F$167,'Mobile-Data'!$G$9:$G$1048576,'Mobile-Detail Calcs'!F$168,'Mobile-Data'!$C$9:$C$1048576,'Mobile-Detail Calcs'!$C$162)","v":0},{"$f":"SUMIFS('Mobile-Data'!$I$9:$I$1048576,'Mobile-Data'!$D$9:$D$1048576,$B200,'Mobile-Data'!$E$9:$E$1048576,'Mobile-Detail Calcs'!G$167,'Mobile-Data'!$G$9:$G$1048576,'Mobile-Detail Calcs'!G$168,'Mobile-Data'!$C$9:$C$1048576,'Mobile-Detail Calcs'!$C$162)","v":0},{"$f":"SUMIFS('Mobile-Data'!$I$9:$I$1048576,'Mobile-Data'!$D$9:$D$1048576,$B200,'Mobile-Data'!$E$9:$E$1048576,'Mobile-Detail Calcs'!H$167,'Mobile-Data'!$G$9:$G$1048576,'Mobile-Detail Calcs'!H$168,'Mobile-Data'!$C$9:$C$1048576,'Mobile-Detail Calcs'!$C$162)","v":0},0,null,2011,{"$f":"C200*Factors!C240*g_kg*kg_mt*GWP_CH4","v":0},{"$f":"D200*Factors!D240*g_kg*kg_mt*GWP_CH4","v":0},{"$f":"E200*Factors!E240*g_kg*kg_mt*GWP_CH4","v":0},{"$f":"F200*Factors!F240*g_kg*kg_mt*GWP_CH4","v":0},{"$f":"G200*Factors!G240*g_kg*kg_mt*GWP_CH4","v":0},{"$f":"H200*Factors!H240*g_kg*kg_mt*GWP_CH4","v":0},0,null,2011,{"$f":"C200*Factors!K240*g_kg*kg_mt*GWP_N2O","v":0},{"$f":"D200*Factors!L240*g_kg*kg_mt*GWP_N2O","v":0},{"$f":"E200*Factors!M240*g_kg*kg_mt*GWP_N2O","v":0},{"$f":"F200*Factors!N240*g_kg*kg_mt*GWP_N2O","v":0},{"$f":"G200*Factors!O240*g_kg*kg_mt*GWP_N2O","v":0},{"$f":"H200*Factors!P240*g_kg*kg_mt*GWP_N2O","v":0},0]
[null,2012,{"$f":"SUMIFS('Mobile-Data'!$I$9:$I$1048576,'Mobile-Data'!$D$9:$D$1048576,$B201,'Mobile-Data'!$E$9:$E$1048576,'Mobile-Detail Calcs'!C$167,'Mobile-Data'!$G$9:$G$1048576,'Mobile-Detail Calcs'!C$168,'Mobile-Data'!$C$9:$C$1048576,'Mobile-Detail Calcs'!$C$162)","v":0},{"$f":"SUMIFS('Mobile-Data'!$I$9:$I$1048576,'Mobile-Data'!$D$9:$D$1048576,$B201,'Mobile-Data'!$E$9:$E$1048576,'Mobile-Detail Calcs'!D$167,'Mobile-Data'!$G$9:$G$1048576,'Mobile-Detail Calcs'!D$168,'Mobile-Data'!$C$9:$C$1048576,'Mobile-Detail Calcs'!$C$162)","v":0},{"$f":"SUMIFS('Mobile-Data'!$I$9:$I$1048576,'Mobile-Data'!$D$9:$D$1048576,$B201,'Mobile-Data'!$E$9:$E$1048576,'Mobile-Detail Calcs'!E$167,'Mobile-Data'!$G$9:$G$1048576,'Mobile-Detail Calcs'!E$168,'Mobile-Data'!$C$9:$C$1048576,'Mobile-Detail Calcs'!$C$162)","v":0},{"$f":"SUMIFS('Mobile-Data'!$I$9:$I$1048576,'Mobile-Data'!$D$9:$D$1048576,$B201,'Mobile-Data'!$E$9:$E$1048576,'Mobile-Detail Calcs'!F$167,'Mobile-Data'!$G$9:$G$1048576,'Mobile-Detail Calcs'!F$168,'Mobile-Data'!$C$9:$C$1048576,'Mobile-Detail Calcs'!$C$162)","v":0},{"$f":"SUMIFS('Mobile-Data'!$I$9:$I$1048576,'Mobile-Data'!$D$9:$D$1048576,$B201,'Mobile-Data'!$E$9:$E$1048576,'Mobile-Detail Calcs'!G$167,'Mobile-Data'!$G$9:$G$1048576,'Mobile-Detail Calcs'!G$168,'Mobile-Data'!$C$9:$C$1048576,'Mobile-Detail Calcs'!$C$162)","v":0},{"$f":"SUMIFS('Mobile-Data'!$I$9:$I$1048576,'Mobile-Data'!$D$9:$D$1048576,$B201,'Mobile-Data'!$E$9:$E$1048576,'Mobile-Detail Calcs'!H$167,'Mobile-Data'!$G$9:$G$1048576,'Mobile-Detail Calcs'!H$168,'Mobile-Data'!$C$9:$C$1048576,'Mobile-Detail Calcs'!$C$162)","v":0},0,null,2012,{"$f":"C201*Factors!C241*g_kg*kg_mt*GWP_CH4","v":0},{"$f":"D201*Factors!D241*g_kg*kg_mt*GWP_CH4","v":0},{"$f":"E201*Factors!E241*g_kg*kg_mt*GWP_CH4","v":0},{"$f":"F201*Factors!F241*g_kg*kg_mt*GWP_CH4","v":0},{"$f":"G201*Factors!G241*g_kg*kg_mt*GWP_CH4","v":0},{"$f":"H201*Factors!H241*g_kg*kg_mt*GWP_CH4","v":0},0,null,2012,{"$f":"C201*Factors!K241*g_kg*kg_mt*GWP_N2O","v":0},{"$f":"D201*Factors!L241*g_kg*kg_mt*GWP_N2O","v":0},{"$f":"E201*Factors!M241*g_kg*kg_mt*GWP_N2O","v":0},{"$f":"F201*Factors!N241*g_kg*kg_mt*GWP_N2O","v":0},{"$f":"G201*Factors!O241*g_kg*kg_mt*GWP_N2O","v":0},{"$f":"H201*Factors!P241*g_kg*kg_mt*GWP_N2O","v":0},0]
[null,2013,{"$f":"SUMIFS('Mobile-Data'!$I$9:$I$1048576,'Mobile-Data'!$D$9:$D$1048576,$B202,'Mobile-Data'!$E$9:$E$1048576,'Mobile-Detail Calcs'!C$167,'Mobile-Data'!$G$9:$G$1048576,'Mobile-Detail Calcs'!C$168,'Mobile-Data'!$C$9:$C$1048576,'Mobile-Detail Calcs'!$C$162)","v":0},{"$f":"SUMIFS('Mobile-Data'!$I$9:$I$1048576,'Mobile-Data'!$D$9:$D$1048576,$B202,'Mobile-Data'!$E$9:$E$1048576,'Mobile-Detail Calcs'!D$167,'Mobile-Data'!$G$9:$G$1048576,'Mobile-Detail Calcs'!D$168,'Mobile-Data'!$C$9:$C$1048576,'Mobile-Detail Calcs'!$C$162)","v":0},{"$f":"SUMIFS('Mobile-Data'!$I$9:$I$1048576,'Mobile-Data'!$D$9:$D$1048576,$B202,'Mobile-Data'!$E$9:$E$1048576,'Mobile-Detail Calcs'!E$167,'Mobile-Data'!$G$9:$G$1048576,'Mobile-Detail Calcs'!E$168,'Mobile-Data'!$C$9:$C$1048576,'Mobile-Detail Calcs'!$C$162)","v":0},{"$f":"SUMIFS('Mobile-Data'!$I$9:$I$1048576,'Mobile-Data'!$D$9:$D$1048576,$B202,'Mobile-Data'!$E$9:$E$1048576,'Mobile-Detail Calcs'!F$167,'Mobile-Data'!$G$9:$G$1048576,'Mobile-Detail Calcs'!F$168,'Mobile-Data'!$C$9:$C$1048576,'Mobile-Detail Calcs'!$C$162)","v":0},{"$f":"SUMIFS('Mobile-Data'!$I$9:$I$1048576,'Mobile-Data'!$D$9:$D$1048576,$B202,'Mobile-Data'!$E$9:$E$1048576,'Mobile-Detail Calcs'!G$167,'Mobile-Data'!$G$9:$G$1048576,'Mobile-Detail Calcs'!G$168,'Mobile-Data'!$C$9:$C$1048576,'Mobile-Detail Calcs'!$C$162)","v":0},{"$f":"SUMIFS('Mobile-Data'!$I$9:$I$1048576,'Mobile-Data'!$D$9:$D$1048576,$B202,'Mobile-Data'!$E$9:$E$1048576,'Mobile-Detail Calcs'!H$167,'Mobile-Data'!$G$9:$G$1048576,'Mobile-Detail Calcs'!H$168,'Mobile-Data'!$C$9:$C$1048576,'Mobile-Detail Calcs'!$C$162)","v":0},{"$f":"SUM(C202:H202)","v":0},null,2013,{"$f":"C202*Factors!C242*g_kg*kg_mt*GWP_CH4","v":0},{"$f":"D202*Factors!D242*g_kg*kg_mt*GWP_CH4","v":0},{"$f":"E202*Factors!E242*g_kg*kg_mt*GWP_CH4","v":0},{"$f":"F202*Factors!F242*g_kg*kg_mt*GWP_CH4","v":0},{"$f":"G202*Factors!G242*g_kg*kg_mt*GWP_CH4","v":0},{"$f":"H202*Factors!H242*g_kg*kg_mt*GWP_CH4","v":0},{"$f":"SUM(L202:Q202)","v":0},null,2013,{"$f":"C202*Factors!K242*g_kg*kg_mt*GWP_N2O","v":0},{"$f":"D202*Factors!L242*g_kg*kg_mt*GWP_N2O","v":0},{"$f":"E202*Factors!M242*g_kg*kg_mt*GWP_N2O","v":0},{"$f":"F202*Factors!N242*g_kg*kg_mt*GWP_N2O","v":0},{"$f":"G202*Factors!O242*g_kg*kg_mt*GWP_N2O","v":0},{"$f":"H202*Factors!P242*g_kg*kg_mt*GWP_N2O","v":0},{"$f":"SUM(U202:Z202)","v":0}]
[null,2014,{"$f":"SUMIFS('Mobile-Data'!$I$9:$I$1048576,'Mobile-Data'!$D$9:$D$1048576,$B203,'Mobile-Data'!$E$9:$E$1048576,'Mobile-Detail Calcs'!C$167,'Mobile-Data'!$G$9:$G$1048576,'Mobile-Detail Calcs'!C$168,'Mobile-Data'!$C$9:$C$1048576,'Mobile-Detail Calcs'!$C$162)","v":0},{"$f":"SUMIFS('Mobile-Data'!$I$9:$I$1048576,'Mobile-Data'!$D$9:$D$1048576,$B203,'Mobile-Data'!$E$9:$E$1048576,'Mobile-Detail Calcs'!D$167,'Mobile-Data'!$G$9:$G$1048576,'Mobile-Detail Calcs'!D$168,'Mobile-Data'!$C$9:$C$1048576,'Mobile-Detail Calcs'!$C$162)","v":0},{"$f":"SUMIFS('Mobile-Data'!$I$9:$I$1048576,'Mobile-Data'!$D$9:$D$1048576,$B203,'Mobile-Data'!$E$9:$E$1048576,'Mobile-Detail Calcs'!E$167,'Mobile-Data'!$G$9:$G$1048576,'Mobile-Detail Calcs'!E$168,'Mobile-Data'!$C$9:$C$1048576,'Mobile-Detail Calcs'!$C$162)","v":0},{"$f":"SUMIFS('Mobile-Data'!$I$9:$I$1048576,'Mobile-Data'!$D$9:$D$1048576,$B203,'Mobile-Data'!$E$9:$E$1048576,'Mobile-Detail Calcs'!F$167,'Mobile-Data'!$G$9:$G$1048576,'Mobile-Detail Calcs'!F$168,'Mobile-Data'!$C$9:$C$1048576,'Mobile-Detail Calcs'!$C$162)","v":0},{"$f":"SUMIFS('Mobile-Data'!$I$9:$I$1048576,'Mobile-Data'!$D$9:$D$1048576,$B203,'Mobile-Data'!$E$9:$E$1048576,'Mobile-Detail Calcs'!G$167,'Mobile-Data'!$G$9:$G$1048576,'Mobile-Detail Calcs'!G$168,'Mobile-Data'!$C$9:$C$1048576,'Mobile-Detail Calcs'!$C$162)","v":0},{"$f":"SUMIFS('Mobile-Data'!$I$9:$I$1048576,'Mobile-Data'!$D$9:$D$1048576,$B203,'Mobile-Data'!$E$9:$E$1048576,'Mobile-Detail Calcs'!H$167,'Mobile-Data'!$G$9:$G$1048576,'Mobile-Detail Calcs'!H$168,'Mobile-Data'!$C$9:$C$1048576,'Mobile-Detail Calcs'!$C$162)","v":0},0,null,2014,{"$f":"C203*Factors!C243*g_kg*kg_mt*GWP_CH4","v":0},{"$f":"D203*Factors!D243*g_kg*kg_mt*GWP_CH4","v":0},{"$f":"E203*Factors!E243*g_kg*kg_mt*GWP_CH4","v":0},{"$f":"F203*Factors!F243*g_kg*kg_mt*GWP_CH4","v":0},{"$f":"G203*Factors!G243*g_kg*kg_mt*GWP_CH4","v":0},{"$f":"H203*Factors!H243*g_kg*kg_mt*GWP_CH4","v":0},0,null,2014,{"$f":"C203*Factors!K243*g_kg*kg_mt*GWP_N2O","v":0},{"$f":"D203*Factors!L243*g_kg*kg_mt*GWP_N2O","v":0},{"$f":"E203*Factors!M243*g_kg*kg_mt*GWP_N2O","v":0},{"$f":"F203*Factors!N243*g_kg*kg_mt*GWP_N2O","v":0},{"$f":"G203*Factors!O243*g_kg*kg_mt*GWP_N2O","v":0},{"$f":"H203*Factors!P243*g_kg*kg_mt*GWP_N2O","v":0},0]
[null,2015,{"$f":"SUMIFS('Mobile-Data'!$I$9:$I$1048576,'Mobile-Data'!$D$9:$D$1048576,$B204,'Mobile-Data'!$E$9:$E$1048576,'Mobile-Detail Calcs'!C$167,'Mobile-Data'!$G$9:$G$1048576,'Mobile-Detail Calcs'!C$168,'Mobile-Data'!$C$9:$C$1048576,'Mobile-Detail Calcs'!$C$162)","v":0},{"$f":"SUMIFS('Mobile-Data'!$I$9:$I$1048576,'Mobile-Data'!$D$9:$D$1048576,$B204,'Mobile-Data'!$E$9:$E$1048576,'Mobile-Detail Calcs'!D$167,'Mobile-Data'!$G$9:$G$1048576,'Mobile-Detail Calcs'!D$168,'Mobile-Data'!$C$9:$C$1048576,'Mobile-Detail Calcs'!$C$162)","v":0},{"$f":"SUMIFS('Mobile-Data'!$I$9:$I$1048576,'Mobile-Data'!$D$9:$D$1048576,$B204,'Mobile-Data'!$E$9:$E$1048576,'Mobile-Detail Calcs'!E$167,'Mobile-Data'!$G$9:$G$1048576,'Mobile-Detail Calcs'!E$168,'Mobile-Data'!$C$9:$C$1048576,'Mobile-Detail Calcs'!$C$162)","v":0},{"$f":"SUMIFS('Mobile-Data'!$I$9:$I$1048576,'Mobile-Data'!$D$9:$D$1048576,$B204,'Mobile-Data'!$E$9:$E$1048576,'Mobile-Detail Calcs'!F$167,'Mobile-Data'!$G$9:$G$1048576,'Mobile-Detail Calcs'!F$168,'Mobile-Data'!$C$9:$C$1048576,'Mobile-Detail Calcs'!$C$162)","v":0},{"$f":"SUMIFS('Mobile-Data'!$I$9:$I$1048576,'Mobile-Data'!$D$9:$D$1048576,$B204,'Mobile-Data'!$E$9:$E$1048576,'Mobile-Detail Calcs'!G$167,'Mobile-Data'!$G$9:$G$1048576,'Mobile-Detail Calcs'!G$168,'Mobile-Data'!$C$9:$C$1048576,'Mobile-Detail Calcs'!$C$162)","v":0},{"$f":"SUMIFS('Mobile-Data'!$I$9:$I$1048576,'Mobile-Data'!$D$9:$D$1048576,$B204,'Mobile-Data'!$E$9:$E$1048576,'Mobile-Detail Calcs'!H$167,'Mobile-Data'!$G$9:$G$1048576,'Mobile-Detail Calcs'!H$168,'Mobile-Data'!$C$9:$C$1048576,'Mobile-Detail Calcs'!$C$162)","v":0},0,null,2015,{"$f":"C204*Factors!C244*g_kg*kg_mt*GWP_CH4","v":0},{"$f":"D204*Factors!D244*g_kg*kg_mt*GWP_CH4","v":0},{"$f":"E204*Factors!E244*g_kg*kg_mt*GWP_CH4","v":0},{"$f":"F204*Factors!F244*g_kg*kg_mt*GWP_CH4","v":0},{"$f":"G204*Factors!G244*g_kg*kg_mt*GWP_CH4","v":0},{"$f":"H204*Factors!H244*g_kg*kg_mt*GWP_CH4","v":0},0,null,2015,{"$f":"C204*Factors!K244*g_kg*kg_mt*GWP_N2O","v":0},{"$f":"D204*Factors!L244*g_kg*kg_mt*GWP_N2O","v":0},{"$f":"E204*Factors!M244*g_kg*kg_mt*GWP_N2O","v":0},{"$f":"F204*Factors!N244*g_kg*kg_mt*GWP_N2O","v":0},{"$f":"G204*Factors!O244*g_kg*kg_mt*GWP_N2O","v":0},{"$f":"H204*Factors!P244*g_kg*kg_mt*GWP_N2O","v":0},0]
[null,2016,{"$f":"SUMIFS('Mobile-Data'!$I$9:$I$1048576,'Mobile-Data'!$D$9:$D$1048576,$B205,'Mobile-Data'!$E$9:$E$1048576,'Mobile-Detail Calcs'!C$167,'Mobile-Data'!$G$9:$G$1048576,'Mobile-Detail Calcs'!C$168,'Mobile-Data'!$C$9:$C$1048576,'Mobile-Detail Calcs'!$C$162)","v":0},{"$f":"SUMIFS('Mobile-Data'!$I$9:$I$1048576,'Mobile-Data'!$D$9:$D$1048576,$B205,'Mobile-Data'!$E$9:$E$1048576,'Mobile-Detail Calcs'!D$167,'Mobile-Data'!$G$9:$G$1048576,'Mobile-Detail Calcs'!D$168,'Mobile-Data'!$C$9:$C$1048576,'Mobile-Detail Calcs'!$C$162)","v":0},{"$f":"SUMIFS('Mobile-Data'!$I$9:$I$1048576,'Mobile-Data'!$D$9:$D$1048576,$B205,'Mobile-Data'!$E$9:$E$1048576,'Mobile-Detail Calcs'!E$167,'Mobile-Data'!$G$9:$G$1048576,'Mobile-Detail Calcs'!E$168,'Mobile-Data'!$C$9:$C$1048576,'Mobile-Detail Calcs'!$C$162)","v":0},{"$f":"SUMIFS('Mobile-Data'!$I$9:$I$1048576,'Mobile-Data'!$D$9:$D$1048576,$B205,'Mobile-Data'!$E$9:$E$1048576,'Mobile-Detail Calcs'!F$167,'Mobile-Data'!$G$9:$G$1048576,'Mobile-Detail Calcs'!F$168,'Mobile-Data'!$C$9:$C$1048576,'Mobile-Detail Calcs'!$C$162)","v":0},{"$f":"SUMIFS('Mobile-Data'!$I$9:$I$1048576,'Mobile-Data'!$D$9:$D$1048576,$B205,'Mobile-Data'!$E$9:$E$1048576,'Mobile-Detail Calcs'!G$167,'Mobile-Data'!$G$9:$G$1048576,'Mobile-Detail Calcs'!G$168,'Mobile-Data'!$C$9:$C$1048576,'Mobile-Detail Calcs'!$C$162)","v":0},{"$f":"SUMIFS('Mobile-Data'!$I$9:$I$1048576,'Mobile-Data'!$D$9:$D$1048576,$B205,'Mobile-Data'!$E$9:$E$1048576,'Mobile-Detail Calcs'!H$167,'Mobile-Data'!$G$9:$G$1048576,'Mobile-Detail Calcs'!H$168,'Mobile-Data'!$C$9:$C$1048576,'Mobile-Detail Calcs'!$C$162)","v":0},0,null,2016,{"$f":"C205*Factors!C245*g_kg*kg_mt*GWP_CH4","v":0},{"$f":"D205*Factors!D245*g_kg*kg_mt*GWP_CH4","v":0},{"$f":"E205*Factors!E245*g_kg*kg_mt*GWP_CH4","v":0},{"$f":"F205*Factors!F245*g_kg*kg_mt*GWP_CH4","v":0},{"$f":"G205*Factors!G245*g_kg*kg_mt*GWP_CH4","v":0},{"$f":"H205*Factors!H245*g_kg*kg_mt*GWP_CH4","v":0},0,null,2016,{"$f":"C205*Factors!K245*g_kg*kg_mt*GWP_N2O","v":0},{"$f":"D205*Factors!L245*g_kg*kg_mt*GWP_N2O","v":0},{"$f":"E205*Factors!M245*g_kg*kg_mt*GWP_N2O","v":0},{"$f":"F205*Factors!N245*g_kg*kg_mt*GWP_N2O","v":0},{"$f":"G205*Factors!O245*g_kg*kg_mt*GWP_N2O","v":0},{"$f":"H205*Factors!P245*g_kg*kg_mt*GWP_N2O","v":0},0]
[null,2017,{"$f":"SUMIFS('Mobile-Data'!$I$9:$I$1048576,'Mobile-Data'!$D$9:$D$1048576,$B206,'Mobile-Data'!$E$9:$E$1048576,'Mobile-Detail Calcs'!C$167,'Mobile-Data'!$G$9:$G$1048576,'Mobile-Detail Calcs'!C$168,'Mobile-Data'!$C$9:$C$1048576,'Mobile-Detail Calcs'!$C$162)","v":0},{"$f":"SUMIFS('Mobile-Data'!$I$9:$I$1048576,'Mobile-Data'!$D$9:$D$1048576,$B206,'Mobile-Data'!$E$9:$E$1048576,'Mobile-Detail Calcs'!D$167,'Mobile-Data'!$G$9:$G$1048576,'Mobile-Detail Calcs'!D$168,'Mobile-Data'!$C$9:$C$1048576,'Mobile-Detail Calcs'!$C$162)","v":0},{"$f":"SUMIFS('Mobile-Data'!$I$9:$I$1048576,'Mobile-Data'!$D$9:$D$1048576,$B206,'Mobile-Data'!$E$9:$E$1048576,'Mobile-Detail Calcs'!E$167,'Mobile-Data'!$G$9:$G$1048576,'Mobile-Detail Calcs'!E$168,'Mobile-Data'!$C$9:$C$1048576,'Mobile-Detail Calcs'!$C$162)","v":0},{"$f":"SUMIFS('Mobile-Data'!$I$9:$I$1048576,'Mobile-Data'!$D$9:$D$1048576,$B206,'Mobile-Data'!$E$9:$E$1048576,'Mobile-Detail Calcs'!F$167,'Mobile-Data'!$G$9:$G$1048576,'Mobile-Detail Calcs'!F$168,'Mobile-Data'!$C$9:$C$1048576,'Mobile-Detail Calcs'!$C$162)","v":0},{"$f":"SUMIFS('Mobile-Data'!$I$9:$I$1048576,'Mobile-Data'!$D$9:$D$1048576,$B206,'Mobile-Data'!$E$9:$E$1048576,'Mobile-Detail Calcs'!G$167,'Mobile-Data'!$G$9:$G$1048576,'Mobile-Detail Calcs'!G$168,'Mobile-Data'!$C$9:$C$1048576,'Mobile-Detail Calcs'!$C$162)","v":0},{"$f":"SUMIFS('Mobile-Data'!$I$9:$I$1048576,'Mobile-Data'!$D$9:$D$1048576,$B206,'Mobile-Data'!$E$9:$E$1048576,'Mobile-Detail Calcs'!H$167,'Mobile-Data'!$G$9:$G$1048576,'Mobile-Detail Calcs'!H$168,'Mobile-Data'!$C$9:$C$1048576,'Mobile-Detail Calcs'!$C$162)","v":0},0,null,2017,{"$f":"C206*Factors!C246*g_kg*kg_mt*GWP_CH4","v":0},{"$f":"D206*Factors!D246*g_kg*kg_mt*GWP_CH4","v":0},{"$f":"E206*Factors!E246*g_kg*kg_mt*GWP_CH4","v":0},{"$f":"F206*Factors!F246*g_kg*kg_mt*GWP_CH4","v":0},{"$f":"G206*Factors!G246*g_kg*kg_mt*GWP_CH4","v":0},{"$f":"H206*Factors!H246*g_kg*kg_mt*GWP_CH4","v":0},0,null,2017,{"$f":"C206*Factors!K246*g_kg*kg_mt*GWP_N2O","v":0},{"$f":"D206*Factors!L246*g_kg*kg_mt*GWP_N2O","v":0},{"$f":"E206*Factors!M246*g_kg*kg_mt*GWP_N2O","v":0},{"$f":"F206*Factors!N246*g_kg*kg_mt*GWP_N2O","v":0},{"$f":"G206*Factors!O246*g_kg*kg_mt*GWP_N2O","v":0},{"$f":"H206*Factors!P246*g_kg*kg_mt*GWP_N2O","v":0},0]
[null,2018,{"$f":"SUMIFS('Mobile-Data'!$I$9:$I$1048576,'Mobile-Data'!$D$9:$D$1048576,$B207,'Mobile-Data'!$E$9:$E$1048576,'Mobile-Detail Calcs'!C$167,'Mobile-Data'!$G$9:$G$1048576,'Mobile-Detail Calcs'!C$168,'Mobile-Data'!$C$9:$C$1048576,'Mobile-Detail Calcs'!$C$162)","v":0},{"$f":"SUMIFS('Mobile-Data'!$I$9:$I$1048576,'Mobile-Data'!$D$9:$D$1048576,$B207,'Mobile-Data'!$E$9:$E$1048576,'Mobile-Detail Calcs'!D$167,'Mobile-Data'!$G$9:$G$1048576,'Mobile-Detail Calcs'!D$168,'Mobile-Data'!$C$9:$C$1048576,'Mobile-Detail Calcs'!$C$162)","v":0},{"$f":"SUMIFS('Mobile-Data'!$I$9:$I$1048576,'Mobile-Data'!$D$9:$D$1048576,$B207,'Mobile-Data'!$E$9:$E$1048576,'Mobile-Detail Calcs'!E$167,'Mobile-Data'!$G$9:$G$1048576,'Mobile-Detail Calcs'!E$168,'Mobile-Data'!$C$9:$C$1048576,'Mobile-Detail Calcs'!$C$162)","v":0},{"$f":"SUMIFS('Mobile-Data'!$I$9:$I$1048576,'Mobile-Data'!$D$9:$D$1048576,$B207,'Mobile-Data'!$E$9:$E$1048576,'Mobile-Detail Calcs'!F$167,'Mobile-Data'!$G$9:$G$1048576,'Mobile-Detail Calcs'!F$168,'Mobile-Data'!$C$9:$C$1048576,'Mobile-Detail Calcs'!$C$162)","v":0},{"$f":"SUMIFS('Mobile-Data'!$I$9:$I$1048576,'Mobile-Data'!$D$9:$D$1048576,$B207,'Mobile-Data'!$E$9:$E$1048576,'Mobile-Detail Calcs'!G$167,'Mobile-Data'!$G$9:$G$1048576,'Mobile-Detail Calcs'!G$168,'Mobile-Data'!$C$9:$C$1048576,'Mobile-Detail Calcs'!$C$162)","v":0},{"$f":"SUMIFS('Mobile-Data'!$I$9:$I$1048576,'Mobile-Data'!$D$9:$D$1048576,$B207,'Mobile-Data'!$E$9:$E$1048576,'Mobile-Detail Calcs'!H$167,'Mobile-Data'!$G$9:$G$1048576,'Mobile-Detail Calcs'!H$168,'Mobile-Data'!$C$9:$C$1048576,'Mobile-Detail Calcs'!$C$162)","v":0},0,null,2018,{"$f":"C207*Factors!C247*g_kg*kg_mt*GWP_CH4","v":0},{"$f":"D207*Factors!D247*g_kg*kg_mt*GWP_CH4","v":0},{"$f":"E207*Factors!E247*g_kg*kg_mt*GWP_CH4","v":0},{"$f":"F207*Factors!F247*g_kg*kg_mt*GWP_CH4","v":0},{"$f":"G207*Factors!G247*g_kg*kg_mt*GWP_CH4","v":0},{"$f":"H207*Factors!H247*g_kg*kg_mt*GWP_CH4","v":0},0,null,2018,{"$f":"C207*Factors!K247*g_kg*kg_mt*GWP_N2O","v":0},{"$f":"D207*Factors!L247*g_kg*kg_mt*GWP_N2O","v":0},{"$f":"E207*Factors!M247*g_kg*kg_mt*GWP_N2O","v":0},{"$f":"F207*Factors!N247*g_kg*kg_mt*GWP_N2O","v":0},{"$f":"G207*Factors!O247*g_kg*kg_mt*GWP_N2O","v":0},{"$f":"H207*Factors!P247*g_kg*kg_mt*GWP_N2O","v":0},0]
[null,2019,{"$f":"SUMIFS('Mobile-Data'!$I$9:$I$1048576,'Mobile-Data'!$D$9:$D$1048576,$B208,'Mobile-Data'!$E$9:$E$1048576,'Mobile-Detail Calcs'!C$167,'Mobile-Data'!$G$9:$G$1048576,'Mobile-Detail Calcs'!C$168,'Mobile-Data'!$C$9:$C$1048576,'Mobile-Detail Calcs'!$C$162)","v":0},{"$f":"SUMIFS('Mobile-Data'!$I$9:$I$1048576,'Mobile-Data'!$D$9:$D$1048576,$B208,'Mobile-Data'!$E$9:$E$1048576,'Mobile-Detail Calcs'!D$167,'Mobile-Data'!$G$9:$G$1048576,'Mobile-Detail Calcs'!D$168,'Mobile-Data'!$C$9:$C$1048576,'Mobile-Detail Calcs'!$C$162)","v":0},{"$f":"SUMIFS('Mobile-Data'!$I$9:$I$1048576,'Mobile-Data'!$D$9:$D$1048576,$B208,'Mobile-Data'!$E$9:$E$1048576,'Mobile-Detail Calcs'!E$167,'Mobile-Data'!$G$9:$G$1048576,'Mobile-Detail Calcs'!E$168,'Mobile-Data'!$C$9:$C$1048576,'Mobile-Detail Calcs'!$C$162)","v":0},{"$f":"SUMIFS('Mobile-Data'!$I$9:$I$1048576,'Mobile-Data'!$D$9:$D$1048576,$B208,'Mobile-Data'!$E$9:$E$1048576,'Mobile-Detail Calcs'!F$167,'Mobile-Data'!$G$9:$G$1048576,'Mobile-Detail Calcs'!F$168,'Mobile-Data'!$C$9:$C$1048576,'Mobile-Detail Calcs'!$C$162)","v":0},{"$f":"SUMIFS('Mobile-Data'!$I$9:$I$1048576,'Mobile-Data'!$D$9:$D$1048576,$B208,'Mobile-Data'!$E$9:$E$1048576,'Mobile-Detail Calcs'!G$167,'Mobile-Data'!$G$9:$G$1048576,'Mobile-Detail Calcs'!G$168,'Mobile-Data'!$C$9:$C$1048576,'Mobile-Detail Calcs'!$C$162)","v":0},{"$f":"SUMIFS('Mobile-Data'!$I$9:$I$1048576,'Mobile-Data'!$D$9:$D$1048576,$B208,'Mobile-Data'!$E$9:$E$1048576,'Mobile-Detail Calcs'!H$167,'Mobile-Data'!$G$9:$G$1048576,'Mobile-Detail Calcs'!H$168,'Mobile-Data'!$C$9:$C$1048576,'Mobile-Detail Calcs'!$C$162)","v":0},0,null,2019,{"$f":"C208*Factors!C248*g_kg*kg_mt*GWP_CH4","v":0},{"$f":"D208*Factors!D248*g_kg*kg_mt*GWP_CH4","v":0},{"$f":"E208*Factors!E248*g_kg*kg_mt*GWP_CH4","v":0},{"$f":"F208*Factors!F248*g_kg*kg_mt*GWP_CH4","v":0},{"$f":"G208*Factors!G248*g_kg*kg_mt*GWP_CH4","v":0},{"$f":"H208*Factors!H248*g_kg*kg_mt*GWP_CH4","v":0},0,null,2019,{"$f":"C208*Factors!K248*g_kg*kg_mt*GWP_N2O","v":0},{"$f":"D208*Factors!L248*g_kg*kg_mt*GWP_N2O","v":0},{"$f":"E208*Factors!M248*g_kg*kg_mt*GWP_N2O","v":0},{"$f":"F208*Factors!N248*g_kg*kg_mt*GWP_N2O","v":0},{"$f":"G208*Factors!O248*g_kg*kg_mt*GWP_N2O","v":0},{"$f":"H208*Factors!P248*g_kg*kg_mt*GWP_N2O","v":0},0]
[null,"2020 & later",{"$f":"SUMIFS('Mobile-Data'!$I$9:$I$1048576,'Mobile-Data'!$D$9:$D$1048576,\">=2020\",'Mobile-Data'!$E$9:$E$1048576,'Mobile-Detail Calcs'!C$167,'Mobile-Data'!$G$9:$G$1048576,'Mobile-Detail Calcs'!C$168,'Mobile-Data'!$C$9:$C$1048576,'Mobile-Detail Calcs'!$C$162)","v":0},{"$f":"SUMIFS('Mobile-Data'!$I$9:$I$1048576,'Mobile-Data'!$D$9:$D$1048576,\">=2020\",'Mobile-Data'!$E$9:$E$1048576,'Mobile-Detail Calcs'!D$167,'Mobile-Data'!$G$9:$G$1048576,'Mobile-Detail Calcs'!D$168,'Mobile-Data'!$C$9:$C$1048576,'Mobile-Detail Calcs'!$C$162)","v":0},{"$f":"SUMIFS('Mobile-Data'!$I$9:$I$1048576,'Mobile-Data'!$D$9:$D$1048576,\">=2020\",'Mobile-Data'!$E$9:$E$1048576,'Mobile-Detail Calcs'!E$167,'Mobile-Data'!$G$9:$G$1048576,'Mobile-Detail Calcs'!E$168,'Mobile-Data'!$C$9:$C$1048576,'Mobile-Detail Calcs'!$C$162)","v":0},{"$f":"SUMIFS('Mobile-Data'!$I$9:$I$1048576,'Mobile-Data'!$D$9:$D$1048576,\">=2020\",'Mobile-Data'!$E$9:$E$1048576,'Mobile-Detail Calcs'!F$167,'Mobile-Data'!$G$9:$G$1048576,'Mobile-Detail Calcs'!F$168,'Mobile-Data'!$C$9:$C$1048576,'Mobile-Detail Calcs'!$C$162)","v":0},{"$f":"SUMIFS('Mobile-Data'!$I$9:$I$1048576,'Mobile-Data'!$D$9:$D$1048576,\">=2020\",'Mobile-Data'!$E$9:$E$1048576,'Mobile-Detail Calcs'!G$167,'Mobile-Data'!$G$9:$G$1048576,'Mobile-Detail Calcs'!G$168,'Mobile-Data'!$C$9:$C$1048576,'Mobile-Detail Calcs'!$C$162)","v":0},{"$f":"SUMIFS('Mobile-Data'!$I$9:$I$1048576,'Mobile-Data'!$D$9:$D$1048576,\">=2020\",'Mobile-Data'!$E$9:$E$1048576,'Mobile-Detail Calcs'!H$167,'Mobile-Data'!$G$9:$G$1048576,'Mobile-Detail Calcs'!H$168,'Mobile-Data'!$C$9:$C$1048576,'Mobile-Detail Calcs'!$C$162)","v":0},0,null,2020,{"$f":"C209*Factors!C249*g_kg*kg_mt*GWP_CH4","v":0},{"$f":"D209*Factors!D249*g_kg*kg_mt*GWP_CH4","v":0},{"$f":"E209*Factors!E249*g_kg*kg_mt*GWP_CH4","v":0},{"$f":"F209*Factors!F249*g_kg*kg_mt*GWP_CH4","v":0},{"$f":"G209*Factors!G249*g_kg*kg_mt*GWP_CH4","v":0},{"$f":"H209*Factors!H249*g_kg*kg_mt*GWP_CH4","v":0},0,null,2020,{"$f":"C209*Factors!K249*g_kg*kg_mt*GWP_N2O","v":0},{"$f":"D209*Factors!L249*g_kg*kg_mt*GWP_N2O","v":0},{"$f":"E209*Factors!M249*g_kg*kg_mt*GWP_N2O","v":0},{"$f":"F209*Factors!N249*g_kg*kg_mt*GWP_N2O","v":0},{"$f":"G209*Factors!O249*g_kg*kg_mt*GWP_N2O","v":0},{"$f":"H209*Factors!P249*g_kg*kg_mt*GWP_N2O","v":0},0]
[null,"Total",{"$f":"SUM(C169:C209)","v":0},0,0,0,0,0,0,null,"Total",{"$f":"SUM(L169:L209)","v":0},0,0,0,0,0,0,null,"Total",{"$f":"SUM(U169:U209)","v":0},0,0,0,0,0,0]
[]
["2) AFVs, Highway"]
[null,"VMT by Fuel and Vehicle type",null,null,null,null,null,null,null,null,"CH4 Emissions by Fuel and Vehicle Type",null,null,null,null,null,null,null,null,"N2O Emissions by Fuel and Vehicle Type"]
[null,"Vehicle activity data by fuel type and vehicle type for selected sector (miles)",null,null,null,null,null,null,null,null,"CH4 Emissions = VMT × AFV EF (g/mi) × MT/g × GWP CH4",null,null,null,null,null,null,null,null,"N2O Emissions = VMT × AFV EF (g/mi) × MT/g × GWP N2O"]
[null,null,"Passenger Car","Light Truck (Vans, Pickup Trucks, SUVs)","Heavy-Duty Vehicle","TOTAL",null,null,null,null,null,"Passenger Car","Light Truck (Vans, Pickup Trucks, SUVs)","Heavy-Duty Vehicle","TOTAL",null,null,null,null,null,"Passenger Car","Light Truck (Vans, Pickup Trucks, SUVs)","Heavy-Duty Vehicle","TOTAL"]
[null,"CNG",{"$f":"SUMIFS('Mobile-Data'!$I$9:$I$1048576,'Mobile-Data'!$C$9:$C$1048576,$C$162,'Mobile-Data'!$E$9:$E$1048576,C$215,'Mobile-Data'!$G$9:$G$1048576,$B216)","v":0},{"$f":"SUMIFS('Mobile-Data'!$I$9:$I$1048576,'Mobile-Data'!$C$9:$C$1048576,$C$162,'Mobile-Data'!$E$9:$E$1048576,D$215,'Mobile-Data'!$G$9:$G$1048576,$B216)","v":0},{"$f":"SUMIFS('Mobile-Data'!$I$9:$I$1048576,'Mobile-Data'!$C$9:$C$1048576,$C$162,'Mobile-Data'!$E$9:$E$1048576,E$215,'Mobile-Data'!$G$9:$G$1048576,$B216)","v":0},{"$f":"SUM(C216:E216)","v":0},null,null,null,null,"CNG",{"$f":"C216*Factors!C257*g_kg*kg_mt*GWP_CH4","v":0},{"$f":"D216*Factors!D257*g_kg*kg_mt*GWP_CH4","v":0},{"$f":"E216*Factors!E257*g_kg*kg_mt*GWP_CH4","v":0},{"$f":"SUM(L216:N216)","v":0},null,null,null,null,"CNG",{"$f":"C216*Factors!H257*g_kg*kg_mt*GWP_N2O","v":0},{"$f":"D216*Factors!I257*g_kg*kg_mt*GWP_N2O","v":0},{"$f":"E216*Factors!J257*g_kg*kg_mt*GWP_N2O","v":0},{"$f":"SUM(U216:W216)","v":0}]
[null,"LNG","NA","NA",{"$f":"SUMIFS('Mobile-Data'!$I$9:$I$1048576,'Mobile-Data'!$C$9:$C$1048576,$C$162,'Mobile-Data'!$E$9:$E$1048576,E$215,'Mobile-Data'!$G$9:$G$1048576,$B217)","v":0},{"$f":"SUM(C217:E217)","v":0},null,null,null,null,"LNG","NA","NA",{"$f":"E217*Factors!E258*g_kg*kg_mt*GWP_CH4","v":0},{"$f":"SUM(L217:N217)","v":0},null,null,null,null,"LNG","NA","NA",{"$f":"E217*Factors!J258*g_kg*kg_mt*GWP_N2O","v":0},{"$f":"SUM(U217:W217)","v":0}]
[null,"LPG",{"$f":"SUMIFS('Mobile-Data'!$I$9:$I$1048576,'Mobile-Data'!$C$9:$C$1048576,$C$162,'Mobile-Data'!$E$9:$E$1048576,C$215,'Mobile-Data'!$G$9:$G$1048576,$B218)","v":0},{"$f":"SUMIFS('Mobile-Data'!$I$9:$I$1048576,'Mobile-Data'!$C$9:$C$1048576,$C$162,'Mobile-Data'!$E$9:$E$1048576,D$215,'Mobile-Data'!$G$9:$G$1048576,$B218)","v":0},{"$f":"SUMIFS('Mobile-Data'!$I$9:$I$1048576,'Mobile-Data'!$C$9:$C$1048576,$C$162,'Mobile-Data'!$E$9:$E$1048576,E$215,'Mobile-Data'!$G$9:$G$1048576,$B218)","v":0},0,null,null,null,null,"LPG",{"$f":"C218*Factors!C259*g_kg*kg_mt*GWP_CH4","v":0},{"$f":"D218*Factors!D259*g_kg*kg_mt*GWP_CH4","v":0},{"$f":"E218*Factors!E259*g_kg*kg_mt*GWP_CH4","v":0},0,null,null,null,null,"LPG",{"$f":"C218*Factors!H259*g_kg*kg_mt*GWP_N2O","v":0},{"$f":"D218*Factors!I259*g_kg*kg_mt*GWP_N2O","v":0},{"$f":"E218*Factors!J259*g_kg*kg_mt*GWP_N2O","v":0},0]
[null,"Ethanol (E85)",{"$f":"SUMIFS('Mobile-Data'!$I$9:$I$1048576,'Mobile-Data'!$C$9:$C$1048576,$C$162,'Mobile-Data'!$E$9:$E$1048576,C$215,'Mobile-Data'!$G$9:$G$1048576,$B219)","v":0},{"$f":"SUMIFS('Mobile-Data'!$I$9:$I$1048576,'Mobile-Data'!$C$9:$C$1048576,$C$162,'Mobile-Data'!$E$9:$E$1048576,D$215,'Mobile-Data'!$G$9:$G$1048576,$B219)","v":0},{"$f":"SUMIFS('Mobile-Data'!$I$9:$I$1048576,'Mobile-Data'!$C$9:$C$1048576,$C$162,'Mobile-Data'!$E$9:$E$1048576,E$215,'Mobile-Data'!$G$9:$G$1048576,$B219)","v":0},0,null,null,null,null,"Ethanol (E85)",{"$f":"C219*Factors!C260*g_kg*kg_mt*GWP_CH4","v":0},{"$f":"D219*Factors!D260*g_kg*kg_mt*GWP_CH4","v":0},{"$f":"E219*Factors!E260*g_kg*kg_mt*GWP_CH4","v":0},0,null,null,null,null,"Ethanol (E85)",{"$f":"C219*Factors!H260*g_kg*kg_mt*GWP_N2O","v":0},{"$f":"D219*Factors!I260*g_kg*kg_mt*GWP_N2O","v":0},{"$f":"E219*Factors!J260*g_kg*kg_mt*GWP_N2O","v":0},0]
[null,"Biodiesel (B5)",{"$f":"SUMIFS('Mobile-Data'!$I$9:$I$1048576,'Mobile-Data'!$C$9:$C$1048576,$C$162,'Mobile-Data'!$E$9:$E$1048576,C$215,'Mobile-Data'!$G$9:$G$1048576,$B220)","v":0},{"$f":"SUMIFS('Mobile-Data'!$I$9:$I$1048576,'Mobile-Data'!$C$9:$C$1048576,$C$162,'Mobile-Data'!$E$9:$E$1048576,D$215,'Mobile-Data'!$G$9:$G$1048576,$B220)","v":0},{"$f":"SUMIFS('Mobile-Data'!$I$9:$I$1048576,'Mobile-Data'!$C$9:$C$1048576,$C$162,'Mobile-Data'!$E$9:$E$1048576,E$215,'Mobile-Data'!$G$9:$G$1048576,$B220)","v":0},0,null,null,null,null,"Biodiesel (B5)",{"$f":"C220*Factors!C261*g_kg*kg_mt*GWP_CH4","v":0},{"$f":"D220*Factors!D261*g_kg*kg_mt*GWP_CH4","v":0},{"$f":"E220*Factors!E261*g_kg*kg_mt*GWP_CH4","v":0},0,null,null,null,null,"Biodiesel (B5)",{"$f":"C220*Factors!H261*g_kg*kg_mt*GWP_N2O","v":0},{"$f":"D220*Factors!I261*g_kg*kg_mt*GWP_N2O","v":0},{"$f":"E220*Factors!J261*g_kg*kg_mt*GWP_N2O","v":0},0]
[null,"Biodiesel (B20)",{"$f":"SUMIFS('Mobile-Data'!$I$9:$I$1048576,'Mobile-Data'!$C$9:$C$1048576,$C$162,'Mobile-Data'!$E$9:$E$1048576,C$215,'Mobile-Data'!$G$9:$G$1048576,$B221)","v":0},{"$f":"SUMIFS('Mobile-Data'!$I$9:$I$1048576,'Mobile-Data'!$C$9:$C$1048576,$C$162,'Mobile-Data'!$E$9:$E$1048576,D$215,'Mobile-Data'!$G$9:$G$1048576,$B221)","v":0},{"$f":"SUMIFS('Mobile-Data'!$I$9:$I$1048576,'Mobile-Data'!$C$9:$C$1048576,$C$162,'Mobile-Data'!$E$9:$E$1048576,E$215,'Mobile-Data'!$G$9:$G$1048576,$B221)","v":0},0,null,null,null,null,"Biodiesel (B20)",{"$f":"C221*Factors!C262*g_kg*kg_mt*GWP_CH4","v":0},{"$f":"D221*Factors!D262*g_kg*kg_mt*GWP_CH4","v":0},{"$f":"E221*Factors!E262*g_kg*kg_mt*GWP_CH4","v":0},0,null,null,null,null,"Biodiesel (B20)",{"$f":"C221*Factors!H262*g_kg*kg_mt*GWP_N2O","v":0},{"$f":"D221*Factors!I262*g_kg*kg_mt*GWP_N2O","v":0},{"$f":"E221*Factors!J262*g_kg*kg_mt*GWP_N2O","v":0},0]
[null,"Total",{"$f":"SUM(C216:C221)","v":0},{"$f":"SUM(D216:D221)","v":0},{"$f":"SUM(E216:E221)","v":0},0,null,null,null,null,"Total",{"$f":"SUM(L216:L221)","v":0},{"$f":"SUM(M216:M221)","v":0},{"$f":"SUM(N216:N221)","v":0},0,null,null,null,null,"Total",{"$f":"SUM(U216:U221)","v":0},{"$f":"SUM(V216:V221)","v":0},{"$f":"SUM(W216:W221)","v":0},0]
[]
[]
["3) Motorcycles and Non-Highway"]
[null,"Activity Summary by Vehicle and Fuel Type",null,null,null,null,null,null,null,null,"CH4 Emissions by Vehicle and Fuel Type",null,null,null,null,null,null,null,null,"N2O Emissions by Vehicle and Fuel Type"]
[null,"Vehicle activity data by vehicle type and fuel type for selected sector. Units depend on vehicle type (gallons or miles).",null,null,null,null,null,null,null,null,"CH4 Emissions = Activity × EF (g/unit) × MT/g × GWP CH4",null,null,null,null,null,null,null,null,"N2O Emissions = Activity × EF (g/unit) × MT/g × GWP N2O"]
[null,"Vehicle Types","Unit","Gasoline","Diesel","Residual Fuel","Jet Fuel","Aviation Gasoline","TOTAL",null,"Vehicle Types","Gasoline","Diesel","Residual Fuel","Jet Fuel","Aviation Gasoline","TOTAL",null,null,"Vehicle Types","Gasoline","Diesel","Residual Fuel","Jet Fuel","Aviation Gasoline","TOTAL"]
[null,"Motorcycles (1996 +)","Miles",{"$f":"SUMIFS('Mobile-Data'!$I$9:$I$1048576,'Mobile-Data'!$E$9:$E$1048576,\"Motorcycle\",'Mobile-Data'!$C$9:$C$1048576,'Mobile-Detail Calcs'!$C$162,'Mobile-Data'!$D$9:$D$1048576,\">=1996\")","v":0},null,null,null,null,{"$f":"SUM(D229:H229)","v":0},null,"Motorcycles (1996 +)",{"$f":"D229*Factors!B268*g_kg*kg_mt*GWP_CH4","v":0},null,null,null,null,{"$f":"SUM(L229:P229)","v":0},null,null,"Motorcycles (1996 +)",{"$f":"D229*Factors!G268*g_kg*kg_mt*GWP_N2O","v":0},null,null,null,null,{"$f":"SUM(U229:Y229)","v":0}]
[null,"Motorcycles (- 1995)","Miles",{"$f":"SUMIFS('Mobile-Data'!$I$9:$I$1048576,'Mobile-Data'!$E$9:$E$1048576,\"Motorcycle\",'Mobile-Data'!$C$9:$C$1048576,'Mobile-Detail Calcs'!$C$162,'Mobile-Data'!$D$9:$D$1048576,\"<1996\")","v":0},null,null,null,null,{"$f":"SUM(D230:H230)","v":0},null,"Motorcycles (- 1995)",{"$f":"D230*Factors!B269*g_kg*kg_mt*GWP_CH4","v":0},null,null,null,null,{"$f":"SUM(L230:P230)","v":0},null,null,"Motorcycles (- 1995)",{"$f":"D230*Factors!G269*g_kg*kg_mt*GWP_N2O","v":0},null,null,null,null,{"$f":"SUM(U230:Y230)","v":0}]
[null,"Agricultural Equipment","Gallons",{"$f":"SUMIFS('Mobile-Data'!$H$9:$H$1048576,'Mobile-Data'!$C$9:$C$1048576,$C$162,'Mobile-Data'!$E$9:$E$1048576,$B231,'Mobile-Data'!$G$9:$G$1048576,D$228)","v":0},{"$f":"SUMIFS('Mobile-Data'!$H$9:$H$1048576,'Mobile-Data'!$C$9:$C$1048576,$C$162,'Mobile-Data'!$E$9:$E$1048576,$B231,'Mobile-Data'!$G$9:$G$1048576,E$228)","v":0},null,null,null,0,null,"Agricultural Equipment",{"$f":"D231*Factors!B270*g_kg*kg_mt*GWP_CH4","v":0},{"$f":"E231*Factors!C270*g_kg*kg_mt*GWP_CH4","v":0},null,null,null,0,null,null,"Agricultural Equipment",{"$f":"D231*Factors!G270*g_kg*kg_mt*GWP_N2O","v":0},{"$f":"E231*Factors!H270*g_kg*kg_mt*GWP_N2O","v":0},null,null,null,0]
[null,"Construction Equipment","Gallons",{"$f":"SUMIFS('Mobile-Data'!$H$9:$H$1048576,'Mobile-Data'!$C$9:$C$1048576,$C$162,'Mobile-Data'!$E$9:$E$1048576,$B232,'Mobile-Data'!$G$9:$G$1048576,D$228)","v":0},{"$f":"SUMIFS('Mobile-Data'!$H$9:$H$1048576,'Mobile-Data'!$C$9:$C$1048576,$C$162,'Mobile-Data'!$E$9:$E$1048576,$B232,'Mobile-Data'!$G$9:$G$1048576,E$228)","v":0},null,null,null,0,null,"Construction Equipment",{"$f":"D232*Factors!B271*g_kg*kg_mt*GWP_CH4","v":0},{"$f":"E232*Factors!C271*g_kg*kg_mt*GWP_CH4","v":0},null,null,null,0,null,null,"Construction Equipment",{"$f":"D232*Factors!G271*g_kg*kg_mt*GWP_N2O","v":0},{"$f":"E232*Factors!H271*g_kg*kg_mt*GWP_N2O","v":0},null,null,null,0]
[null,"Utility and Recreational Equipment","Gallons",{"$f":"SUMIFS('Mobile-Data'!$H$9:$H$1048576,'Mobile-Data'!$C$9:$C$1048576,$C$162,'Mobile-Data'!$E$9:$E$1048576,$B233,'Mobile-Data'!$G$9:$G$1048576,D$228)","v":0},{"$f":"SUMIFS('Mobile-Data'!$H$9:$H$1048576,'Mobile-Data'!$C$9:$C$1048576,$C$162,'Mobile-Data'!$E$9:$E$1048576,$B233,'Mobile-Data'!$G$9:$G$1048576,E$228)","v":0},null,null,null,0,null,"Utility and Recreational Equipment",{"$f":"D233*Factors!B272*g_kg*kg_mt*GWP_CH4","v":0},{"$f":"E233*Factors!C272*g_kg*kg_mt*GWP_CH4","v":0},null,null,null,0,null,null,"Utility and Recreational Equipment",{"$f":"D233*Factors!G272*g_kg*kg_mt*GWP_N2O","v":0},{"$f":"E233*Factors!H272*g_kg*kg_mt*GWP_N2O","v":0},null,null,null,0]
[null,"Aircraft","Gallons",null,null,null,{"$f":"SUMIFS('Mobile-Data'!$H$9:$H$1048576,'Mobile-Data'!$C$9:$C$1048576,$C$162,'Mobile-Data'!$E$9:$E$1048576,$B234,'Mobile-Data'!$G$9:$G$1048576,G$228)","v":0},{"$f":"SUMIFS('Mobile-Data'!$H$9:$H$1048576,'Mobile-Data'!$C$9:$C$1048576,$C$162,'Mobile-Data'!$E$9:$E$1048576,$B234,'Mobile-Data'!$G$9:$G$1048576,H$228)","v":0},0,null,"Aircraft",null,null,null,{"$f":"G234*Factors!E273*g_kg*kg_mt*GWP_CH4","v":0},{"$f":"H234*Factors!F273*g_kg*kg_mt*GWP_CH4","v":0},0,null,null,"Aircraft",null,null,null,{"$f":"G234*Factors!J273*g_kg*kg_mt*GWP_N2O","v":0},{"$f":"H234*Factors!K273*g_kg*kg_mt*GWP_N2O","v":0},0]
[null,"Ship or Boat","Gallons",{"$f":"SUMIFS('Mobile-Data'!$H$9:$H$1048576,'Mobile-Data'!$C$9:$C$1048576,$C$162,'Mobile-Data'!$E$9:$E$1048576,$B235,'Mobile-Data'!$G$9:$G$1048576,D$228)","v":0},{"$f":"SUMIFS('Mobile-Data'!$H$9:$H$1048576,'Mobile-Data'!$C$9:$C$1048576,$C$162,'Mobile-Data'!$E$9:$E$1048576,$B235,'Mobile-Data'!$G$9:$G$1048576,E$228)","v":0},{"$f":"SUMIFS('Mobile-Data'!$H$9:$H$1048576,'Mobile-Data'!$C$9:$C$1048576,$C$162,'Mobile-Data'!$E$9:$E$1048576,$B235,'Mobile-Data'!$G$9:$G$1048576,F$228)","v":0},null,null,0,null,"Ship or Boat",{"$f":"D235*Factors!B274*g_kg*kg_mt*GWP_CH4","v":0},{"$f":"E235*Factors!C274*g_kg*kg_mt*GWP_CH4","v":0},{"$f":"F235*Factors!D274*g_kg*kg_mt*GWP_CH4","v":0},null,null,0,null,null,"Ship or Boat",{"$f":"D235*Factors!G274*g_kg*kg_mt*GWP_N2O","v":0},{"$f":"E235*Factors!H274*g_kg*kg_mt*GWP_N2O","v":0},{"$f":"F235*Factors!I274*g_kg*kg_mt*GWP_N2O","v":0},null,null,0]
[null,"Locomotive","Gallons",null,{"$f":"SUMIFS('Mobile-Data'!$H$9:$H$1048576,'Mobile-Data'!$C$9:$C$1048576,$C$162,'Mobile-Data'!$E$9:$E$1048576,$B236,'Mobile-Data'!$G$9:$G$1048576,E$228)","v":0},null,null,null,0,null,"Locomotive",null,{"$f":"E236*Factors!C275*g_kg*kg_mt*GWP_CH4","v":0},null,null,null,0,null,null,"Locomotive",null,{"$f":"E236*Factors!H275*g_kg*kg_mt*GWP_N2O","v":0},null,null,null,0]
[null,null,null,null,null,null,null,null,null,null,"Total",{"$f":"SUM(L229:L233)","v":0},{"$f":"SUM(M229:M233)","v":0},{"$f":"SUM(N229:N233)","v":0},{"$f":"SUM(O229:O233)","v":0},{"$f":"SUM(P229:P233)","v":0},0,null,null,"Total",{"$f":"SUM(U229:U233)","v":0},{"$f":"SUM(V229:V233)","v":0},{"$f":"SUM(W229:W233)","v":0},{"$f":"SUM(X229:X233)","v":0},{"$f":"SUM(Y229:Y233)","v":0},0]
[]
["Totals"]
[null,"Non-CO2 Emissions, Current Sector"]
[null,"Current sector:",{"$f":"mob_nonCO2_current_dept","v":"Energy Generation"}]
[]
[null,null,"CH4","N2O","TOTAL"]
[null,"Highway Vehicles",{"$f":"SUM(L210:Q210)","v":0},{"$f":"SUM(U210:Z210)","v":0},{"$f":"SUM(C244:D244)","v":0}]
[null,"AFVs",{"$f":"SUM(L222:N222)","v":0},{"$f":"SUM(U222:W222)","v":0},{"$f":"SUM(C245:D245)","v":0}]
[null,"Non-highway/Motorcycles",{"$f":"SUM(L237:P237)","v":0},{"$f":"SUM(U237:Y237)","v":0},{"$f":"SUM(C246:D246)","v":0}]
[null,"Total",{"$f":"SUM(C244:C246)","v":0},{"$f":"SUM(D244:D246)","v":0},{"$f":"SUM(C247:D247)","v":0}]
[]
["Non-CO2 Emissions, All Sectors"]
[null,null,"CH4","N2O","TOTAL"]
["Dstart",{"$f":"B129","v":"Residential"},0,0,{"$f":"SUM(C251:D251)","v":0}]
[null,{"$f":"B130","v":"Commercial/Institutional"},1154.5636270620482,3323.2435692733948,{"$f":"SUM(C252:D252)","v":4477.8071963354432}]
[null,"Industrial",0,0,0]
[null,"Energy Generation",0,0,0]
[null,0,0,0,0]
[null,0,0,0,0]
[null,0,0,0,0]
[null,0,0,0,0]
[null,0,0,0,0]
[null,0,0,0,0]
[null,0,0,0,0]
[null,0,0,0,0]
[null,0,0,0,0]
[null,0,0,0,0]
[null,0,0,0,0]
[null,0,0,0,0]
[null,0,0,0,0]
[null,0,0,0,0]
[null,0,0,0,0]
[null,0,0,0,0]
[null,"Total",{"$f":"SUM(C251:C270)","v":1154.5636270620482},{"$f":"SUM(D251:D270)","v":3323.2435692733948},4477.8071963354432]
[]
[]
[]
["Local GHG Inventory Tool: Community Module"]

{"sheet":"Mobile-Summary","index":15,"n_rows":81,"n_cols":19,"rows_kept":81,"cut":false,"hidden":false,"merged":[[4,1,4,5],[4,8,4,10],[31,1,31,13],[80,0,80,15]]}
["Mobile Combustion - Summary"]
[]
["GHG Summary"]
[]
[null,"Net Emissions by Sector (CO2e)",null,null,null,null,null,null,"CO2 Detail Emissions"]
[null,null,"CO2","CH4","N2O","TOTAL",null,null,"Gross CO2","- Biogenic =","Net CO2"]
["Dstart",{"$f":"B34","v":"Residential"},{"$f":"'Mobile-Detail Calcs'!N129","v":0},{"$f":"'Mobile-Detail Calcs'!C251","v":0},{"$f":"'Mobile-Detail Calcs'!D251","v":0},{"$f":"SUM(C7:E7)","v":0},null,null,{"$f":"'Mobile-Detail Calcs'!N77","v":0},{"$f":"'Mobile-Detail Calcs'!N103","v":0},{"$f":"'Mobile-Detail Calcs'!N129","v":0}]
[null,"Commercial/Institutional",{"$f":"'Mobile-Detail Calcs'!N130","v":173433.05038999999},{"$f":"'Mobile-Detail Calcs'!C252","v":1154.5636270620482},{"$f":"'Mobile-Detail Calcs'!D252","v":3323.2435692733948},{"$f":"SUM(C8:E8)","v":177910.85758633542},null,null,{"$f":"'Mobile-Detail Calcs'!N78","v":173433.05038999999},{"$f":"'Mobile-Detail Calcs'!N104","v":0},{"$f":"'Mobile-Detail Calcs'!N130","v":173433.05038999999}]
[null,"Industrial",{"$f":"'Mobile-Detail Calcs'!N131","v":0},{"$f":"'Mobile-Detail Calcs'!C253","v":0},{"$f":"'Mobile-Detail Calcs'!D253","v":0},0,null,null,{"$f":"'Mobile-Detail Calcs'!N79","v":0},{"$f":"'Mobile-Detail Calcs'!N105","v":0},{"$f":"'Mobile-Detail Calcs'!N131","v":0}]
[null,"Energy Generation",{"$f":"'Mobile-Detail Calcs'!N132","v":0},{"$f":"'Mobile-Detail Calcs'!C254","v":0},{"$f":"'Mobile-Detail Calcs'!D254","v":0},0,null,null,{"$f":"'Mobile-Detail Calcs'!N80","v":0},{"$f":"'Mobile-Detail Calcs'!N106","v":0},{"$f":"'Mobile-Detail Calcs'!N132","v":0}]
[null,0,{"$f":"'Mobile-Detail Calcs'!N133","v":0},{"$f":"'Mobile-Detail Calcs'!C255","v":0},{"$f":"'Mobile-Detail Calcs'!D255","v":0},0,null,null,{"$f":"'Mobile-Detail Calcs'!N81","v":0},{"$f":"'Mobile-Detail Calcs'!N107","v":0},{"$f":"'Mobile-Detail Calcs'!N133","v":0}]
[null,0,{"$f":"'Mobile-Detail Calcs'!N134","v":0},{"$f":"'Mobile-Detail Calcs'!C256","v":0},{"$f":"'Mobile-Detail Calcs'!D256","v":0},0,null,null,{"$f":"'Mobile-Detail Calcs'!N82","v":0},{"$f":"'Mobile-Detail Calcs'!N108","v":0},{"$f":"'Mobile-Detail Calcs'!N134","v":0}]
[null,0,{"$f":"'Mobile-Detail Calcs'!N135","v":0},{"$f":"'Mobile-Detail Calcs'!C257","v":0},{"$f":"'Mobile-Detail Calcs'!D257","v":0},0,null,null,{"$f":"'Mobile-Detail Calcs'!N83","v":0},{"$f":"'Mobile-Detail Calcs'!N109","v":0},{"$f":"'Mobile-Detail Calcs'!N135","v":0}]
[null,0,{"$f":"'Mobile-Detail Calcs'!N136","v":0},{"$f":"'Mobile-Detail Calcs'!C258","v":0},{"$f":"'Mobile-Detail Calcs'!D258","v":0},0,null,null,{"$f":"'Mobile-Detail Calcs'!N84","v":0},{"$f":"'Mobile-Detail Calcs'!N110","v":0},{"$f":"'Mobile-Detail Calcs'!N136","v":0}]
[null,0,{"$f":"'Mobile-Detail Calcs'!N137","v":0},{"$f":"'Mobile-Detail Calcs'!C259","v":0},{"$f":"'Mobile-Detail Calcs'!D259","v":0},0,null,null,{"$f":"'Mobile-Detail Calcs'!N85","v":0},{"$f":"'Mobile-Detail Calcs'!N111","v":0},{"$f":"'Mobile-Detail Calcs'!N137","v":0}]
[null,0,{"$f":"'Mobile-Detail Calcs'!N138","v":0},{"$f":"'Mobile-Detail Calcs'!C260","v":0},{"$f":"'Mobile-Detail Calcs'!D260","v":0},0,null,null,{"$f":"'Mobile-Detail Calcs'!N86","v":0},{"$f":"'Mobile-Detail Calcs'!N112","v":0},{"$f":"'Mobile-Detail Calcs'!N138","v":0}]
[null,0,{"$f":"'Mobile-Detail Calcs'!N139","v":0},{"$f":"'Mobile-Detail Calcs'!C261","v":0},{"$f":"'Mobile-Detail Calcs'!D261","v":0},0,null,null,{"$f":"'Mobile-Detail Calcs'!N87","v":0},{"$f":"'Mobile-Detail Calcs'!N113","v":0},{"$f":"'Mobile-Detail Calcs'!N139","v":0}]
[null,0,{"$f":"'Mobile-Detail Calcs'!N140","v":0},{"$f":"'Mobile-Detail Calcs'!C262","v":0},{"$f":"'Mobile-Detail Calcs'!D262","v":0},0,null,null,{"$f":"'Mobile-Detail Calcs'!N88","v":0},{"$f":"'Mobile-Detail Calcs'!N114","v":0},{"$f":"'Mobile-Detail Calcs'!N140","v":0}]
[null,0,{"$f":"'Mobile-Detail Calcs'!N141","v":0},{"$f":"'Mobile-Detail Calcs'!C263","v":0},{"$f":"'Mobile-Detail Calcs'!D263","v":0},0,null,null,{"$f":"'Mobile-Detail Calcs'!N89","v":0},{"$f":"'Mobile-Detail Calcs'!N115","v":0},{"$f":"'Mobile-Detail Calcs'!N141","v":0}]
[null,0,{"$f":"'Mobile-Detail Calcs'!N142","v":0},{"$f":"'Mobile-Detail Calcs'!C264","v":0},{"$f":"'Mobile-Detail Calcs'!D264","v":0},0,null,null,{"$f":"'Mobile-Detail Calcs'!N90","v":0},{"$f":"'Mobile-Detail Calcs'!N116","v":0},{"$f":"'Mobile-Detail Calcs'!N142","v":0}]
[null,0,{"$f":"'Mobile-Detail Calcs'!N143","v":0},{"$f":"'Mobile-Detail Calcs'!C265","v":0},{"$f":"'Mobile-Detail Calcs'!D265","v":0},0,null,null,{"$f":"'Mobile-Detail Calcs'!N91","v":0},{"$f":"'Mobile-Detail Calcs'!N117","v":0},{"$f":"'Mobile-Detail Calcs'!N143","v":0}]
[null,0,{"$f":"'Mobile-Detail Calcs'!N144","v":0},{"$f":"'Mobile-Detail Calcs'!C266","v":0},{"$f":"'Mobile-Detail Calcs'!D266","v":0},0,null,null,{"$f":"'Mobile-Detail Calcs'!N92","v":0},{"$f":"'Mobile-Detail Calcs'!N118","v":0},{"$f":"'Mobile-Detail Calcs'!N144","v":0}]
[null,0,{"$f":"'Mobile-Detail Calcs'!N145","v":0},{"$f":"'Mobile-Detail Calcs'!C267","v":0},{"$f":"'Mobile-Detail Calcs'!D267","v":0},0,null,null,{"$f":"'Mobile-Detail Calcs'!N93","v":0},{"$f":"'Mobile-Detail Calcs'!N119","v":0},{"$f":"'Mobile-Detail Calcs'!N145","v":0}]
[null,0,{"$f":"'Mobile-Detail Calcs'!N146","v":0},{"$f":"'Mobile-Detail Calcs'!C268","v":0},{"$f":"'Mobile-Detail Calcs'!D268","v":0},0,null,null,{"$f":"'Mobile-Detail Calcs'!N94","v":0},{"$f":"'Mobile-Detail Calcs'!N120","v":0},{"$f":"'Mobile-Detail Calcs'!N146","v":0}]
[null,0,{"$f":"'Mobile-Detail Calcs'!N147","v":0},{"$f":"'Mobile-Detail Calcs'!C269","v":0},{"$f":"'Mobile-Detail Calcs'!D269","v":0},0,null,null,{"$f":"'Mobile-Detail Calcs'!N95","v":0},{"$f":"'Mobile-Detail Calcs'!N121","v":0},{"$f":"'Mobile-Detail Calcs'!N147","v":0}]
[null,0,{"$f":"'Mobile-Detail Calcs'!N148","v":0},{"$f":"'Mobile-Detail Calcs'!C270","v":0},{"$f":"'Mobile-Detail Calcs'!D270","v":0},0,null,null,{"$f":"'Mobile-Detail Calcs'!N96","v":0},{"$f":"'Mobile-Detail Calcs'!N122","v":0},{"$f":"'Mobile-Detail Calcs'!N148","v":0}]
[null,"Total Mobile Emissions",{"$f":"SUM(C7:C26)","v":173433.05038999999},{"$f":"SUM(D7:D26)","v":1154.5636270620482},{"$f":"SUM(E7:E26)","v":3323.2435692733948},{"$f":"SUM(C27:E27)","v":177910.85758633542},null,null,{"$f":"SUM(I7:I26)","v":173433.05038999999},{"$f":"SUM(J7:J26)","v":0},{"$f":"SUM(K7:K26)","v":173433.05038999999}]
[]
[]
["Energy Use Summary"]
[]
[null,"Energy Use by Sector and Fuel Type (MMBtu)"]
[null,null,"Gasoline","Diesel","Biodiesel (B5)","Biodiesel (B20)","Ethanol (E85)","CNG","LNG","LPG","Residual Fuel","Jet Fuel","Aviation Gasoline","TOTAL"]
["Dstart",{"$f":"'Background Controls'!I5","v":"Residential"},{"$f":"'Mobile-Detail Calcs'!C48","v":0},{"$f":"'Mobile-Detail Calcs'!D48","v":0},{"$f":"'Mobile-Detail Calcs'!E48","v":0},{"$f":"'Mobile-Detail Calcs'!F48","v":0},{"$f":"'Mobile-Detail Calcs'!G48","v":0},{"$f":"'Mobile-Detail Calcs'!H48","v":0},{"$f":"'Mobile-Detail Calcs'!I48","v":0},{"$f":"'Mobile-Detail Calcs'!J48","v":0},{"$f":"'Mobile-Detail Calcs'!K48","v":0},{"$f":"'Mobile-Detail Calcs'!L48","v":0},{"$f":"'Mobile-Detail Calcs'!M48","v":0},{"$f":"SUM(C34:M34)","v":0}]
[null,{"$f":"'Background Controls'!I6","v":"Commercial/Institutional"},{"$f":"'Mobile-Detail Calcs'!C49","v":1447739.875},{"$f":"'Mobile-Detail Calcs'!D49","v":970369.96666666667},{"$f":"'Mobile-Detail Calcs'!E49","v":0},{"$f":"'Mobile-Detail Calcs'!F49","v":0},{"$f":"'Mobile-Detail Calcs'!G49","v":0},{"$f":"'Mobile-Detail Calcs'!H49","v":0},{"$f":"'Mobile-Detail Calcs'!I49","v":0},{"$f":"'Mobile-Detail Calcs'!J49","v":0},{"$f":"'Mobile-Detail Calcs'!K49","v":0},{"$f":"'Mobile-Detail Calcs'!L49","v":0},{"$f":"'Mobile-Detail Calcs'!M49","v":0},{"$f":"SUM(C35:M35)","v":2418109.8416666668}]
[null,{"$f":"'Background Controls'!I7","v":"Industrial"},{"$f":"'Mobile-Detail Calcs'!C50","v":0},{"$f":"'Mobile-Detail Calcs'!D50","v":0},{"$f":"'Mobile-Detail Calcs'!E50","v":0},{"$f":"'Mobile-Detail Calcs'!F50","v":0},{"$f":"'Mobile-Detail Calcs'!G50","v":0},{"$f":"'Mobile-Detail Calcs'!H50","v":0},{"$f":"'Mobile-Detail Calcs'!I50","v":0},{"$f":"'Mobile-Detail Calcs'!J50","v":0},{"$f":"'Mobile-Detail Calcs'!K50","v":0},{"$f":"'Mobile-Detail Calcs'!L50","v":0},{"$f":"'Mobile-Detail Calcs'!M50","v":0},0]
[null,{"$f":"'Background Controls'!I8","v":"Energy Generation"},{"$f":"'Mobile-Detail Calcs'!C51","v":0},{"$f":"'Mobile-Detail Calcs'!D51","v":0},{"$f":"'Mobile-Detail Calcs'!E51","v":0},{"$f":"'Mobile-Detail Calcs'!F51","v":0},{"$f":"'Mobile-Detail Calcs'!G51","v":0},{"$f":"'Mobile-Detail Calcs'!H51","v":0},{"$f":"'Mobile-Detail Calcs'!I51","v":0},{"$f":"'Mobile-Detail Calcs'!J51","v":0},{"$f":"'Mobile-Detail Calcs'!K51","v":0},{"$f":"'Mobile-Detail Calcs'!L51","v":0},{"$f":"'Mobile-Detail Calcs'!M51","v":0},0]
[null,{"$f":"'Background Controls'!I9","v":0},{"$f":"'Mobile-Detail Calcs'!C52","v":0},{"$f":"'Mobile-Detail Calcs'!D52","v":0},{"$f":"'Mobile-Detail Calcs'!E52","v":0},{"$f":"'Mobile-Detail Calcs'!F52","v":0},{"$f":"'Mobile-Detail Calcs'!G52","v":0},{"$f":"'Mobile-Detail Calcs'!H52","v":0},{"$f":"'Mobile-Detail Calcs'!I52","v":0},{"$f":"'Mobile-Detail Calcs'!J52","v":0},{"$f":"'Mobile-Detail Calcs'!K52","v":0},{"$f":"'Mobile-Detail Calcs'!L52","v":0},{"$f":"'Mobile-Detail Calcs'!M52","v":0},0]
[null,{"$f":"'Background Controls'!I10","v":0},{"$f":"'Mobile-Detail Calcs'!C53","v":0},{"$f":"'Mobile-Detail Calcs'!D53","v":0},{"$f":"'Mobile-Detail Calcs'!E53","v":0},{"$f":"'Mobile-Detail Calcs'!F53","v":0},{"$f":"'Mobile-Detail Calcs'!G53","v":0},{"$f":"'Mobile-Detail Calcs'!H53","v":0},{"$f":"'Mobile-Detail Calcs'!I53","v":0},{"$f":"'Mobile-Detail Calcs'!J53","v":0},{"$f":"'Mobile-Detail Calcs'!K53","v":0},{"$f":"'Mobile-Detail Calcs'!L53","v":0},{"$f":"'Mobile-Detail Calcs'!M53","v":0},0]
[null,{"$f":"'Background Controls'!I11","v":0},{"$f":"'Mobile-Detail Calcs'!C54","v":0},{"$f":"'Mobile-Detail Calcs'!D54","v":0},{"$f":"'Mobile-Detail Calcs'!E54","v":0},{"$f":"'Mobile-Detail Calcs'!F54","v":0},{"$f":"'Mobile-Detail Calcs'!G54","v":0},{"$f":"'Mobile-Detail Calcs'!H54","v":0},{"$f":"'Mobile-Detail Calcs'!I54","v":0},{"$f":"'Mobile-Detail Calcs'!J54","v":0},{"$f":"'Mobile-Detail Calcs'!K54","v":0},{"$f":"'Mobile-Detail Calcs'!L54","v":0},{"$f":"'Mobile-Detail Calcs'!M54","v":0},0]
[null,{"$f":"'Background Controls'!I12","v":0},{"$f":"'Mobile-Detail Calcs'!C55","v":0},{"$f":"'Mobile-Detail Calcs'!D55","v":0},{"$f":"'Mobile-Detail Calcs'!E55","v":0},{"$f":"'Mobile-Detail Calcs'!F55","v":0},{"$f":"'Mobile-Detail Calcs'!G55","v":0},{"$f":"'Mobile-Detail Calcs'!H55","v":0},{"$f":"'Mobile-Detail Calcs'!I55","v":0},{"$f":"'Mobile-Detail Calcs'!J55","v":0},{"$f":"'Mobile-Detail Calcs'!K55","v":0},{"$f":"'Mobile-Detail Calcs'!L55","v":0},{"$f":"'Mobile-Detail Calcs'!M55","v":0},0]
[null,{"$f":"'Background Controls'!I13","v":0},{"$f":"'Mobile-Detail Calcs'!C56","v":0},{"$f":"'Mobile-Detail Calcs'!D56","v":0},{"$f":"'Mobile-Detail Calcs'!E56","v":0},{"$f":"'Mobile-Detail Calcs'!F56","v":0},{"$f":"'Mobile-Detail Calcs'!G56","v":0},{"$f":"'Mobile-Detail Calcs'!H56","v":0},{"$f":"'Mobile-Detail Calcs'!I56","v":0},{"$f":"'Mobile-Detail Calcs'!J56","v":0},{"$f":"'Mobile-Detail Calcs'!K56","v":0},{"$f":"'Mobile-Detail Calcs'!L56","v":0},{"$f":"'Mobile-Detail Calcs'!M56","v":0},0]
[null,{"$f":"'Background Controls'!I14","v":0},{"$f":"'Mobile-Detail Calcs'!C57","v":0},{"$f":"'Mobile-Detail Calcs'!D57","v":0},{"$f":"'Mobile-Detail Calcs'!E57","v":0},{"$f":"'Mobile-Detail Calcs'!F57","v":0},{"$f":"'Mobile-Detail Calcs'!G57","v":0},{"$f":"'Mobile-Detail Calcs'!H57","v":0},{"$f":"'Mobile-Detail Calcs'!I57","v":0},{"$f":"'Mobile-Detail Calcs'!J57","v":0},{"$f":"'Mobile-Detail Calcs'!K57","v":0},{"$f":"'Mobile-Detail Calcs'!L57","v":0},{"$f":"'Mobile-Detail Calcs'!M57","v":0},0]
[null,{"$f":"'Background Controls'!I15","v":0},{"$f":"'Mobile-Detail Calcs'!C58","v":0},{"$f":"'Mobile-Detail Calcs'!D58","v":0},{"$f":"'Mobile-Detail Calcs'!E58","v":0},{"$f":"'Mobile-Detail Calcs'!F58","v":0},{"$f":"'Mobile-Detail Calcs'!G58","v":0},{"$f":"'Mobile-Detail Calcs'!H58","v":0},{"$f":"'Mobile-Detail Calcs'!I58","v":0},{"$f":"'Mobile-Detail Calcs'!J58","v":0},{"$f":"'Mobile-Detail Calcs'!K58","v":0},{"$f":"'Mobile-Detail Calcs'!L58","v":0},{"$f":"'Mobile-Detail Calcs'!M58","v":0},0]
[null,{"$f":"'Background Controls'!I16","v":0},{"$f":"'Mobile-Detail Calcs'!C59","v":0},{"$f":"'Mobile-Detail Calcs'!D59","v":0},{"$f":"'Mobile-Detail Calcs'!E59","v":0},{"$f":"'Mobile-Detail Calcs'!F59","v":0},{"$f":"'Mobile-Detail Calcs'!G59","v":0},{"$f":"'Mobile-Detail Calcs'!H59","v":0},{"$f":"'Mobile-Detail Calcs'!I59","v":0},{"$f":"'Mobile-Detail Calcs'!J59","v":0},{"$f":"'Mobile-Detail Calcs'!K59","v":0},{"$f":"'Mobile-Detail Calcs'!L59","v":0},{"$f":"'Mobile-Detail Calcs'!M59","v":0},0]
[null,{"$f":"'Background Controls'!I17","v":0},{"$f":"'Mobile-Detail Calcs'!C60","v":0},{"$f":"'Mobile-Detail Calcs'!D60","v":0},{"$f":"'Mobile-Detail Calcs'!E60","v":0},{"$f":"'Mobile-Detail Calcs'!F60","v":0},{"$f":"'Mobile-Detail Calcs'!G60","v":0},{"$f":"'Mobile-Detail Calcs'!H60","v":0},{"$f":"'Mobile-Detail Calcs'!I60","v":0},{"$f":"'Mobile-Detail Calcs'!J60","v":0},{"$f":"'Mobile-Detail Calcs'!K60","v":0},{"$f":"'Mobile-Detail Calcs'!L60","v":0},{"$f":"'Mobile-Detail Calcs'!M60","v":0},0]
[null,{"$f":"'Background Controls'!I18","v":0},{"$f":"'Mobile-Detail Calcs'!C61","v":0},{"$f":"'Mobile-Detail Calcs'!D61","v":0},{"$f":"'Mobile-Detail Calcs'!E61","v":0},{"$f":"'Mobile-Detail Calcs'!F61","v":0},{"$f":"'Mobile-Detail Calcs'!G61","v":0},{"$f":"'Mobile-Detail Calcs'!H61","v":0},{"$f":"'Mobile-Detail Calcs'!I61","v":0},{"$f":"'Mobile-Detail Calcs'!J61","v":0},{"$f":"'Mobile-Detail Calcs'!K61","v":0},{"$f":"'Mobile-Detail Calcs'!L61","v":0},{"$f":"'Mobile-Detail Calcs'!M61","v":0},0]
[null,{"$f":"'Background Controls'!I19","v":0},{"$f":"'Mobile-Detail Calcs'!C62","v":0},{"$f":"'Mobile-Detail Calcs'!D62","v":0},{"$f":"'Mobile-Detail Calcs'!E62","v":0},{"$f":"'Mobile-Detail Calcs'!F62","v":0},{"$f":"'Mobile-Detail Calcs'!G62","v":0},{"$f":"'Mobile-Detail Calcs'!H62","v":0},{"$f":"'Mobile-Detail Calcs'!I62","v":0},{"$f":"'Mobile-Detail Calcs'!J62","v":0},{"$f":"'Mobile-Detail Calcs'!K62","v":0},{"$f":"'Mobile-Detail Calcs'!L62","v":0},{"$f":"'Mobile-Detail Calcs'!M62","v":0},0]
[null,{"$f":"'Background Controls'!I20","v":0},{"$f":"'Mobile-Detail Calcs'!C63","v":0},{"$f":"'Mobile-Detail Calcs'!D63","v":0},{"$f":"'Mobile-Detail Calcs'!E63","v":0},{"$f":"'Mobile-Detail Calcs'!F63","v":0},{"$f":"'Mobile-Detail Calcs'!G63","v":0},{"$f":"'Mobile-Detail Calcs'!H63","v":0},{"$f":"'Mobile-Detail Calcs'!I63","v":0},{"$f":"'Mobile-Detail Calcs'!J63","v":0},{"$f":"'Mobile-Detail Calcs'!K63","v":0},{"$f":"'Mobile-Detail Calcs'!L63","v":0},{"$f":"'Mobile-Detail Calcs'!M63","v":0},0]
[null,{"$f":"'Background Controls'!I21","v":0},{"$f":"'Mobile-Detail Calcs'!C64","v":0},{"$f":"'Mobile-Detail Calcs'!D64","v":0},{"$f":"'Mobile-Detail Calcs'!E64","v":0},{"$f":"'Mobile-Detail Calcs'!F64","v":0},{"$f":"'Mobile-Detail Calcs'!G64","v":0},{"$f":"'Mobile-Detail Calcs'!H64","v":0},{"$f":"'Mobile-Detail Calcs'!I64","v":0},{"$f":"'Mobile-Detail Calcs'!J64","v":0},{"$f":"'Mobile-Detail Calcs'!K64","v":0},{"$f":"'Mobile-Detail Calcs'!L64","v":0},{"$f":"'Mobile-Detail Calcs'!M64","v":0},0]
[null,{"$f":"'Background Controls'!I22","v":0},{"$f":"'Mobile-Detail Calcs'!C65","v":0},{"$f":"'Mobile-Detail Calcs'!D65","v":0},{"$f":"'Mobile-Detail Calcs'!E65","v":0},{"$f":"'Mobile-Detail Calcs'!F65","v":0},{"$f":"'Mobile-Detail Calcs'!G65","v":0},{"$f":"'Mobile-Detail Calcs'!H65","v":0},{"$f":"'Mobile-Detail Calcs'!I65","v":0},{"$f":"'Mobile-Detail Calcs'!J65","v":0},{"$f":"'Mobile-Detail Calcs'!K65","v":0},{"$f":"'Mobile-Detail Calcs'!L65","v":0},{"$f":"'Mobile-Detail Calcs'!M65","v":0},0]
[null,{"$f":"'Background Controls'!I23","v":0},{"$f":"'Mobile-Detail Calcs'!C66","v":0},{"$f":"'Mobile-Detail Calcs'!D66","v":0},{"$f":"'Mobile-Detail Calcs'!E66","v":0},{"$f":"'Mobile-Detail Calcs'!F66","v":0},{"$f":"'Mobile-Detail Calcs'!G66","v":0},{"$f":"'Mobile-Detail Calcs'!H66","v":0},{"$f":"'Mobile-Detail Calcs'!I66","v":0},{"$f":"'Mobile-Detail Calcs'!J66","v":0},{"$f":"'Mobile-Detail Calcs'!K66","v":0},{"$f":"'Mobile-Detail Calcs'!L66","v":0},{"$f":"'Mobile-Detail Calcs'!M66","v":0},0]
[null,{"$f":"'Background Controls'!I24","v":0},{"$f":"'Mobile-Detail Calcs'!C67","v":0},{"$f":"'Mobile-Detail Calcs'!D67","v":0},{"$f":"'Mobile-Detail Calcs'!E67","v":0},{"$f":"'Mobile-Detail Calcs'!F67","v":0},{"$f":"'Mobile-Detail Calcs'!G67","v":0},{"$f":"'Mobile-Detail Calcs'!H67","v":0},{"$f":"'Mobile-Detail Calcs'!I67","v":0},{"$f":"'Mobile-Detail Calcs'!J67","v":0},{"$f":"'Mobile-Detail Calcs'!K67","v":0},{"$f":"'Mobile-Detail Calcs'!L67","v":0},{"$f":"'Mobile-Detail Calcs'!M67","v":0},0]
[null,"Total",{"$f":"SUM(C34:C53)","v":1447739.875},{"$f":"SUM(D34:D53)","v":970369.96666666667},0,0,0,0,0,0,0,0,0,{"$f":"SUM(N34:N53)","v":2418109.8416666668}]
[]
[]
[null,"Check to display: "]
[null,null,null,null,null,null,null,null,null,null,null,null,null,null,null,null,null,"emissions",true]
[null,null,null,null,null,null,null,null,null,null,null,null,null,null,null,null,null,"energy",true]
[null,null,null,null,null,null,null,null,null,null,null,null,null,null,null,null,null,"both",{"$f":"AND(S58:S59)","v":true}]
[null,null,null,null,null,null,null,null,null,null,null,null,null,null,null,null,null,null,{"$f":"IF(S60=TRUE, R60, IF(S58=TRUE, R58, IF(S59=TRUE, R59,\"both\")))","v":"both"}]
[]
[]
[]
[]
[]
[]
[]
[]
[]
[]
[]
[]
[]
[]
[]
[]
[]
[]
[]
["Local GHG Inventory Tool: Community Module"]

{"sheet":"Solid Waste-Control","index":16,"n_rows":42,"n_cols":14,"rows_kept":42,"cut":false,"hidden":false,"merged":[[14,2,14,5],[16,2,16,10],[41,0,41,11]]}
["Solid Waste - Control"]
[]
[]
[]
[]
[]
[1,"Please answer the following questions about your community's solid waste services."]
[]
[null,"1) Is there a landfill treatment facility located within the geopolitical boundary of your community?"]
[1]
[]
[{"$f":"IF($A$10=2, \"Show\", \"Hide\")","v":"Hide"},null,"If no, then it is optional to report emissions for waste generated within your borders, but landfilled elsewhere, as Scope 3 emissions."]
[{"$f":"IF($A$10=2, \"Show\", \"Hide\")","v":"Hide"},null,"If you would like to do so, please enter results on the Waste Production sheet. "]
["Hide"]
["Hide"]
["Hide"]
["Hide"]
["Hide"]
["Hide"]
[{"$f":"IF($A$10=1, \"Show\", \"Hide\")","v":"Show"},"2) It is assumed that solid waste services belong to the commercial/institutional sector as they are either municipally or privately owned."]
[{"$f":"IF($A$10=1, \"Show\", \"Hide\")","v":"Show"},null,"no"]
["Show"]
["Show","3) How many landfills are in your community? You may enter up to 10."]
["Show"]
["Show",null,3]
["Show"]
["Show",null,"Landfill Name",null,"Does the landfill have a LFG collection system?",null,"If yes, is the LFG collection system comprehensive or partial?"]
["Show",1,"Saipan",null,"No",null,"N/A",null,null,null,null,null,"To hide"]
[{"$f":"IF(MyLFCount>=B29, \"Show\", \"Hide\")","v":"Show"},2,"Tinian",null,"No",null,"N/A",null,null,null,null,null,"Any yes?",{"$f":"IF(OR(SW_LF1q1=\"yes\", SW_LF2q1=\"yes\", SW_LF3q1=\"yes\", SW_LF4q1=\"yes\", SW_LF5q1=\"yes\", SW_LF6q1=\"yes\", SW_LF7q1=\"yes\", SW_LF8q1=\"yes\", SW_LF9q1=\"yes\", SW_LF10q1=\"yes\"), TRUE, FALSE)","v":false}]
["Show",3,"Rota",null,"No",null,"N/A",null,null,null,null,null,"Any no?",{"$f":"IF(OR(SW_LF1q1=\"no\", SW_LF2q1=\"no\", SW_LF3q1=\"no\", SW_LF4q1=\"no\", SW_LF5q1=\"no\", SW_LF6q1=\"no\", SW_LF7q1=\"no\", SW_LF8q1=\"no\", SW_LF9q1=\"no\", SW_LF10q1=\"no\"), TRUE, FALSE)","v":true}]
["Hide",4,null,null,null,null,null,null,null,null,null,null,"Any comp?",{"$f":"IF(OR(SW_LF1q2=\"comprehensive\", SW_LF2q2=\"comprehensive\", SW_LF3q2=\"comprehensive\", SW_LF4q2=\"comprehensive\", SW_LF5q2=\"comprehensive\", SW_LF6q2=\"comprehensive\", SW_LF7q2=\"comprehensive\", SW_LF8q2=\"comprehensive\", SW_LF9q2=\"comprehensive\", SW_LF10q2=\"comprehensive\"), TRUE, FALSE)","v":false}]
["Hide",5,null,null,null,null,null,null,null,null,null,null,"Any part?",{"$f":"IF(OR(SW_LF1q2=\"partial\", SW_LF2q2=\"partial\", SW_LF3q2=\"partial\", SW_LF4q2=\"partial\", SW_LF5q2=\"partial\", SW_LF6q2=\"partial\", SW_LF7q2=\"partial\", SW_LF8q2=\"partial\", SW_LF9q2=\"partial\", SW_LF10q2=\"partial\"), TRUE, FALSE)","v":false}]
["Hide",6]
["Hide",7]
["Hide",8]
["Hide",9]
["Hide",10]
["Show"]
[{"$f":"IF($A$10=1, \"Show\", \"Hide\")","v":"Show"},null,null,null,"Please enter your landfill data on the next page (Solid Waste-Entry)."]
[]
[]
["Local GHG Inventory Tool: Community Module"]

{"sheet":"Solid Waste-Entry","index":17,"n_rows":107,"n_cols":17,"rows_kept":107,"cut":false,"hidden":false,"merged":[[74,1,74,2],[106,0,106,13]]}
["Solid Waste - Entry, Calculation & Summary"]
[]
[]
[]
[]
[]
[]
[]
[{"$f":"IF('Solid Waste-Control'!$A$10=2, \"Show\", \"Hide\")","v":"Hide"},"Scope 3 Waste Emissions"]
[{"$f":"IF('Solid Waste-Control'!$A$10=2, \"Show\", \"Hide\")","v":"Hide"}]
[{"$f":"IF(SW_anyNo=TRUE, \"Show\", \"Hide\")","v":"Show"},"Landfills with No LFG Collection System"]
[{"$f":"IF(SW_anyNo=TRUE, \"Show\", \"Hide\")","v":"Show"}]
["Show","For these landfills that do not have LFG collection systems, you need to use the California Air Resources Board's Landfill Emissions Tool, which is based on the IPCC First Order Decay (FOD) model."]
["Show"]
["Show","To use the model, you will need the following information for each landfill:"]
["Show","- Annual waste deposited in landfill (can be derived from population and waste deposition data)"]
["Show","- Opening and closing year of landfill"]
["Show"]
["Show",{"$f":" \"Once you have run the model, please paste the final \" & MyYear &\" methane (CH4) emissions output for each landfill in the yellow cells below:\"","v":"Once you have run the model, please paste the final 2022 methane (CH4) emissions output for each landfill in the yellow cells below:"}]
["Show","Note: Be sure to paste Values only. To do this, once you have copied the emissions output cell, right click on the appropriate cell below, select \"Paste Special\" then select \"Values.\""]
["Show"]
[{"$f":"IF(SW_anyNo=TRUE, \"Show\", \"Hide\")","v":"Show"},"Landfill Name","CH4 Emissions (MT CO2e)"]
[{"$f":"IF(SW_LF1q1=\"No\", \"Show\", \"Hide\")","v":"Show"},{"$f":"SW_LF1name","v":"Saipan"},344.82071857797945]
[{"$f":"IF(SW_LF2q1=\"No\", \"Show\", \"Hide\")","v":"Show"},{"$f":"SW_LF2name","v":"Tinian"},16.571846991818983]
[{"$f":"IF(SW_LF3q1=\"No\", \"Show\", \"Hide\")","v":"Show"},{"$f":"SW_LF3name","v":"Rota"},15.38814363526048]
[{"$f":"IF(SW_LF4q1=\"No\", \"Show\", \"Hide\")","v":"Hide"},{"$f":"SW_LF4name","v":0}]
[{"$f":"IF(SW_LF5q1=\"No\", \"Show\", \"Hide\")","v":"Hide"},{"$f":"SW_LF5name","v":0}]
[{"$f":"IF(SW_LF6q1=\"No\", \"Show\", \"Hide\")","v":"Hide"},{"$f":"SW_LF6name","v":0}]
[{"$f":"IF(SW_LF7q1=\"No\", \"Show\", \"Hide\")","v":"Hide"},{"$f":"SW_LF7name","v":0}]
[{"$f":"IF(SW_LF8q1=\"No\", \"Show\", \"Hide\")","v":"Hide"},{"$f":"SW_LF8name","v":0}]
[{"$f":"IF(SW_LF9q1=\"No\", \"Show\", \"Hide\")","v":"Hide"},{"$f":"SW_LF9name","v":0}]
[{"$f":"IF(SW_LF10q1=\"No\", \"Show\", \"Hide\")","v":"Hide"},{"$f":"SW_LF10name","v":0}]
[{"$f":"IF(SW_anyNo=TRUE, \"Show\", \"Hide\")","v":"Show"}]
[{"$f":"IF(AND(SW_anyYes=TRUE, SW_anyComp=TRUE), \"Show\", \"Hide\")","v":"Hide"},"Landfills with Comprehensive LFG Collection Systems"]
["Hide"]
["Hide","Note: If you would like to use the CARB Landfill Emissions Tool to calculate the emissions for any landfills, please select 'No' when asked if the landfill has an LFG collection system."]
["Hide"]
["Hide","CH4 emitted = LFG Collected × Fraction CH4 in LFG × {(1-Destruction Efficiency) + [((1-Collection Efficiency)/Collection Efficiency) × (1-Oxidation Efficiency)]} × MT/MMSCF × GWP"]
["Hide"]
["Hide","Landfill Name","LFG Collected (MMSCF/yr)","Fraction of CH4 in LFG","CH4 Destruction Efficiency","CH4 Collection Efficiency","Oxidation Factor","MT CH4 / MMSCF","MT CH4","× GWP =","MT CO2e"]
["Hide",null,null,null,null,null,null,null,null,null,null,null,null,null,null,null,true]
[{"$f":"IF(AND(SW_LF1q1=\"yes\", SW_LF1q2=\"comprehensive\"), \"Show\", \"Hide\")","v":"Hide"},{"$f":"SW_LF1name","v":"Saipan"},null,0.5,0.99,0.75,0.1,19.125,{"$f":"IFERROR(C42*D42*((1-E42) + (((1-F42)/F42)*(1-G42)))*H42,\"0\")","v":0},{"$f":"CH4_CO2e","v":28},{"$f":"I42*J42","v":0},null,null,null,null,null,true]
[{"$f":"IF(AND(SW_LF2q1=\"yes\", SW_LF2q2=\"comprehensive\"), \"Show\", \"Hide\")","v":"Hide"},{"$f":"SW_LF2name","v":"Tinian"},null,0.5,0.99,0.75,{"$f":"0.1*0.1","v":1.0000000000000002E-2},19.125,{"$f":"IFERROR(C43*D43*((1-E43) + (((1-F43)/F43)*(1-G43)))*H43,\"0\")","v":0},28,{"$f":"I43*J43","v":0}]
[{"$f":"IF(AND(SW_LF3q1=\"yes\", SW_LF3q2=\"comprehensive\"), \"Show\", \"Hide\")","v":"Hide"},{"$f":"SW_LF3name","v":"Rota"},null,0.5,0.99,0.75,1.0000000000000002E-2,19.125,0,28,0]
[{"$f":"IF(AND(SW_LF4q1=\"yes\", SW_LF4q2=\"comprehensive\"), \"Show\", \"Hide\")","v":"Hide"},{"$f":"SW_LF4name","v":0},null,0.5,0.99,0.75,1.0000000000000002E-2,19.125,0,28,0]
[{"$f":"IF(AND(SW_LF5q1=\"yes\", SW_LF5q2=\"comprehensive\"), \"Show\", \"Hide\")","v":"Hide"},{"$f":"SW_LF5name","v":0},null,0.5,0.99,0.75,1.0000000000000002E-2,19.125,0,28,0]
[{"$f":"IF(AND(SW_LF6q1=\"yes\", SW_LF6q2=\"comprehensive\"), \"Show\", \"Hide\")","v":"Hide"},{"$f":"SW_LF6name","v":0},null,0.5,0.99,0.75,1.0000000000000002E-2,19.125,0,28,0]
[{"$f":"IF(AND(SW_LF7q1=\"yes\", SW_LF7q2=\"comprehensive\"), \"Show\", \"Hide\")","v":"Hide"},{"$f":"SW_LF7name","v":0},null,0.5,0.99,0.75,1.0000000000000002E-2,19.125,0,28,0]
[{"$f":"IF(AND(SW_LF8q1=\"yes\", SW_LF8q2=\"comprehensive\"), \"Show\", \"Hide\")","v":"Hide"},{"$f":"SW_LF8name","v":0},null,0.5,0.99,0.75,1.0000000000000002E-2,19.125,0,28,0]
[{"$f":"IF(AND(SW_LF9q1=\"yes\", SW_LF9q2=\"comprehensive\"), \"Show\", \"Hide\")","v":"Hide"},{"$f":"SW_LF9name","v":0},null,0.5,0.99,0.75,1.0000000000000002E-2,19.125,0,28,0]
[{"$f":"IF(AND(SW_LF10q1=\"yes\", SW_LF10q2=\"comprehensive\"), \"Show\", \"Hide\")","v":"Hide"},{"$f":"SW_LF10name","v":0},null,0.5,0.99,0.75,1.0000000000000002E-2,19.125,0,28,0]
[{"$f":"IF(AND(SW_anyYes=TRUE, SW_anyComp=TRUE), \"Show\", \"Hide\")","v":"Hide"}]
[{"$f":"IF(AND(SW_anyYes=TRUE, SW_anyPart=TRUE), \"Show\", \"Hide\")","v":"Hide"},"Landfills with Partial LFG Collection Systems"]
["Hide"]
["Hide","Note: If you would like to use the CARB Landfill Emissions Tool to calculate the emissions for any landfills, please select 'No' when asked if the landfill has an LFG collection system."]
["Hide"]
["Hide","CH4 emitted = LFG Collected × Fraction CH4 in LFG × {(1-Destruction Efficiency) + [(1/Collection Efficiency) × (1-Oxidation Efficiency)] × [Uncollected Area Factor + (1-Collection Efficiency)]} × MT/MMSCF × GWP"]
["Hide"]
["Hide","Landfill Name","LFG Collected (MMSCF/yr)","Fraction of CH4 in LFG","CH4 Destruction Efficiency","CH4 Collection Efficiency","Oxidation Factor","Uncollected Area Factor","MT CH4 / MMSCF","MT CH4","× GWP =","MT CO2e"]
["Hide",null,null,null,null,null,null,null,null,null,null,null,null,null,null,null,true]
[{"$f":"IF(AND(SW_LF1q1=\"yes\", SW_LF1q2=\"partial\"), \"Show\", \"Hide\")","v":"Hide"},{"$f":"SW_LF1name","v":"Saipan"},null,0.5,0.99,0.75,{"$f":"0.1*0.1","v":1.0000000000000002E-2},null,19.125,{"$f":"IFERROR(C61*D61*((1-E61)+((1/F61)*(1-G61))*(H61+(1-F61)))*I61,\"0\")","v":0},{"$f":"CH4_CO2e","v":28},{"$f":"J61*K61","v":0},null,null,null,null,true]
[{"$f":"IF(AND(SW_LF2q1=\"yes\", SW_LF2q2=\"partial\"), \"Show\", \"Hide\")","v":"Hide"},{"$f":"SW_LF2name","v":"Tinian"},null,0.5,0.99,0.75,1.0000000000000002E-2,null,19.125,{"$f":"IFERROR(C62*D62*((1-E62)+((1/F62)*(1-G62))*(H62+(1-F62)))*I62,\"0\")","v":0},28,0]
[{"$f":"IF(AND(SW_LF3q1=\"yes\", SW_LF3q2=\"partial\"), \"Show\", \"Hide\")","v":"Hide"},{"$f":"SW_LF3name","v":"Rota"},null,0.5,0.99,0.75,1.0000000000000002E-2,null,19.125,0,28,0]
[{"$f":"IF(AND(SW_LF4q1=\"yes\", SW_LF4q2=\"partial\"), \"Show\", \"Hide\")","v":"Hide"},{"$f":"SW_LF4name","v":0},null,0.5,0.99,0.75,1.0000000000000002E-2,null,19.125,0,28,0]
[{"$f":"IF(AND(SW_LF5q1=\"yes\", SW_LF5q2=\"partial\"), \"Show\", \"Hide\")","v":"Hide"},{"$f":"SW_LF5name","v":0},null,0.5,0.99,0.75,1.0000000000000002E-2,null,19.125,0,28,0]
[{"$f":"IF(AND(SW_LF6q1=\"yes\", SW_LF6q2=\"partial\"), \"Show\", \"Hide\")","v":"Hide"},{"$f":"SW_LF6name","v":0},null,0.5,0.99,0.75,1.0000000000000002E-2,null,19.125,0,28,0]
[{"$f":"IF(AND(SW_LF7q1=\"yes\", SW_LF7q2=\"partial\"), \"Show\", \"Hide\")","v":"Hide"},{"$f":"SW_LF7name","v":0},null,0.5,0.99,0.75,1.0000000000000002E-2,null,19.125,0,28,0]
[{"$f":"IF(AND(SW_LF8q1=\"yes\", SW_LF8q2=\"partial\"), \"Show\", \"Hide\")","v":"Hide"},{"$f":"SW_LF8name","v":0},null,0.5,0.99,0.75,1.0000000000000002E-2,null,19.125,0,28,0]
[{"$f":"IF(AND(SW_LF9q1=\"yes\", SW_LF9q2=\"partial\"), \"Show\", \"Hide\")","v":"Hide"},{"$f":"SW_LF9name","v":0},null,0.5,0.99,0.75,1.0000000000000002E-2,null,19.125,0,28,0]
[{"$f":"IF(AND(SW_LF10q1=\"yes\", SW_LF10q2=\"partial\"), \"Show\", \"Hide\")","v":"Hide"},{"$f":"SW_LF10name","v":0},null,0.5,0.99,0.75,1.0000000000000002E-2,null,19.125,0,28,0]
[]
[{"$f":"IF('Solid Waste-Control'!$A$10=1, \"Show\", \"Hide\")","v":"Show"},"Solid Waste Emissions Summary"]
[{"$f":"IF('Solid Waste-Control'!$A$10=1, \"Show\", \"Hide\")","v":"Show"}]
[{"$f":"IF('Solid Waste-Control'!$A$10=1, \"Show\", \"Hide\")","v":"Show"}]
[{"$f":"IF('Solid Waste-Control'!$A$10=1, \"Show\", \"Hide\")","v":"Show"},"Total Landfill Emissions (MT CO2e)"]
[{"$f":"IF('Solid Waste-Control'!$A$10=1, \"Show\", \"Hide\")","v":"Show"},"Landfill System","CH4"]
[{"$f":"IF('Solid Waste-Control'!$A$10=1, \"Show\", \"Hide\")","v":"Show"},"No LFG collection",{"$f":"SUM('Solid Waste-Entry'!$C$23:$C$32)","v":376.78070920505888}]
[{"$f":"IF('Solid Waste-Control'!$A$10=1, \"Show\", \"Hide\")","v":"Show"},"Comprehensive LFG Collection",{"$f":"SUM('Solid Waste-Entry'!$K$42:$K$51)","v":0}]
[{"$f":"IF('Solid Waste-Control'!$A$10=1, \"Show\", \"Hide\")","v":"Show"},"Partial LFG Collection",{"$f":"SUM('Solid Waste-Entry'!$L$61:$L$70)","v":0}]
[{"$f":"IF('Solid Waste-Control'!$A$10=1, \"Show\", \"Hide\")","v":"Show"},{"$f":"\"Total Emissions from Landfills in \"&MyCity","v":"Total Emissions from Landfills in Commonwealth of the Northern Mariana Islands"},{"$f":"SUM(C77:C79)","v":376.78070920505888}]
[{"$f":"IF('Solid Waste-Control'!$A$10=1, \"Show\", \"Hide\")","v":"Show"}]
[{"$f":"IF('Solid Waste-Control'!$A$10=1, \"Show\", \"Hide\")","v":"Show"}]
[{"$f":"IF('Solid Waste-Control'!$A$10=1, \"Show\", \"Hide\")","v":"Show"}]
[{"$f":"IF('Solid Waste-Control'!$A$10=1, \"Show\", \"Hide\")","v":"Show"}]
[{"$f":"IF('Solid Waste-Control'!$A$10=1, \"Show\", \"Hide\")","v":"Show"}]
[{"$f":"IF('Solid Waste-Control'!$A$10=1, \"Show\", \"Hide\")","v":"Show"}]
[{"$f":"IF('Solid Waste-Control'!$A$10=1, \"Show\", \"Hide\")","v":"Show"}]
[{"$f":"IF('Solid Waste-Control'!$A$10=1, \"Show\", \"Hide\")","v":"Show"}]
[{"$f":"IF('Solid Waste-Control'!$A$10=1, \"Show\", \"Hide\")","v":"Show"}]
[{"$f":"IF('Solid Waste-Control'!$A$10=1, \"Show\", \"Hide\")","v":"Show"}]
[{"$f":"IF('Solid Waste-Control'!$A$10=1, \"Show\", \"Hide\")","v":"Show"}]
[{"$f":"IF('Solid Waste-Control'!$A$10=1, \"Show\", \"Hide\")","v":"Show"}]
[{"$f":"IF('Solid Waste-Control'!$A$10=1, \"Show\", \"Hide\")","v":"Show"}]
[{"$f":"IF('Solid Waste-Control'!$A$10=1, \"Show\", \"Hide\")","v":"Show"}]
[{"$f":"IF('Solid Waste-Control'!$A$10=1, \"Show\", \"Hide\")","v":"Show"}]
[{"$f":"IF('Solid Waste-Control'!$A$10=1, \"Show\", \"Hide\")","v":"Show"}]
[{"$f":"IF('Solid Waste-Control'!$A$10=1, \"Show\", \"Hide\")","v":"Show"}]
[{"$f":"IF('Solid Waste-Control'!$A$10=1, \"Show\", \"Hide\")","v":"Show"}]
[{"$f":"IF('Solid Waste-Control'!$A$10=1, \"Show\", \"Hide\")","v":"Show"}]
[{"$f":"IF('Solid Waste-Control'!$A$10=1, \"Show\", \"Hide\")","v":"Show"}]
[{"$f":"IF('Solid Waste-Control'!$A$10=1, \"Show\", \"Hide\")","v":"Show"}]
[{"$f":"IF('Solid Waste-Control'!$A$10=1, \"Show\", \"Hide\")","v":"Show"}]
[{"$f":"IF('Solid Waste-Control'!$A$10=1, \"Show\", \"Hide\")","v":"Show"}]
[{"$f":"IF('Solid Waste-Control'!$A$10=1, \"Show\", \"Hide\")","v":"Show"}]
[]
[]
["Local GHG Inventory Tool: Community Module"]

{"sheet":"Wastewater-Control","index":18,"n_rows":64,"n_cols":19,"rows_kept":64,"cut":false,"hidden":false,"merged":[[9,16,9,18],[63,0,63,14]]}
["Wastewater - Control"]
[]
[]
[null,"Please answer the following questions about your community's wastewater treatment system."]
[null,"Emissions resulting from wastewater treated within the community's boundaries are Scope 1."]
[null,"1) It is assumed that wastewater services belong to the commercial/institutional sector as they are either municipally or privately owned."]
[null,null,"Commercial/Institutional"]
[]
[null,"2) Do you have one or more facilities where wastewater is treated in anaerobic conditions?",null,null,null,null,null,null,null,null,null,null,null,null,null,null,"To be hidden"]
[null,null,null,null,null,null,null,null,null,null,null,null,null,null,null,null,"Control"]
[null,null,null,null,null,null,null,null,null,null,null,null,null,null,null,null,2,2,{"$f":"IF(R11=1, TRUE, FALSE)","v":false}]
[null,null,null,null,null,null,null,null,null,null,null,null,null,null,null,null,3,1,{"$f":"IF(R12=1, TRUE, FALSE)","v":true}]
[null,null,null,null,null,null,null,null,null,null,null,null,null,null,null,null,4,2,{"$f":"IF(R13=1, TRUE, FALSE)","v":false}]
[null,null,null,null,null,null,null,null,null,null,null,null,null,null,null,null,5,1,true]
[null,"3) Do you have one or more facilities where wastewater is treated in aerobic conditions?",null,null,null,null,null,null,null,null,null,null,null,null,null,null,6,1,true]
[null,null,null,null,null,null,null,null,null,null,null,null,null,null,null,null,7,2,false]
[null,null,null,null,null,null,null,null,null,null,null,null,null,null,null,null,8,2,false]
[null,null,null,null,null,null,null,null,null,null,null,null,null,null,null,null,9,1,true]
[null,null,null,null,null,null,null,null,null,null,null,null,null,null,null,null,10,2,false]
[]
[null,"4) Is data available for your treatment system on both the amount of digester gas produced per day and the fraction of CH4 in the biogas?"]
[]
[]
[]
[]
[]
[null,"5) Is data available for the treatment system on both the BOD5 influent to your WWT process and the amount of BOD5 removed during primary treatment?"]
[]
[]
[]
[]
[]
[null,"6) Is any portion of your population served by septic systems?"]
[]
[]
[]
[]
[]
[null,"7) Is there any industrial nitrogen load into your wastewater treatment system?"]
[]
[]
[]
[]
[]
[null,"8) Do one or more centralized wastewater treatment plants in your community conduct nitrification/denitrification?"]
[]
[]
[]
[]
[]
[null,"9) Do one or more centralized wastewater treatment plants in your community not conduct nitrification/denitrification?"]
[]
[]
[]
[]
[]
[null,"10) Do you collect measurements of Nitrogen load in your system's effluent discharged to water bodies?"]
[]
[]
[]
[]
[]
[]
["Local GHG Inventory Tool: Community Module"]

{"sheet":"Wastewater-Entry","index":19,"n_rows":48,"n_cols":3,"rows_kept":48,"cut":false,"hidden":false,"merged":[[47,0,47,10]]}
["Wastewater - Entry"]
[]
[]
[]
[]
[]
[]
[]
["Information on population served by various systems."]
[]
[{"$f":"IF(wwt_control_q8=TRUE, \"Show\", \"Hide\")","v":"Hide"},"Population Served by Facilities with Nitrification/Denitrification"]
[{"$f":"IF(wwt_control_q8=TRUE, \"Show\", \"Hide\")","v":"Hide"},null,"people"]
[{"$f":"IF(wwt_control_q8=TRUE, \"Show\", \"Hide\")","v":"Hide"}]
[{"$f":"IF(wwt_control_q9=TRUE, \"Show\", \"Hide\")","v":"Show"},"Population Served by Facilities without Nitrification/Denitrification"]
[{"$f":"IF(wwt_control_q9=TRUE, \"Show\", \"Hide\")","v":"Show"},30000,"people"]
[{"$f":"IF(wwt_control_q9=TRUE, \"Show\", \"Hide\")","v":"Show"}]
[{"$f":"IF(wwt_control_q2=TRUE, \"Show\", \"Hide\")","v":"Hide"},"Population Served by Anaerobic Treatment Facilities"]
[{"$f":"IF(wwt_control_q2=TRUE, \"Show\", \"Hide\")","v":"Hide"},null,"people"]
[{"$f":"IF(wwt_control_q2=TRUE, \"Show\", \"Hide\")","v":"Hide"}]
[{"$f":"IF(wwt_control_q3=TRUE, \"Show\", \"Hide\")","v":"Show"},"Population Served by Aerobic Treatment Facilities"]
[{"$f":"IF(wwt_control_q3=TRUE, \"Show\", \"Hide\")","v":"Show"},30000,"people"]
[{"$f":"IF(wwt_control_q3=TRUE, \"Show\", \"Hide\")","v":"Show"}]
[{"$f":"IF(wwt_control_q6=TRUE,\"Show\",\"Hide\")","v":"Show"},"Population Served by Septic Systems"]
[{"$f":"IF(wwt_control_q6=TRUE,\"Show\",\"Hide\")","v":"Show"},{"$f":"13385+2044+1893","v":17322},"people"]
[{"$f":"IF(wwt_control_q6=TRUE,\"Show\",\"Hide\")","v":"Show"}]
["Site-Specific Data Collected"]
[]
[{"$f":"IF(AND(wwt_control_q2=TRUE, wwt_control_q4=TRUE),\"Show\",\"Hide\")","v":"Hide"},"Digester Biogas Produced Daily"]
["Hide",null,"ft3/day"]
["Hide"]
["Hide","Percentage of CH4 in Biogas (measured)"]
["Hide"]
["Hide"]
[{"$f":"IF(AND(wwt_control_q2=TRUE, wwt_control_q5=TRUE),\"Show\",\"Hide\")","v":"Hide"},"System BOD5 Input"]
["Hide",null,"kg BOD5 / day"]
["Hide"]
["Hide","Percentage of BOD5 Removed in Primary Treatment"]
["Hide"]
["Hide"]
[{"$f":"IF(wwt_control_q7=TRUE,\"Show\",\"Hide\")","v":"Hide"},"Industrial N Load"]
[{"$f":"IF(wwt_control_q7=TRUE,\"Show\",\"Hide\")","v":"Hide"},null,"kg N/day"]
[{"$f":"IF(wwt_control_q7=TRUE,\"Show\",\"Hide\")","v":"Hide"}]
[{"$f":"IF(wwt_control_q8=TRUE,\"Show\",\"Hide\")","v":"Hide"},"Average Total Nitrogen Discharged (measured)"]
[{"$f":"IF(wwt_control_q8=TRUE,\"Show\",\"Hide\")","v":"Hide"},null,"kg N/day"]
[{"$f":"IF(wwt_control_q8=TRUE,\"Show\",\"Hide\")","v":"Hide"}]
[]
[]
["Local GHG Inventory Tool: Community Module"]

{"sheet":"Wastewater- Calcs","index":20,"n_rows":90,"n_cols":14,"rows_kept":90,"cut":false,"hidden":false,"merged":[[11,1,11,3],[13,1,13,2],[14,1,14,2],[15,1,15,2],[16,1,16,2],[89,0,89,14],[20,1,20,10],[25,1,25,11],[30,1,30,9],[35,1,35,11],[40,1,40,9],[73,1,73,7],[45,1,45,7],[50,1,50,7],[55,1,55,8],[60,1,60,13],[62,1,62,13],[64,1,64,13],[66,1,66,13],[68,1,68,13],[70,1,70,13]]}
["Wastewater - Calculation & Sumary"]
[]
[]
[]
[]
[]
[]
[]
[]
[]
[]
[null,"GHG Emissions Summary"]
[null,null,null,"MT CO2e"]
[null,"CO2",null,0]
[null,"CH4",null,{"$f":"K23+L28+J33+L38+J43","v":4783.1065379999991}]
[null,"N2O",null,{"$f":"H48+H53+I58+N64+N66+N68+N70","v":644.95528459821412}]
[null,"Total Emissions from Wastewater Treatment",null,{"$f":"SUM(D14:D16)","v":5428.0618225982134}]
[]
[null,"Background Calculations"]
[]
[{"$f":"IF(AND(wwt_control_q2=TRUE, wwt_control_q4=TRUE), \"Show\", \"Hide\")","v":"Hide"},"LGOP Equation 10.1 - Stationary CH4 from Incomplete Combustion of Digester Gas  (anaerobic facilities only, site-specific data)"]
[{"$f":"IF(AND(wwt_control_q2=TRUE, wwt_control_q4=TRUE), \"Show\", \"Hide\")","v":"Hide"},"Measured Digester Gas Production (ft3/day)","× Measured % CH4 in Digester Gas"," × Methane Density (g/m3)","× 1 - CH4 Destruction Efficiency","× m3/ft3","× day/yr","× MT/g =","MT CH4","× GWP =","MT CO2e"]
[{"$f":"IF(AND(wwt_control_q2=TRUE, wwt_control_q4=TRUE), \"Show\", \"Hide\")","v":"Hide"},{"$f":"wwt_entry_biogas","v":0},{"$f":"wwt_entry_biogasCH4","v":0},{"$f":"wwt_factor_CH4density","v":662},{"$f":"1-wwt_factors_DE","v":1.0000000000000009E-2},{"$f":"ft3_m3","v":2.8316846600000001E-2},{"$f":"perday_peryr","v":365.25},{"$f":"g_MT","v":9.9999999999999995E-7},{"$f":"B23*C23*D23*E23*F23*G23*H23","v":0},{"$f":"CH4_CO2e","v":28},{"$f":"IF(AND(wwt_control_q2=TRUE, wwt_control_q4=TRUE), I23*J23, 0)","v":0}]
[{"$f":"IF(AND(wwt_control_q2=TRUE, wwt_control_q4=TRUE), \"Show\", \"Hide\")","v":"Hide"}]
[{"$f":"IF(AND(wwt_control_q2=TRUE, wwt_control_q4=TRUE), \"Show\", \"Hide\")","v":"Hide"}]
[{"$f":"IF(AND(wwt_control_q2=TRUE, wwt_control_q4=FALSE), \"Show\", \"Hide\")","v":"Hide"},"LGOP Equation 10.2 - Stationary CH4 from Incomplete Combustion of Digester Gas  (anaerobic facilities only, default data)"]
[{"$f":"IF(AND(wwt_control_q2=TRUE, wwt_control_q4=FALSE), \"Show\", \"Hide\")","v":"Hide"},"Population Served by Anaerobic Digesters","× Default Digester Gas Production (ft3/person/day)","× Default % CH4 in Digester Gas","× Methane Density (g/m3)"," × 1- CH4 Destruction Efficiency","× m3/ft3","× day/yr","× MT/g =","MT CH4","× GWP =","MT CO2e"]
[{"$f":"IF(AND(wwt_control_q2=TRUE, wwt_control_q4=FALSE), \"Show\", \"Hide\")","v":"Hide"},{"$f":"wwt_entry_popAnaerobic","v":0},{"$f":"wwt_factors_biogas_def","v":1},{"$f":"1-wwt_factors_FCH4_def","v":0.35},{"$f":"wwt_factor_CH4density","v":662},{"$f":"1-wwt_factors_DE","v":1.0000000000000009E-2},{"$f":"ft3_m3","v":2.8316846600000001E-2},{"$f":"perday_peryr","v":365.25},{"$f":"g_MT","v":9.9999999999999995E-7},{"$f":"B28*C28*D28*E28*F28*G28*H28*I28","v":0},{"$f":"CH4_CO2e","v":28},{"$f":"IF(AND(wwt_control_q2=TRUE, wwt_control_q4=FALSE), J28*K28, 0)","v":0}]
[{"$f":"IF(AND(wwt_control_q2=TRUE, wwt_control_q4=FALSE), \"Show\", \"Hide\")","v":"Hide"}]
[{"$f":"IF(AND(wwt_control_q2=TRUE, wwt_control_q4=FALSE), \"Show\", \"Hide\")","v":"Hide"}]
[{"$f":"IF(AND(wwt_control_q2=TRUE, wwt_control_q5=TRUE), \"Show\", \"Hide\")","v":"Hide"},"LGOP Equation 10.3 - Process CH4 from Anaerobic and Facultative Wastewater Treatment Lagoons (site-specific data)"]
[{"$f":"IF(AND(wwt_control_q2=TRUE, wwt_control_q5=TRUE), \"Show\", \"Hide\")","v":"Hide"},"Measured BOD5 Load (kg BOD5/day)","× 1 - Measured BOD5 Percentage Removed","× Maximum CH4 Production Capacity (kg CH4/kg BOD5)","× Anaerobic CH4 Correction Factor","× day/yr","× MT/kg =","MT CH4","× GWP =","MT CO2e"]
[{"$f":"IF(AND(wwt_control_q2=TRUE, wwt_control_q5=TRUE), \"Show\", \"Hide\")","v":"Hide"},{"$f":"wwt_entry_BODinput","v":0},{"$f":"1-wwt_entry_BODremoved","v":1},{"$f":"wwt_factors_MaxCapacity","v":0.6},{"$f":"wwt_factors_anaerobicCF","v":0.8},{"$f":"perday_peryr","v":365.25},{"$f":"kg_mt","v":1E-3},{"$f":"B33*C33*D33*E33*F33*G33","v":0},{"$f":"CH4_CO2e","v":28},{"$f":"IF(AND(wwt_control_q2=TRUE, wwt_control_q5=TRUE), H33*I33, 0)","v":0}]
[{"$f":"IF(AND(wwt_control_q2=TRUE, wwt_control_q5=TRUE), \"Show\", \"Hide\")","v":"Hide"}]
[{"$f":"IF(AND(wwt_control_q2=TRUE, wwt_control_q5=TRUE), \"Show\", \"Hide\")","v":"Hide"}]
[{"$f":"IF(AND(wwt_control_q2=TRUE, wwt_control_q5=FALSE), \"Show\", \"Hide\")","v":"Hide"},"LGOP Equation 10.4 - Process CH4 from Wastewater Treatment Lagoons (default data)"]
[{"$f":"IF(AND(wwt_control_q2=TRUE, wwt_control_q5=FALSE), \"Show\", \"Hide\")","v":"Hide"},"Effective Population Served by Lagoons","× Factor for Industrial Discharge into System","× Default BOD5 Load (kg BOD5/day)","× 1 - Default BOD5 Percentage Removed","× Maximum CH4 Production Capacity (kg CH4/kg BOD5)","× Anaerobic CH4 Correction Factor","× day/yr","× MT/kg =","MT CH4","× GWP =","MT CO2e"]
[{"$f":"IF(AND(wwt_control_q2=TRUE, wwt_control_q5=FALSE), \"Show\", \"Hide\")","v":"Hide"},{"$f":"IF(wwt_control_q7=TRUE, wwt_calcs_Peff_anaerobic, wwt_entry_popAnaerobic)","v":0},{"$f":"wwt_factors_FInd","v":1.25},{"$f":"wwt_factors_BOD5load_def","v":0.09},{"$f":"1-wwt_factors_Fp_def","v":0.67500000000000004},{"$f":"wwt_factors_MaxCapacity","v":0.6},{"$f":"wwt_factors_anaerobicCF","v":0.8},{"$f":"perday_peryr","v":365.25},{"$f":"kg_mt","v":1E-3},{"$f":"B38*C38*D38*E38*F38*G38*H38*I38","v":0},{"$f":"CH4_CO2e","v":28},{"$f":"IF(AND(wwt_control_q2=TRUE, wwt_control_q5=FALSE), J38*K38, 0)","v":0}]
[{"$f":"IF(AND(wwt_control_q2=TRUE, wwt_control_q5=FALSE), \"Show\", \"Hide\")","v":"Hide"}]
[{"$f":"IF(AND(wwt_control_q2=TRUE, wwt_control_q5=FALSE), \"Show\", \"Hide\")","v":"Hide"}]
[{"$f":"IF(wwt_control_q6=TRUE, \"Show\", \"Hide\")","v":"Show"},"LGOP Equation 10.6 - Fugitive CH4 Emissions from Septic Systems (default BOD5 load)"]
[{"$f":"IF(wwt_control_q6=TRUE, \"Show\", \"Hide\")","v":"Show"},"Population Served by Septic Systems","× Default BOD5 Load (kg BOD5/day)","× Maximum CH4 Production Capacity (kg CH4/kg BOD5)","× Septic CH4 Correction Factor","× day/yr","× MT/kg =","MT CH4","× GWP =","MT CO2e"]
[{"$f":"IF(wwt_control_q6=TRUE, \"Show\", \"Hide\")","v":"Show"},{"$f":"wwt_entry_popSeptic","v":17322},{"$f":"wwt_factors_BOD5load_def","v":0.09},{"$f":"wwt_factors_MaxCapacity","v":0.6},{"$f":"wwt_factors_septicCF","v":0.5},{"$f":"perday_peryr","v":365.25},{"$f":"kg_mt","v":1E-3},{"$f":"B43*C43*D43*E43*F43*G43","v":170.82523349999997},{"$f":"CH4_CO2e","v":28},{"$f":"IF(wwt_control_q6=TRUE, H43*I43, 0)","v":4783.1065379999991}]
[{"$f":"IF(wwt_control_q6=TRUE, \"Show\", \"Hide\")","v":"Show"}]
[{"$f":"IF(wwt_control_q6=TRUE, \"Show\", \"Hide\")","v":"Show"}]
[{"$f":"IF(wwt_control_q8=TRUE, \"Show\", \"Hide\")","v":"Hide"},"LGOP Equation 10.7 - Process N2O Emissions from WWTP with Nitrification/Denitrification"]
[{"$f":"IF(wwt_control_q8=TRUE, \"Show\", \"Hide\")","v":"Hide"},"Effective Population Served by Nit/Denit","× Factor for Industrial Discharge into System","× Nit/Denit Emissions Factor (g N2O/person/yr)","× MT/g =","MT N2O","× GWP =","MT CO2e"]
[{"$f":"IF(wwt_control_q8=TRUE, \"Show\", \"Hide\")","v":"Hide"},{"$f":"IF(wwt_control_q7=TRUE, wwt_calcs_Peff_nit, wwt_entry_popNit)","v":0},{"$f":"wwt_factors_FInd","v":1.25},{"$f":"wwt_factors_EFnitdenit","v":7},{"$f":"g_MT","v":9.9999999999999995E-7},{"$f":"B48*C48*D48*E48","v":0},{"$f":"N2O_CO2e","v":265},{"$f":"IF(wwt_control_q8=TRUE, F48*G48, 0)","v":0}]
[{"$f":"IF(wwt_control_q8=TRUE, \"Show\", \"Hide\")","v":"Hide"}]
[{"$f":"IF(wwt_control_q8=TRUE, \"Show\", \"Hide\")","v":"Hide"}]
[{"$f":"IF(wwt_control_q9=TRUE, \"Show\", \"Hide\")","v":"Show"},"LGOP Equation 10.8 - Process N2O Emissions from WWTP without Nitrification/Denitrification"]
[{"$f":"IF(wwt_control_q9=TRUE, \"Show\", \"Hide\")","v":"Show"},"Effective Population Served without Nit/Denit","× Factor for Industrial Discharge into System","× No Nit/Denit Emissions Factor (g N2O/person/yr)","× MT/g =","MT N2O","× GWP =","MT CO2e"]
["Show",{"$f":"IF(wwt_control_q7=TRUE, wwt_calcs_Peff_noNit, wwt_entry_popNoNit)","v":30000},{"$f":"wwt_factors_FInd","v":1.25},{"$f":"wwt_factors_EFnoNit","v":3.2},{"$f":"g_MT","v":9.9999999999999995E-7},{"$f":"B53*C53*D53*E53","v":0.12},{"$f":"N2O_CO2e","v":265},{"$f":"IF(wwt_control_q9=TRUE,F53*G53,0)","v":31.799999999999997}]
["Show"]
["Show"]
[{"$f":"IF(wwt_control_q9=TRUE, \"Show\", \"Hide\")","v":"Show"},"LGOP Equation 10.9 - Process N2O Emissions from Effluent Discharge (site-specific N load data)"]
["Show","Measured Average Total N Discharged (kg N/day)","× Effluent Emission Factor (kg N2O-N/kg sewage)","× day/yr","× MT/kg","× N2O/N2 Molecular Weight Ratio = ","MT N2O","× GWP =","MT CO2e"]
["Show",{"$f":"wwt_entry_Neffluent","v":0},{"$f":"wwt_factors_EFeff","v":5.0000000000000001E-3},{"$f":"perday_peryr","v":365.25},{"$f":"kg_mt","v":1E-3},{"$f":"wwt_factors_N2O_N2","v":1.5714285714285714},{"$f":"B58*C58*D58*E58*F58","v":0},{"$f":"N2O_CO2e","v":265},{"$f":"IF(wwt_control_q9=TRUE, G58*H58, 0)","v":0}]
["Show"]
["Show"]
[{"$f":"IF(wwt_control_q10=FALSE, \"Show\", \"Hide\")","v":"Show"},"LGOP Equation 10.10 - Process N2O Emissions from Effluent Discharge (default N load data)"]
[{"$f":"IF(wwt_control_q10=FALSE, \"Show\", \"Hide\")","v":"Show"},"Population Served","Factor for Industrial Discharge into System","× [Total N Load (kg N/person/day)","- N uptake* (kg N/kg BOD5)","× BOD5 Load ]","× Effluent Emissions Factor (kg N2O-N/kg sewage)","× N2O/N2 Molecular Weight Ratio","× 1 - Fraction of Nitrogen Removed**","× day/yr","× MT/kg =","MT N2O","× GWP =","MT CO2e"]
[{"$f":"IF(AND(wwt_control_q10=FALSE, wwt_control_q2=TRUE, wwt_control_q8=TRUE), \"Show\", \"Hide\")","v":"Hide"},"Anaerobic Treatment with Nitrification/Denitrification"]
[{"$f":"IF(AND(wwt_control_q10=FALSE, wwt_control_q2=TRUE, wwt_control_q8=TRUE), \"Show\", \"Hide\")","v":"Hide"},{"$f":"wwt_entry_popNit","v":0},{"$f":"wwt_factors_FInd","v":1.25},{"$f":"wwt_factors_NloadTot","v":2.5999999999999999E-2},{"$f":"wwt_factors_NupAnaerobic","v":5.0000000000000001E-3},{"$f":"wwt_factors_BOD5load_def","v":0.09},{"$f":"wwt_factors_EFeff","v":5.0000000000000001E-3},{"$f":"wwt_factors_N2O_N2","v":1.5714285714285714},{"$f":"1-wwt_factors_nitdenit_def","v":0.30000000000000004},{"$f":"perday_peryr","v":365.25},{"$f":"kg_mt","v":1E-3},{"$f":"B64*C64*(D64-E64*F64)*G64*H64*I64*J64*K64","v":0},{"$f":"N2O_CO2e","v":265},{"$f":"IF(AND(wwt_control_q10=FALSE, wwt_control_q2=TRUE, wwt_control_q8=TRUE), L64*M64, 0)","v":0}]
[{"$f":"IF(AND(wwt_control_q10=FALSE, wwt_control_q2=TRUE, wwt_control_q9=TRUE), \"Show\", \"Hide\")","v":"Hide"},"Anaerobic Treatment without Nitrification/Denitrification"]
[{"$f":"IF(AND(wwt_control_q10=FALSE, wwt_control_q2=TRUE, wwt_control_q9=TRUE), \"Show\", \"Hide\")","v":"Hide"},{"$f":"wwt_entry_popNoNit","v":30000},{"$f":"wwt_factors_FInd","v":1.25},{"$f":"wwt_factors_NloadTot","v":2.5999999999999999E-2},{"$f":"wwt_factors_NupAnaerobic","v":5.0000000000000001E-3},{"$f":"wwt_factors_BOD5load_def","v":0.09},{"$f":"wwt_factors_EFeff","v":5.0000000000000001E-3},{"$f":"wwt_factors_N2O_N2","v":1.5714285714285714},{"$f":"1-wwt_factors_nonitdenit_def","v":1},{"$f":"perday_peryr","v":365.25},{"$f":"kg_mt","v":1E-3},{"$f":"B66*C66*(D66-E66*F66)*G66*H66*I66*J66*K66","v":2.7496476562500001},{"$f":"N2O_CO2e","v":265},{"$f":"IF(AND(wwt_control_q10=FALSE, wwt_control_q2=TRUE, wwt_control_q9=TRUE), L66*M66, 0)","v":0}]
[{"$f":"IF(AND(wwt_control_q10=FALSE, wwt_control_q3=TRUE, wwt_control_q8=TRUE), \"Show\", \"Hide\")","v":"Hide"},"Aerobic Treatment with Nitrification/Denitrification"]
[{"$f":"IF(AND(wwt_control_q10=FALSE, wwt_control_q3=TRUE, wwt_control_q8=TRUE), \"Show\", \"Hide\")","v":"Hide"},{"$f":"wwt_entry_popNit","v":0},{"$f":"wwt_factors_FInd","v":1.25},{"$f":"wwt_factors_NloadTot","v":2.5999999999999999E-2},{"$f":"wwt_factors_NupAerobic","v":0.05},{"$f":"wwt_factors_BOD5load_def","v":0.09},{"$f":"wwt_factors_EFeff","v":5.0000000000000001E-3},{"$f":"wwt_factors_N2O_N2","v":1.5714285714285714},{"$f":"1-wwt_factors_nitdenit_def","v":0.30000000000000004},{"$f":"perday_peryr","v":365.25},{"$f":"kg_mt","v":1E-3},{"$f":"B68*C68*(D68-E68*F68)*G68*H68*I68*J68*K68","v":0},{"$f":"N2O_CO2e","v":265},{"$f":"IF(AND(wwt_control_q10=FALSE, wwt_control_q3=TRUE, wwt_control_q8=TRUE), L68*M68, 0)","v":0}]
[{"$f":"IF(AND(wwt_control_q10=FALSE, wwt_control_q3=TRUE, wwt_control_q9=TRUE), \"Show\", \"Hide\")","v":"Show"},"Aerobic Treatment without Nitrification/Denitrification"]
[{"$f":"IF(AND(wwt_control_q10=FALSE, wwt_control_q3=TRUE, wwt_control_q9=TRUE), \"Show\", \"Hide\")","v":"Show"},{"$f":"wwt_entry_popNoNit","v":30000},{"$f":"wwt_factors_FInd","v":1.25},{"$f":"wwt_factors_NloadTot","v":2.5999999999999999E-2},{"$f":"wwt_factors_NupAerobic","v":0.05},{"$f":"wwt_factors_BOD5load_def","v":0.09},{"$f":"wwt_factors_EFeff","v":5.0000000000000001E-3},{"$f":"wwt_factors_N2O_N2","v":1.5714285714285714},{"$f":"1-wwt_factors_nonitdenit_def","v":1},{"$f":"perday_peryr","v":365.25},{"$f":"kg_mt","v":1E-3},{"$f":"B70*C70*(D70-E70*F70)*G70*H70*I70*J70*K70","v":2.3137935267857137},{"$f":"N2O_CO2e","v":265},{"$f":"IF(AND(wwt_control_q10=FALSE, wwt_control_q3=TRUE, wwt_control_q9=TRUE), L70*M70, 0)","v":613.15528459821417}]
[{"$f":"IF(wwt_control_q10=FALSE, \"Show\", \"Hide\")","v":"Show"},"*Depends if anaerobic/aerobic; **Depends if with/without Nitrification/Denitrification"]
[{"$f":"IF(wwt_control_q9=FALSE, \"Show\", \"Hide\")","v":"Hide"}]
[{"$f":"IF(wwt_control_q9=FALSE, \"Show\", \"Hide\")","v":"Hide"}]
[{"$f":"IF(wwt_control_q7=TRUE, \"Show\", \"Hide\")","v":"Hide"},"Effective Population Calculations"]
[{"$f":"IF(wwt_control_q7=TRUE, \"Show\", \"Hide\")","v":"Hide"},"System","Industrial Load (lbs N/day)","× kg/lb","÷ Population Equivalency Factor (kg N/person/day)","= Population Equivalent of Industrial Loading","+ Population Served","= Effective Population"]
[{"$f":"IF(AND(wwt_control_q7=TRUE, wwt_control_q2=TRUE), \"Show\", \"Hide\")","v":"Hide"},"Anaerobic",{"$f":"wwt_entry_indusNload","v":0},{"$f":"lb_kg","v":0.45359237000000002},2.5999999999999999E-2,{"$f":"C76*D76/E76","v":0},{"$f":"wwt_entry_popAnaerobic","v":0},{"$f":"F76+G76","v":0}]
[{"$f":"IF(AND(wwt_control_q7=TRUE, wwt_control_q3=TRUE), \"Show\", \"Hide\")","v":"Hide"},"Aerobic",{"$f":"wwt_entry_indusNload","v":0},{"$f":"lb_kg","v":0.45359237000000002},2.5999999999999999E-2,{"$f":"C77*D77/E77","v":0},{"$f":"wwt_entry_popAerobic","v":30000},{"$f":"F77+G77","v":30000}]
[{"$f":"IF(AND(wwt_control_q7=TRUE, wwt_control_q8=TRUE), \"Show\", \"Hide\")","v":"Hide"},"Nit/Denit",{"$f":"wwt_entry_indusNload","v":0},{"$f":"lb_kg","v":0.45359237000000002},2.5999999999999999E-2,{"$f":"C78*D78/E78","v":0},{"$f":"wwt_entry_popNit","v":0},{"$f":"F78+G78","v":0}]
[{"$f":"IF(wwt_control_q7=TRUE, \"Show\", \"Hide\")","v":"Hide"},"No Nit/Denit",{"$f":"wwt_entry_indusNload","v":0},{"$f":"lb_kg","v":0.45359237000000002},2.5999999999999999E-2,{"$f":"C79*D79/E79","v":0},{"$f":"wwt_entry_popNoNit","v":30000},{"$f":"F79+G79","v":30000}]
[]
[]
[null,"Cell Color Codes"]
[null,"Data entered on previous sheet"]
[null,"Calculated or Entered Data"]
[null,"CH4 Emissions"]
[null,"N2O Emissions"]
[null,"Value depends on system type"]
[]
[]
["Local GHG Inventory Tool: Community Module"]

{"sheet":"Electricity-Entry","index":21,"n_rows":24,"n_cols":8,"rows_kept":24,"cut":false,"hidden":false,"merged":[[23,0,23,7]]}
["Electricity Use - Entry"]
["Data Entry & Calculations"]
[]
[]
[]
[]
[]
["1)","Describe the electricity consuming unit you are entering"]
[null,"ID#","Unit Description (e.g., facility name)","Facility Type (if applicable)","Sector","Is this a Contractual Instrument? (e.g., REC)"]
[0,{"$f":"elec_CurrentID","v":1},"sample 1","Energy Generation: Electricity Generators","Energy Generation","No"]
[]
[]
["2)",{"$f":"\"Enter the activity data for the year \"&MyYear","v":"Enter the activity data for the year 2022"}]
[]
[null,{"$f":"IF(elec_entry_contract<>\"No\",\"Contractual Instrument Description (Unique ID)\",\"\")","v":""},"Electricity Purchased (kWh)",{"$f":"IF(elec_entry_contract=\"No\",\"Electric Utility\",\"\")","v":"Electric Utility"},{"$f":"IF(elec_entry_contract<>\"No\",\"Supplier-Specific CO2 Emissions Rate (lb/MWh)\",\"\")","v":""},{"$f":"IF(elec_entry_contract<>\"No\",\"Supplier-Specific CH4 Emissions Rate (lb/MWh)\",\"\")","v":""},{"$f":"IF(elec_entry_contract<>\"No\",\"Supplier-Specific N2O Emissions Rate (lb/MWh)\",\"\")","v":""}]
[null,null,null,"Select Electric Utility..."]
[null,{"$f":"IF(AND(IFERROR(VLOOKUP(elec_entry_ID,elec_data,7,FALSE)<>elec_entry_contract_descript,TRUE),elec_entry_contract_descript<>\"\",ISNUMBER(MATCH(elec_entry_contract_descript,contractual_instrument_entries,0))),\"WARNING: This description has already been used for another contractual instrument. Please provide a unique description.\",\"\")","v":""}]
[]
[]
[]
[null,null,null,null,null,null,null," "]
[]
[]
["Local GHG Inventory Tool: Community Module"]

{"sheet":"Electricity-Data","index":22,"n_rows":8,"n_cols":11,"rows_kept":8,"cut":false,"hidden":false,"merged":[]}
["Electricity Use - Data"]
[]
[]
[]
["Linker Row"]
["ID#","Unit Description","Sector","Utility","Electricity Consumed (kWh)","Facility Type","Contractual Instrument Description","Supplier-Specific CO2 Emissions Rate","Supplier-Specific CH4 Emissions Rate","Supplier-Specific N2O Emissions Rate","contract?"]
[{"$f":"MAX(A9:A65514)+1","v":1},{"$f":"elec_entry_description","v":"sample 1"},{"$f":"elec_entry_dept","v":"Energy Generation"},{"$f":"IF(elec_entry_contract=\"Yes\",\"N/A\",elec_entry_utility)","v":"Select Electric Utility..."},{"$f":"elec_entry_consumption","v":0},{"$f":"elec_entry_bldgtype","v":"Energy Generation: Electricity Generators"},{"$f":"elec_entry_contract_descript","v":0},{"$f":"elec_entry_CO2_ER","v":0},{"$f":"elec_entry_CH4_ER","v":0},{"$f":"elec_entry_N2O_ER","v":0},{"$f":"elec_entry_contract","v":"No"}]
["Saved Data"]

{"sheet":"Electricity LocationBased-Calcs","index":23,"n_rows":240,"n_cols":9,"rows_kept":240,"cut":false,"hidden":false,"merged":[[17,1,17,5],[61,1,61,2],[239,0,239,12]]}
["Electricity Use - Calculation & Summary "]
["Jump to…"]
["GHG Summary"]
["Emissions by Sector"]
["Electricity Summary"]
["Electricity Use by Sector"]
["Background Calculations"]
["CO2 emissions by utility"]
["CH4 emissions by utility"]
["N2O emissions by utility"]
["Activity data by sector and utility"]
["CO2 emissions by sector and utility"]
["CH4 emissions by sector and utility"]
["N2O emissions by sector and utility"]
[]
["GHG Summary"]
[]
[null,"Emissions by Sector (in CO2e)"]
[null,null,"CO2","CH4","N2O","Total"]
["Dstart",{"$f":"'Background Controls'!I5","v":"Residential"},{"$f":"IF(ISNA(VLOOKUP($B20, elec_calcs_deptCO2, 8, FALSE)),0, VLOOKUP($B20, elec_calcs_deptCO2, 8, FALSE))","v":0},{"$f":"IF(ISNA(VLOOKUP($B20, elec_calcs_deptCH4, 8, FALSE)),0, VLOOKUP($B20, elec_calcs_deptCH4, 8, FALSE))","v":0},{"$f":"IF(ISNA(VLOOKUP($B20, elec_calcs_deptN2O, 8, FALSE)),0, VLOOKUP($B20, elec_calcs_deptN2O, 8, FALSE))","v":0},{"$f":"SUM(C20:E20)","v":0}]
[null,{"$f":"'Background Controls'!I6","v":"Commercial/Institutional"},0,{"$f":"IF(ISNA(VLOOKUP($B21, elec_calcs_deptCH4, 8, FALSE)),0, VLOOKUP($B21, elec_calcs_deptCH4, 8, FALSE))","v":0},0,{"$f":"SUM(C21:E21)","v":0}]
[null,{"$f":"'Background Controls'!I7","v":"Industrial"},0,0,0,0]
[null,{"$f":"'Background Controls'!I8","v":"Energy Generation"},0,0,0,0]
[null,{"$f":"'Background Controls'!I9","v":0},0,0,0,0]
[null,{"$f":"'Background Controls'!I10","v":0},0,0,0,0]
[null,{"$f":"'Background Controls'!I11","v":0},0,0,0,0]
[null,{"$f":"'Background Controls'!I12","v":0},0,0,0,0]
[null,{"$f":"'Background Controls'!I13","v":0},0,0,0,0]
[null,{"$f":"'Background Controls'!I14","v":0},0,0,0,0]
[null,{"$f":"'Background Controls'!I15","v":0},0,0,0,0]
[null,{"$f":"'Background Controls'!I16","v":0},0,0,0,0]
[null,{"$f":"'Background Controls'!I17","v":0},0,0,0,0]
[null,{"$f":"'Background Controls'!I18","v":0},0,0,0,0]
[null,{"$f":"'Background Controls'!I19","v":0},0,0,0,0]
[null,{"$f":"'Background Controls'!I20","v":0},0,0,0,0]
[null,{"$f":"'Background Controls'!I21","v":0},0,0,0,0]
[null,{"$f":"'Background Controls'!I22","v":0},0,0,0,0]
[null,{"$f":"'Background Controls'!I23","v":0},0,0,0,0]
[null,{"$f":"'Background Controls'!I24","v":0},0,0,0,0]
[null,"Total Emissions from Electricity Use",{"$f":"SUM(C20:C29)","v":0},{"$f":"SUM(D20:D29)","v":0},{"$f":"SUM(E20:E29)","v":0},{"$f":"SUM(F20:F29)","v":0}]
[]
[]
[]
[]
[]
[]
[]
[]
[]
[]
[]
[]
[]
[]
[]
[]
[]
[]
[]
["Electricity Summary"]
[]
[null,"Electricity Use by Sector (in kWh)"]
[null,"Sector","kWh"]
["Dstart",{"$f":"'Background Controls'!I5","v":"Residential"},{"$f":"SUMIFS(elec_data_consump,elec_data_dept,B64,elec_data_contract_binary,\"No\")","v":0}]
[null,{"$f":"'Background Controls'!I6","v":"Commercial/Institutional"},0]
[null,{"$f":"'Background Controls'!I7","v":"Industrial"},0]
[null,{"$f":"'Background Controls'!I8","v":"Energy Generation"},0]
[null,{"$f":"'Background Controls'!I9","v":0},0]
[null,{"$f":"'Background Controls'!I10","v":0},0]
[null,{"$f":"'Background Controls'!I11","v":0},0]
[null,{"$f":"'Background Controls'!I12","v":0},0]
[null,{"$f":"'Background Controls'!I13","v":0},0]
[null,{"$f":"'Background Controls'!I14","v":0},0]
[null,{"$f":"'Background Controls'!I15","v":0},0]
[null,{"$f":"'Background Controls'!I16","v":0},0]
[null,{"$f":"'Background Controls'!I17","v":0},0]
[null,{"$f":"'Background Controls'!I18","v":0},0]
[null,{"$f":"'Background Controls'!I19","v":0},0]
[null,{"$f":"'Background Controls'!I20","v":0},0]
[null,{"$f":"'Background Controls'!I21","v":0},0]
[null,{"$f":"'Background Controls'!I22","v":0},0]
[null,{"$f":"'Background Controls'!I23","v":0},0]
[null,{"$f":"'Background Controls'!I24","v":0},0]
[null,"Total Electricity Use",{"$f":"SUM(C64:C83)","v":0}]
[]
[]
[]
[]
[]
[]
[]
[]
[]
[]
[]
[]
[]
[]
[]
[]
[]
[]
[]
[]
[]
["Background Calculations"]
[]
["CO2 Emissions by Utility"]
["Emissions = Electricity Consumed (kWh) × eGRID Regional Emissions Factor (lb CO2/MWh) × MWh/kWh × MT/lb × CO2 GWP"]
[null,"Utility","kWh","eGRID Regional EF (lb CO2/MWh)","MWh/kWh","MT/lb","MT CO2","× GWP =","MT CO2e"]
[null,{"$f":"IF('Background Controls'!$B$62=0,\"-\",'Background Controls'!$B$62)","v":"AKGD eGRID subregion"},{"$f":"SUMIF(elec_data_utility, B111, elec_data_consump)","v":0},{"$f":"IFERROR(VLOOKUP(B$111, elec_control_factors, 2, FALSE),\"-\")","v":1067.68},{"$f":"kWh_MWh","v":1E-3},{"$f":"lb_mt","v":4.5359236999999999E-4},{"$f":"IFERROR(C111*D111*E111*F111,\"-\")","v":0},{"$f":"CO2_CO2e","v":1},{"$f":"IFERROR(G111*H111,\"-\")","v":0}]
[null,{"$f":"IF('Background Controls'!$B$63=0,\"-\",'Background Controls'!$B$63)","v":"-"},0,{"$f":"IF(B112=\"-\",\"-\",VLOOKUP(B$111, elec_control_factors, 2, FALSE))","v":"-"},1E-3,4.5359236999999999E-4,"-",1,"-"]
[null,{"$f":"IF('Background Controls'!$B$64=0,\"-\",'Background Controls'!$B$64)","v":"-"},0,{"$f":"IF(B113=\"-\",\"-\",VLOOKUP(B$111, elec_control_factors, 2, FALSE))","v":"-"},1E-3,4.5359236999999999E-4,"-",1,"-"]
[null,{"$f":"IF('Background Controls'!$B$65=0,\"-\",'Background Controls'!$B$65)","v":"-"},0,{"$f":"IF(B114=\"-\",\"-\",VLOOKUP(B$111, elec_control_factors, 2, FALSE))","v":"-"},1E-3,4.5359236999999999E-4,"-",1,"-"]
[null,{"$f":"IF('Background Controls'!$B$66=0,\"-\",'Background Controls'!$B$66)","v":"-"},0,{"$f":"IF(B115=\"-\",\"-\",VLOOKUP(B$111, elec_control_factors, 2, FALSE))","v":"-"},1E-3,4.5359236999999999E-4,"-",1,"-"]
[null,{"$f":"IF('Background Controls'!$B$67=0,\"-\",'Background Controls'!$B$67)","v":"-"},0,{"$f":"IF(B116=\"-\",\"-\",VLOOKUP(B$111, elec_control_factors, 2, FALSE))","v":"-"},1E-3,4.5359236999999999E-4,"-",1,"-"]
[]
["CH4 Emissions by Utility"]
["Emissions = Electricity Consumed (kWh) × eGRID Regional Emissions Factor (lb CH4/MWh) × MWh/kWh × MT/lb × CH4 GWP"]
[null,"Utility","kWh","eGRID Regional EF (lb CH4/MWh)","MWh/kWh","MT/lb","MT CH4","× GWP =","MT CO2e"]
[null,{"$f":"IF('Background Controls'!$B$62=0,\"-\",'Background Controls'!$B$62)","v":"AKGD eGRID subregion"},{"$f":"SUMIF(elec_data_utility, B121, elec_data_consump)","v":0},{"$f":"IFERROR(VLOOKUP(B$121, elec_control_factors, 3, FALSE),\"-\")","v":9.0999999999999998E-2},{"$f":"kWh_MWh","v":1E-3},{"$f":"lb_mt","v":4.5359236999999999E-4},{"$f":"IFERROR(C121*D121*E121*F121,\"-\")","v":0},{"$f":"CH4_CO2e","v":28},{"$f":"IFERROR(G121*H121,\"-\")","v":0}]
[null,{"$f":"IF('Background Controls'!$B$63=0,\"-\",'Background Controls'!$B$63)","v":"-"},0,{"$f":"IF(B122=\"-\",\"-\",VLOOKUP(B$121, elec_control_factors, 3, FALSE))","v":"-"},1E-3,4.5359236999999999E-4,"-",28,"-"]
[null,{"$f":"IF('Background Controls'!$B$64=0,\"-\",'Background Controls'!$B$64)","v":"-"},0,{"$f":"IF(B123=\"-\",\"-\",VLOOKUP(B$121, elec_control_factors, 3, FALSE))","v":"-"},1E-3,4.5359236999999999E-4,"-",28,"-"]
[null,{"$f":"IF('Background Controls'!$B$65=0,\"-\",'Background Controls'!$B$65)","v":"-"},0,{"$f":"IF(B124=\"-\",\"-\",VLOOKUP(B$121, elec_control_factors, 3, FALSE))","v":"-"},1E-3,4.5359236999999999E-4,"-",28,"-"]
[null,{"$f":"IF('Background Controls'!$B$66=0,\"-\",'Background Controls'!$B$66)","v":"-"},0,{"$f":"IF(B125=\"-\",\"-\",VLOOKUP(B$121, elec_control_factors, 3, FALSE))","v":"-"},1E-3,4.5359236999999999E-4,"-",28,"-"]
[null,{"$f":"IF('Background Controls'!$B$67=0,\"-\",'Background Controls'!$B$67)","v":"-"},0,{"$f":"IF(B126=\"-\",\"-\",VLOOKUP(B$121, elec_control_factors, 3, FALSE))","v":"-"},1E-3,4.5359236999999999E-4,"-",28,"-"]
[]
["N2O Emissions by Utility"]
["Emissions = Electricity Consumed (kWh) × eGRID Regional Emissions Factor (lb N2O/MWh) × MWh/kWh × MT/lb × N2O GWP"]
[null,"Utility","kWh","eGRID Regional EF (lb N2O/MWh)","MWh/kWh","MT/lb","MT N2O","× GWP =","MT CO2e"]
[null,{"$f":"IF('Background Controls'!$B$62=0,\"-\",'Background Controls'!$B$62)","v":"AKGD eGRID subregion"},{"$f":"SUMIF(elec_data_utility, B131, elec_data_consump)","v":0},{"$f":"IFERROR(VLOOKUP(B$131, elec_control_factors, 4, FALSE),\"-\")","v":1.2E-2},{"$f":"kWh_MWh","v":1E-3},{"$f":"lb_mt","v":4.5359236999999999E-4},{"$f":"IFERROR(C131*D131*E131*F131,\"-\")","v":0},{"$f":"N2O_CO2e","v":265},{"$f":"IFERROR(G131*H131,\"-\")","v":0}]
[null,{"$f":"IF('Background Controls'!$B$63=0,\"-\",'Background Controls'!$B$63)","v":"-"},0,{"$f":"IF(B132=\"-\",\"-\",VLOOKUP(B$131, elec_control_factors, 4, FALSE))","v":"-"},1E-3,4.5359236999999999E-4,"-",265,"-"]
[null,{"$f":"IF('Background Controls'!$B$64=0,\"-\",'Background Controls'!$B$64)","v":"-"},0,{"$f":"IF(B133=\"-\",\"-\",VLOOKUP(B$131, elec_control_factors, 4, FALSE))","v":"-"},1E-3,4.5359236999999999E-4,"-",265,"-"]
[null,{"$f":"IF('Background Controls'!$B$65=0,\"-\",'Background Controls'!$B$65)","v":"-"},0,{"$f":"IF(B134=\"-\",\"-\",VLOOKUP(B$131, elec_control_factors, 4, FALSE))","v":"-"},1E-3,4.5359236999999999E-4,"-",265,"-"]
[null,{"$f":"IF('Background Controls'!$B$66=0,\"-\",'Background Controls'!$B$66)","v":"-"},0,{"$f":"IF(B135=\"-\",\"-\",VLOOKUP(B$131, elec_control_factors, 4, FALSE))","v":"-"},1E-3,4.5359236999999999E-4,"-",265,"-"]
[null,{"$f":"IF('Background Controls'!$B$67=0,\"-\",'Background Controls'!$B$67)","v":"-"},0,{"$f":"IF(B136=\"-\",\"-\",VLOOKUP(B$131, elec_control_factors, 4, FALSE))","v":"-"},1E-3,4.5359236999999999E-4,"-",265,"-"]
[]
["Activity Data by Sector and Utility"]
["Electricity use data by sector and fuel type (kWh)"]
[null,"Sector",{"$f":"IF('Background Controls'!$B$62=0,\"-\",'Background Controls'!$B$62)","v":"AKGD eGRID subregion"},{"$f":"IF('Background Controls'!$B$63=0,\"-\",'Background Controls'!$B$63)","v":"-"},{"$f":"IF('Background Controls'!$B$64=0,\"-\",'Background Controls'!$B$64)","v":"-"},{"$f":"IF('Background Controls'!$B$65=0,\"-\",'Background Controls'!$B$65)","v":"-"},{"$f":"IF('Background Controls'!$B$66=0,\"-\",'Background Controls'!$B$66)","v":"-"},{"$f":"IF('Background Controls'!$B$67=0,\"-\",'Background Controls'!$B$67)","v":"-"},"TOTAL"]
["Dstart",{"$f":"'Background Controls'!I5","v":"Residential"},{"$f":"SUMIFS(elec_data_consump, elec_data_dept, $B141, elec_data_utility, C$140)","v":0},{"$f":"SUMIFS(elec_data_consump, elec_data_dept, $B141, elec_data_utility, D$140)","v":0},0,0,0,0,{"$f":"SUM(C141:H141)","v":0}]
[null,{"$f":"'Background Controls'!I6","v":"Commercial/Institutional"},{"$f":"SUMIFS(elec_data_consump, elec_data_dept, $B142, elec_data_utility, C$140)","v":0},0,0,0,0,0,0]
[null,{"$f":"'Background Controls'!I7","v":"Industrial"},0,{"$f":"SUMIFS(elec_data_consump, elec_data_dept, $B143, elec_data_utility, D$140)","v":0},0,0,0,0,0]
[null,{"$f":"'Background Controls'!I8","v":"Energy Generation"},0,0,0,0,0,0,0]
[null,{"$f":"'Background Controls'!I9","v":0},0,0,0,0,0,0,0]
[null,{"$f":"'Background Controls'!I10","v":0},0,0,0,0,0,0,0]
[null,{"$f":"'Background Controls'!I11","v":0},0,0,0,0,0,0,0]
[null,{"$f":"'Background Controls'!I12","v":0},0,0,0,0,0,0,0]
[null,{"$f":"'Background Controls'!I13","v":0},0,0,0,0,0,0,0]
[null,{"$f":"'Background Controls'!I14","v":0},0,0,0,0,0,0,0]
[null,{"$f":"'Background Controls'!I15","v":0},{"$f":"SUMIFS(elec_data_consump, elec_data_dept, $B151, elec_data_utility, C$140)","v":0},0,0,0,0,0,0]
[null,{"$f":"'Background Controls'!I16","v":0},0,0,0,0,0,0,0]
[null,{"$f":"'Background Controls'!I17","v":0},0,0,0,0,0,0,0]
[null,{"$f":"'Background Controls'!I18","v":0},0,0,0,0,0,0,0]
[null,{"$f":"'Background Controls'!I19","v":0},0,0,0,0,0,0,0]
[null,{"$f":"'Background Controls'!I20","v":0},0,0,0,0,0,0,0]
[null,{"$f":"'Background Controls'!I21","v":0},{"$f":"SUMIFS(elec_data_consump, elec_data_dept, $B157, elec_data_utility, C$140)","v":0},0,0,0,0,0,0]
[null,{"$f":"'Background Controls'!I22","v":0},0,0,0,0,0,0,0]
[null,{"$f":"'Background Controls'!I23","v":0},0,0,0,0,0,0,0]
[null,{"$f":"'Background Controls'!I24","v":0},0,0,0,0,0,0,0]
[null,"Total",{"$f":"SUM(C141:C160)","v":0},0,0,0,0,0,{"$f":"SUM(I141:I160)","v":0}]
[]
["CO2 Emissions by Sector and Utility"]
["Emissions = Electricity Consumed (kWh) × eGRID Regional Emissions Factor (lb CO2/MWh) × MWh/kWh × MT/lb × CO2 GWP"]
[null,"Sector",{"$f":"IF('Background Controls'!$B$62=0,\"-\",'Background Controls'!$B$62)","v":"AKGD eGRID subregion"},{"$f":"IF('Background Controls'!$B$63=0,\"-\",'Background Controls'!$B$63)","v":"-"},{"$f":"IF('Background Controls'!$B$64=0,\"-\",'Background Controls'!$B$64)","v":"-"},{"$f":"IF('Background Controls'!$B$65=0,\"-\",'Background Controls'!$B$65)","v":"-"},{"$f":"IF('Background Controls'!$B$66=0,\"-\",'Background Controls'!$B$66)","v":"-"},{"$f":"IF('Background Controls'!$B$67=0,\"-\",'Background Controls'!$B$67)","v":"-"},"TOTAL"]
["Dstart",{"$f":"'Background Controls'!I5","v":"Residential"},{"$f":"IFERROR(C141*VLOOKUP($C$165, elec_control_factors, 2, FALSE)*kWh_MWh*lb_mt*CO2_CO2e,\"-\")","v":0},{"$f":"IFERROR(D141*VLOOKUP($C$165, elec_control_factors, 2, FALSE)*kWh_MWh*lb_mt*CO2_CO2e,\"-\")","v":0},{"$f":"IFERROR(E141*VLOOKUP($C$165, elec_control_factors, 2, FALSE)*kWh_MWh*lb_mt*CO2_CO2e,\"-\")","v":0},0,0,0,{"$f":"SUM(C166:H166)","v":0}]
[null,{"$f":"'Background Controls'!I6","v":"Commercial/Institutional"},0,{"$f":"IFERROR(D142*VLOOKUP($C$165, elec_control_factors, 2, FALSE)*kWh_MWh*lb_mt*CO2_CO2e,\"-\")","v":0},0,0,0,0,0]
[null,{"$f":"'Background Controls'!I7","v":"Industrial"},0,{"$f":"IFERROR(D143*VLOOKUP($C$165, elec_control_factors, 2, FALSE)*kWh_MWh*lb_mt*CO2_CO2e,\"-\")","v":0},0,0,0,0,0]
[null,{"$f":"'Background Controls'!I8","v":"Energy Generation"},0,{"$f":"IFERROR(D144*VLOOKUP($C$165, elec_control_factors, 2, FALSE)*kWh_MWh*lb_mt*CO2_CO2e,\"-\")","v":0},0,0,0,0,0]
[null,{"$f":"'Background Controls'!I9","v":0},0,0,0,0,0,0,0]
[null,{"$f":"'Background Controls'!I10","v":0},0,0,0,0,0,0,0]
[null,{"$f":"'Background Controls'!I11","v":0},0,0,0,0,0,0,0]
[null,{"$f":"'Background Controls'!I12","v":0},0,0,0,0,0,0,0]
[null,{"$f":"'Background Controls'!I13","v":0},0,0,0,0,0,0,0]
[null,{"$f":"'Background Controls'!I14","v":0},0,0,0,0,0,0,0]
[null,{"$f":"'Background Controls'!I15","v":0},0,0,0,0,0,0,0]
[null,{"$f":"'Background Controls'!I16","v":0},0,0,0,0,0,0,0]
[null,{"$f":"'Background Controls'!I17","v":0},0,0,0,0,0,0,0]
[null,{"$f":"'Background Controls'!I18","v":0},0,0,0,0,0,0,0]
[null,{"$f":"'Background Controls'!I19","v":0},0,0,0,0,0,0,0]
[null,{"$f":"'Background Controls'!I20","v":0},0,0,0,0,0,0,0]
[null,{"$f":"'Background Controls'!I21","v":0},0,0,0,0,0,0,0]
[null,{"$f":"'Background Controls'!I22","v":0},0,0,0,0,0,0,0]
[null,{"$f":"'Background Controls'!I23","v":0},0,0,0,0,0,0,0]
[null,{"$f":"'Background Controls'!I24","v":0},0,0,0,0,0,0,0]
[null,"Total",{"$f":"SUM(C166:C185)","v":0},0,0,0,0,0,{"$f":"SUM(I166:I185)","v":0}]
[]
["CH4 emissions by sector and utility"]
["Emissions = Electricity Consumed (kWh) × eGRID Regional Emissions Factor (lb CH4/kWh) × MWh/kWh × MT/lb × CH4 GWP"]
[null,"Sector",{"$f":"IF('Background Controls'!$B$62=0,\"-\",'Background Controls'!$B$62)","v":"AKGD eGRID subregion"},{"$f":"IF('Background Controls'!$B$63=0,\"-\",'Background Controls'!$B$63)","v":"-"},{"$f":"IF('Background Controls'!$B$64=0,\"-\",'Background Controls'!$B$64)","v":"-"},{"$f":"IF('Background Controls'!$B$65=0,\"-\",'Background Controls'!$B$65)","v":"-"},{"$f":"IF('Background Controls'!$B$66=0,\"-\",'Background Controls'!$B$66)","v":"-"},{"$f":"IF('Background Controls'!$B$67=0,\"-\",'Background Controls'!$B$67)","v":"-"},"TOTAL"]
["Dstart",{"$f":"'Background Controls'!I5","v":"Residential"},{"$f":"IFERROR(C141*VLOOKUP(C$165, elec_control_factors,3, FALSE)*kWh_MWh*lb_mt*CH4_CO2e,\"-\")","v":0},{"$f":"IFERROR(D141*VLOOKUP($C$165, elec_control_factors,3, FALSE)*kWh_MWh*lb_mt*CH4_CO2e,\"-\")","v":0},{"$f":"IFERROR(E141*VLOOKUP($C$165, elec_control_factors,3, FALSE)*kWh_MWh*lb_mt*CH4_CO2e,\"-\")","v":0},0,0,0,{"$f":"SUM(C191:H191)","v":0}]
[null,{"$f":"'Background Controls'!I6","v":"Commercial/Institutional"},{"$f":"IFERROR(C142*VLOOKUP(C$165, elec_control_factors,3, FALSE)*kWh_MWh*lb_mt*CH4_CO2e,\"-\")","v":0},0,0,0,{"$f":"IFERROR(G142*VLOOKUP($C$165, elec_control_factors,3, FALSE)*kWh_MWh*lb_mt*CH4_CO2e,\"-\")","v":0},0,0]
[null,{"$f":"'Background Controls'!I7","v":"Industrial"},0,0,{"$f":"IFERROR(E143*VLOOKUP($C$165, elec_control_factors,3, FALSE)*kWh_MWh*lb_mt*CH4_CO2e,\"-\")","v":0},0,0,{"$f":"IFERROR(H143*VLOOKUP($C$165, elec_control_factors,3, FALSE)*kWh_MWh*lb_mt*CH4_CO2e,\"-\")","v":0},0]
[null,{"$f":"'Background Controls'!I8","v":"Energy Generation"},0,0,0,0,0,0,0]
[null,{"$f":"'Background Controls'!I9","v":0},0,0,0,0,0,0,0]
[null,{"$f":"'Background Controls'!I10","v":0},0,0,0,0,0,0,0]
[null,{"$f":"'Background Controls'!I11","v":0},0,0,0,0,0,0,0]
[null,{"$f":"'Background Controls'!I12","v":0},0,0,0,0,0,0,0]
[null,{"$f":"'Background Controls'!I13","v":0},0,0,0,0,0,0,0]
[null,{"$f":"'Background Controls'!I14","v":0},0,0,0,0,0,0,0]
[null,{"$f":"'Background Controls'!I15","v":0},{"$f":"IFERROR(C151*VLOOKUP(C$165, elec_control_factors,3, FALSE)*kWh_MWh*lb_mt*CH4_CO2e,\"-\")","v":0},{"$f":"IFERROR(D151*VLOOKUP($C$165, elec_control_factors,3, FALSE)*kWh_MWh*lb_mt*CH4_CO2e,\"-\")","v":0},0,0,0,0,0]
[null,{"$f":"'Background Controls'!I16","v":0},0,0,0,0,0,0,0]
[null,{"$f":"'Background Controls'!I17","v":0},0,0,0,0,0,0,0]
[null,{"$f":"'Background Controls'!I18","v":0},0,0,0,0,0,0,0]
[null,{"$f":"'Background Controls'!I19","v":0},0,0,0,0,0,0,0]
[null,{"$f":"'Background Controls'!I20","v":0},0,0,0,0,0,0,0]
[null,{"$f":"'Background Controls'!I21","v":0},0,0,0,0,0,0,0]
[null,{"$f":"'Background Controls'!I22","v":0},0,0,0,0,0,0,0]
[null,{"$f":"'Background Controls'!I23","v":0},0,0,0,0,0,0,0]
[null,{"$f":"'Background Controls'!I24","v":0},0,0,0,0,0,0,0]
[null,"Total",{"$f":"SUM(C191:C210)","v":0},0,0,0,0,0,{"$f":"SUM(I191:I210)","v":0}]
[]
["N2O emissions by sector and utility"]
["Emissions = Electricity Consumed (kWh) × eGRID Regional Emissions Factor (lb N2O/kWh) × MWh/kWh × MT/lb × N2O GWP"]
[null,"Sector",{"$f":"IF('Background Controls'!$B$62=0,\"-\",'Background Controls'!$B$62)","v":"AKGD eGRID subregion"},{"$f":"IF('Background Controls'!$B$63=0,\"-\",'Background Controls'!$B$63)","v":"-"},{"$f":"IF('Background Controls'!$B$64=0,\"-\",'Background Controls'!$B$64)","v":"-"},{"$f":"IF('Background Controls'!$B$65=0,\"-\",'Background Controls'!$B$65)","v":"-"},{"$f":"IF('Background Controls'!$B$66=0,\"-\",'Background Controls'!$B$66)","v":"-"},{"$f":"IF('Background Controls'!$B$67=0,\"-\",'Background Controls'!$B$67)","v":"-"},"TOTAL"]
["Dstart",{"$f":"'Background Controls'!I5","v":"Residential"},{"$f":"IFERROR(C141*VLOOKUP(C$165, elec_control_factors,4, FALSE)*kWh_MWh*lb_mt*N2O_CO2e,\"-\")","v":0},{"$f":"IFERROR(D141*VLOOKUP($C$165, elec_control_factors,4, FALSE)*kWh_MWh*lb_mt*N2O_CO2e,\"-\")","v":0},0,0,{"$f":"IFERROR(G141*VLOOKUP($C$165, elec_control_factors,4, FALSE)*kWh_MWh*lb_mt*N2O_CO2e,\"-\")","v":0},0,{"$f":"SUM(C216:H216)","v":0}]
[null,{"$f":"'Background Controls'!I6","v":"Commercial/Institutional"},0,0,0,0,0,0,0]
[null,{"$f":"'Background Controls'!I7","v":"Industrial"},0,0,0,{"$f":"IFERROR(F143*VLOOKUP($C$165, elec_control_factors,4, FALSE)*kWh_MWh*lb_mt*N2O_CO2e,\"-\")","v":0},0,{"$f":"IFERROR(H143*VLOOKUP($C$165, elec_control_factors,4, FALSE)*kWh_MWh*lb_mt*N2O_CO2e,\"-\")","v":0},0]
[null,{"$f":"'Background Controls'!I8","v":"Energy Generation"},0,0,0,0,0,0,0]
[null,{"$f":"'Background Controls'!I9","v":0},0,0,0,0,0,0,0]
[null,{"$f":"'Background Controls'!I10","v":0},0,0,0,0,0,0,0]
[null,{"$f":"'Background Controls'!I11","v":0},0,0,0,0,0,0,0]
[null,{"$f":"'Background Controls'!I12","v":0},0,0,0,0,0,0,0]
[null,{"$f":"'Background Controls'!I13","v":0},0,0,0,0,0,0,0]
[null,{"$f":"'Background Controls'!I14","v":0},0,0,0,0,0,0,0]
[null,{"$f":"'Background Controls'!I15","v":0},{"$f":"IFERROR(C151*VLOOKUP(C$165, elec_control_factors,4, FALSE)*kWh_MWh*lb_mt*N2O_CO2e,\"-\")","v":0},{"$f":"IFERROR(D151*VLOOKUP($C$165, elec_control_factors,4, FALSE)*kWh_MWh*lb_mt*N2O_CO2e,\"-\")","v":0},0,0,0,0,0]
[null,{"$f":"'Background Controls'!I16","v":0},0,0,0,0,0,0,0]
[null,{"$f":"'Background Controls'!I17","v":0},0,0,0,0,0,0,0]
[null,{"$f":"'Background Controls'!I18","v":0},0,0,0,0,0,0,0]
[null,{"$f":"'Background Controls'!I19","v":0},0,0,0,0,0,0,0]
[null,{"$f":"'Background Controls'!I20","v":0},0,0,0,0,0,0,0]
[null,{"$f":"'Background Controls'!I21","v":0},0,0,0,0,0,0,0]
[null,{"$f":"'Background Controls'!I22","v":0},0,0,0,0,0,0,0]
[null,{"$f":"'Background Controls'!I23","v":0},0,0,0,0,0,0,0]
[null,{"$f":"'Background Controls'!I24","v":0},0,0,0,0,0,0,0]
[null,"Total",{"$f":"SUM(C216:C235)","v":0},0,0,0,0,0,{"$f":"SUM(I216:I235)","v":0}]
[]
[]
[]
["Local GHG Inventory Tool: Community Module"]

{"sheet":"Employee Commute","index":24,"n_rows":188,"n_cols":11,"rows_kept":188,"cut":false,"hidden":true,"merged":[[187,0,187,13],[52,4,52,12],[60,1,60,2],[37,0,38,12],[54,0,55,12],[133,0,133,13],[50,0,50,13]]}
["Employee Commute"]
["Jump to…"]
["Step 1. Enter employee data by department"]
["Step 2. Enter mode of transportation proportions"]
["Employee Commute Emissions Summary"]
["Chart: Employee Commute Emissions"]
["Background Calculations"]
[]
[]
[]
[]
["1. Enter Employee Data"]
["Please enter the number of employees in each department. This will be used to calculate the commute emissions per department."]
[null,"Department","Number of employees"]
["Dstart",{"$f":"'Background Controls'!I5","v":"Residential"}]
[null,{"$f":"'Background Controls'!I6","v":"Commercial/Institutional"}]
[null,{"$f":"'Background Controls'!I7","v":"Industrial"}]
[null,{"$f":"'Background Controls'!I8","v":"Energy Generation"}]
[null,{"$f":"'Background Controls'!I9","v":0}]
[null,{"$f":"'Background Controls'!I10","v":0}]
[null,{"$f":"'Background Controls'!I11","v":0}]
[null,{"$f":"'Background Controls'!I12","v":0}]
[null,{"$f":"'Background Controls'!I13","v":0}]
[null,{"$f":"'Background Controls'!I14","v":0}]
[null,{"$f":"'Background Controls'!I15","v":0}]
[null,{"$f":"'Background Controls'!I16","v":0}]
[null,{"$f":"'Background Controls'!I17","v":0}]
[null,{"$f":"'Background Controls'!I18","v":0}]
[null,{"$f":"'Background Controls'!I19","v":0}]
[null,{"$f":"'Background Controls'!I20","v":0}]
[null,{"$f":"'Background Controls'!I21","v":0}]
[null,{"$f":"'Background Controls'!I22","v":0}]
[null,{"$f":"'Background Controls'!I23","v":0}]
[null,{"$f":"'Background Controls'!I24","v":0}]
[]
["2. Enter mode of transit proportions, commute length, and work days"]
["Please enter what percentage of employees use each form of transportation to work. These values will be used to determine how many city employees travel by each mode every day. "]
["Default values are from the American Communities Survey, and represent the average distribution of transit modes in the United States. For more accurate emissions estimates, use proportions gathered from a travel survey of city employees."]
[]
[null,"Mode","Employees who use mode (%)","Default Values"]
[null,"Single Occupancy Vehicle",null,0.76400000000000001]
[null,"Carpool",null,9.7000000000000003E-2]
[null,"Motorcycle",null,2E-3]
[null,"Transit",null,0.05]
[null,"Bike",null,6.0000000000000001E-3]
[null,"Walk",null,2.8000000000000001E-2]
[null,"Work at home",null,4.2999999999999997E-2]
[null,"Other",null,{"$f":"1-SUM(D41:D47)","v":9.9999999999998979E-3}]
[null,"Total",{"$f":"SUM(C41:C48)","v":0}]
[]
["Please enter the average one-way commute length for city employees. Default commute distance is 12.6 miles (from FHWA's 2010 Status of the Nation's Highways Bridges and Transit, http://www.fhwa.dot.gov/policy/2010cpr/execsum.htm). "]
["This commute distance may be longer or shorter than the average commute for your city's employees. For the most accurate emissions estimates, use data from a travel survey of city employees."]
[null,"Average One-Way Commute Length (miles)",null,12.6]
[]
["Please enter the number of days each city employee works per year. This number will be multiplied by the emissions from daily commutes. Default work-year days is provided (240 days), assuming a 5-day work week, two weeks (10 days) of vacation, and 10 federal holidays."]
[]
[null,"Workdays per year",null,240]
[]
["Employee Commute Emissions Summary"]
[]
[null,"Emissions by Department (MT CO2e)"]
[null,null,"CO2"]
["Dstart",{"$f":"'Background Controls'!I5","v":"Residential"},{"$f":"K164","v":{"$error":"#DIV/0!"}}]
[null,{"$f":"'Background Controls'!I6","v":"Commercial/Institutional"},{"$f":"K165","v":{"$error":"#DIV/0!"}}]
[null,{"$f":"'Background Controls'!I7","v":"Industrial"},{"$error":"#DIV/0!"}]
[null,{"$f":"'Background Controls'!I8","v":"Energy Generation"},{"$error":"#DIV/0!"}]
[null,{"$f":"'Background Controls'!I9","v":0},{"$error":"#DIV/0!"}]
[null,{"$f":"'Background Controls'!I10","v":0},{"$error":"#DIV/0!"}]
[null,{"$f":"'Background Controls'!I11","v":0},{"$error":"#DIV/0!"}]
[null,{"$f":"'Background Controls'!I12","v":0},{"$error":"#DIV/0!"}]
[null,{"$f":"'Background Controls'!I13","v":0},{"$error":"#DIV/0!"}]
[null,{"$f":"'Background Controls'!I14","v":0},{"$error":"#DIV/0!"}]
[null,{"$f":"'Background Controls'!I15","v":0},{"$error":"#DIV/0!"}]
[null,{"$f":"'Background Controls'!I16","v":0},{"$error":"#DIV/0!"}]
[null,{"$f":"'Background Controls'!I17","v":0},{"$error":"#DIV/0!"}]
[null,{"$f":"'Background Controls'!I18","v":0},{"$error":"#DIV/0!"}]
[null,{"$f":"'Background Controls'!I19","v":0},{"$error":"#DIV/0!"}]
[null,{"$f":"'Background Controls'!I20","v":0},{"$error":"#DIV/0!"}]
[null,{"$f":"'Background Controls'!I21","v":0},{"$error":"#DIV/0!"}]
[null,{"$f":"'Background Controls'!I22","v":0},{"$error":"#DIV/0!"}]
[null,{"$f":"'Background Controls'!I23","v":0},{"$error":"#DIV/0!"}]
[null,{"$f":"'Background Controls'!I24","v":0},{"$error":"#DIV/0!"}]
[null,"Total",{"$f":"SUM(C63:C82)","v":{"$error":"#DIV/0!"}}]
[]
[]
[]
[]
[]
[]
[]
[]
[]
[]
[]
[]
[]
[]
[]
[]
[]
[]
[]
[]
[]
[]
["Background Calculations"]
[]
["Employees by Department and Mode"]
["Number of Employees who use mode = # of employees × percentage of employees who use each mode"]
[null,null,"Single Occupancy Vehicle","Carpool","Motorcycle","Transit","Bike","Walk","Work at Home","Other"]
["Dstart",{"$f":"'Background Controls'!I5","v":"Residential"},{"$f":"VLOOKUP(C$110,$B$41:$C$48, 2, FALSE)*VLOOKUP($B111, $B$15:$C$34, 2, FALSE)","v":0},{"$f":"VLOOKUP(D$110,$B$41:$C$48, 2, FALSE)*VLOOKUP($B111, $B$15:$C$34, 2, FALSE)","v":0},0,0,0,0,0,0]
[null,{"$f":"'Background Controls'!I6","v":"Commercial/Institutional"},0,0,0,0,0,0,0,0]
[null,{"$f":"'Background Controls'!I7","v":"Industrial"},0,0,0,0,0,0,0,0]
[null,{"$f":"'Background Controls'!I8","v":"Energy Generation"},0,0,0,0,0,0,0,0]
[null,{"$f":"'Background Controls'!I9","v":0},0,0,0,0,0,0,0,0]
[null,{"$f":"'Background Controls'!I10","v":0},0,0,0,0,0,0,0,0]
[null,{"$f":"'Background Controls'!I11","v":0},0,0,0,0,0,0,0,0]
[null,{"$f":"'Background Controls'!I12","v":0},0,0,0,0,0,0,0,0]
[null,{"$f":"'Background Controls'!I13","v":0},0,0,0,0,0,0,0,0]
[null,{"$f":"'Background Controls'!I14","v":0},0,0,0,0,0,0,0,0]
[null,{"$f":"'Background Controls'!I15","v":0},{"$f":"VLOOKUP(C$110,$B$41:$C$48, 2, FALSE)*VLOOKUP($B121, $B$15:$C$34, 2, FALSE)","v":0},0,0,0,0,0,0,0]
[null,{"$f":"'Background Controls'!I16","v":0},0,0,0,0,0,0,0,0]
[null,{"$f":"'Background Controls'!I17","v":0},0,0,0,0,0,0,0,0]
[null,{"$f":"'Background Controls'!I18","v":0},0,0,0,0,0,0,0,0]
[null,{"$f":"'Background Controls'!I19","v":0},0,0,0,0,0,0,0,0]
[null,{"$f":"'Background Controls'!I20","v":0},0,0,0,0,0,0,0,0]
[null,{"$f":"'Background Controls'!I21","v":0},0,0,0,0,0,0,0,0]
[null,{"$f":"'Background Controls'!I22","v":0},0,0,0,0,0,0,0,0]
[null,{"$f":"'Background Controls'!I23","v":0},0,0,0,0,0,0,0,0]
[null,{"$f":"'Background Controls'!I24","v":0},0,0,0,0,0,0,0,0]
[null,"Total",{"$f":"SUM(C111:C130)","v":0},{"$f":"SUM(D111:D130)","v":0},0,0,0,0,0,0]
[]
["Daily CO2 Emissions by Department and Mode"]
["CO2 Emissions/Day = Employees traveling × Trip Distance/day ÷ People/Mode ÷ miles per gallon × Mode Emissions Factor (kg CO2/gallon) × MT/kg × GWP CO2  [people × (1/people) × miles/day \n                                            × gal/mile × kg CO2/gal × MT/kg = MT CO2/day]"]
[null,null,"Single Occupancy Vehicle","Carpool","Motorcycle","Transit","Bike","Walk","Work at Home","Other","TOTAL"]
[null,"CO2 Emission Factor (kg/gal)",{"$f":"VLOOKUP(C135, commute_factors, 4, FALSE)","v":8.7799999999999994},8.7799999999999994,8.7799999999999994,{"$f":"VLOOKUP(F135, commute_factors, 4, FALSE)","v":0},0,0,0,0]
[null,"mpg",{"$f":"VLOOKUP(C$135, commute_factors, 2, FALSE)","v":21.6},{"$f":"VLOOKUP(D$135, commute_factors, 2, FALSE)","v":21.6},{"$f":"VLOOKUP(E$135, commute_factors, 2, FALSE)","v":43.4},0,0,0,0,0]
[null,"People/Mode",{"$f":"VLOOKUP(C135, commute_factors, 3, FALSE)","v":1},{"$f":"VLOOKUP(D135, commute_factors, 3, FALSE)","v":2.4160314135984864},{"$f":"VLOOKUP(E135, commute_factors, 3, FALSE)","v":1},0,0,0,0,0]
["Dstart",{"$f":"'Background Controls'!I5","v":"Residential"},{"$f":"C111*(1/C$138)*(2*$C$53)*(1/C$137)*C$136*kg_mt*CO2_CO2e","v":0},0,{"$f":"E111*(1/E$138)*(2*$C$53)*(1/E$137)*E$136*kg_mt*CO2_CO2e","v":0},{"$f":"F111*F$136*F$137*(1/(2*$C$53))*kg_mt*CO2_CO2e","v":{"$error":"#DIV/0!"}},{"$error":"#DIV/0!"},{"$error":"#DIV/0!"},{"$error":"#DIV/0!"},{"$error":"#DIV/0!"},{"$f":"SUM(C139:J139)","v":{"$error":"#DIV/0!"}}]
[null,{"$f":"'Background Controls'!I6","v":"Commercial/Institutional"},0,0,0,{"$error":"#DIV/0!"},{"$error":"#DIV/0!"},{"$error":"#DIV/0!"},{"$error":"#DIV/0!"},{"$error":"#DIV/0!"},{"$f":"SUM(C140:J140)","v":{"$error":"#DIV/0!"}}]
[null,{"$f":"'Background Controls'!I7","v":"Industrial"},0,0,0,{"$error":"#DIV/0!"},{"$error":"#DIV/0!"},{"$error":"#DIV/0!"},{"$error":"#DIV/0!"},{"$error":"#DIV/0!"},{"$error":"#DIV/0!"}]
[null,{"$f":"'Background Controls'!I8","v":"Energy Generation"},0,0,0,{"$error":"#DIV/0!"},{"$error":"#DIV/0!"},{"$error":"#DIV/0!"},{"$error":"#DIV/0!"},{"$error":"#DIV/0!"},{"$error":"#DIV/0!"}]
[null,{"$f":"'Background Controls'!I9","v":0},0,0,0,{"$error":"#DIV/0!"},{"$error":"#DIV/0!"},{"$error":"#DIV/0!"},{"$error":"#DIV/0!"},{"$error":"#DIV/0!"},{"$error":"#DIV/0!"}]
[null,{"$f":"'Background Controls'!I10","v":0},0,0,0,{"$error":"#DIV/0!"},{"$error":"#DIV/0!"},{"$error":"#DIV/0!"},{"$error":"#DIV/0!"},{"$error":"#DIV/0!"},{"$error":"#DIV/0!"}]
[null,{"$f":"'Background Controls'!I11","v":0},0,0,0,{"$error":"#DIV/0!"},{"$error":"#DIV/0!"},{"$error":"#DIV/0!"},{"$error":"#DIV/0!"},{"$error":"#DIV/0!"},{"$error":"#DIV/0!"}]
[null,{"$f":"'Background Controls'!I12","v":0},0,0,0,{"$error":"#DIV/0!"},{"$error":"#DIV/0!"},{"$error":"#DIV/0!"},{"$error":"#DIV/0!"},{"$error":"#DIV/0!"},{"$error":"#DIV/0!"}]
[null,{"$f":"'Background Controls'!I13","v":0},0,0,0,{"$error":"#DIV/0!"},{"$error":"#DIV/0!"},{"$error":"#DIV/0!"},{"$error":"#DIV/0!"},{"$error":"#DIV/0!"},{"$error":"#DIV/0!"}]
[null,{"$f":"'Background Controls'!I14","v":0},0,0,0,{"$error":"#DIV/0!"},{"$error":"#DIV/0!"},{"$error":"#DIV/0!"},{"$error":"#DIV/0!"},{"$error":"#DIV/0!"},{"$error":"#DIV/0!"}]
[null,{"$f":"'Background Controls'!I15","v":0},0,0,0,{"$f":"F121*F$136*F$137*(1/(2*$C$53))*kg_mt*CO2_CO2e","v":{"$error":"#DIV/0!"}},{"$error":"#DIV/0!"},{"$error":"#DIV/0!"},{"$error":"#DIV/0!"},{"$error":"#DIV/0!"},{"$error":"#DIV/0!"}]
[null,{"$f":"'Background Controls'!I16","v":0},0,0,0,{"$error":"#DIV/0!"},{"$error":"#DIV/0!"},{"$error":"#DIV/0!"},{"$error":"#DIV/0!"},{"$error":"#DIV/0!"},{"$error":"#DIV/0!"}]
[null,{"$f":"'Background Controls'!I17","v":0},0,0,0,{"$error":"#DIV/0!"},{"$error":"#DIV/0!"},{"$error":"#DIV/0!"},{"$error":"#DIV/0!"},{"$error":"#DIV/0!"},{"$error":"#DIV/0!"}]
[null,{"$f":"'Background Controls'!I18","v":0},0,0,0,{"$error":"#DIV/0!"},{"$error":"#DIV/0!"},{"$error":"#DIV/0!"},{"$error":"#DIV/0!"},{"$error":"#DIV/0!"},{"$error":"#DIV/0!"}]
[null,{"$f":"'Background Controls'!I19","v":0},0,0,0,{"$error":"#DIV/0!"},{"$error":"#DIV/0!"},{"$error":"#DIV/0!"},{"$error":"#DIV/0!"},{"$error":"#DIV/0!"},{"$error":"#DIV/0!"}]
[null,{"$f":"'Background Controls'!I20","v":0},0,0,0,{"$error":"#DIV/0!"},{"$error":"#DIV/0!"},{"$error":"#DIV/0!"},{"$error":"#DIV/0!"},{"$error":"#DIV/0!"},{"$error":"#DIV/0!"}]
[null,{"$f":"'Background Controls'!I21","v":0},0,0,0,{"$error":"#DIV/0!"},{"$error":"#DIV/0!"},{"$error":"#DIV/0!"},{"$error":"#DIV/0!"},{"$error":"#DIV/0!"},{"$error":"#DIV/0!"}]
[null,{"$f":"'Background Controls'!I22","v":0},0,0,0,{"$error":"#DIV/0!"},{"$error":"#DIV/0!"},{"$error":"#DIV/0!"},{"$error":"#DIV/0!"},{"$error":"#DIV/0!"},{"$error":"#DIV/0!"}]
[null,{"$f":"'Background Controls'!I23","v":0},0,0,0,{"$error":"#DIV/0!"},{"$error":"#DIV/0!"},{"$error":"#DIV/0!"},{"$error":"#DIV/0!"},{"$error":"#DIV/0!"},{"$error":"#DIV/0!"}]
[null,{"$f":"'Background Controls'!I24","v":0},0,0,0,{"$error":"#DIV/0!"},{"$error":"#DIV/0!"},{"$error":"#DIV/0!"},{"$error":"#DIV/0!"},{"$error":"#DIV/0!"},{"$error":"#DIV/0!"}]
[null,"Total",{"$f":"SUM(C139:C158)","v":0},{"$f":"SUM(D139:D158)","v":0},0,{"$error":"#DIV/0!"},{"$error":"#DIV/0!"},{"$error":"#DIV/0!"},{"$error":"#DIV/0!"},{"$error":"#DIV/0!"},{"$f":"SUM(K139:K158)","v":{"$error":"#DIV/0!"}}]
[]
["Annual CO2 Emissions by Department and Mode"]
["Annual CO2 Emissions (MT) = MT CO2/commute day × commute days/yr"]
[null,null,"Single Occupancy Vehicle","Carpool","Motorcycle","Transit","Bike","Walk","Work at Home","Other","TOTAL"]
["Dstart",{"$f":"'Background Controls'!I5","v":"Residential"},{"$f":"C139*$C$57","v":0},{"$f":"D139*$C$57","v":0},0,{"$error":"#DIV/0!"},{"$error":"#DIV/0!"},{"$error":"#DIV/0!"},{"$error":"#DIV/0!"},{"$error":"#DIV/0!"},{"$f":"SUM(C164:J164)","v":{"$error":"#DIV/0!"}}]
[null,{"$f":"'Background Controls'!I6","v":"Commercial/Institutional"},{"$f":"C140*$C$57","v":0},0,0,{"$error":"#DIV/0!"},{"$error":"#DIV/0!"},{"$error":"#DIV/0!"},{"$error":"#DIV/0!"},{"$error":"#DIV/0!"},{"$f":"SUM(C165:J165)","v":{"$error":"#DIV/0!"}}]
[null,{"$f":"'Background Controls'!I7","v":"Industrial"},0,0,0,{"$error":"#DIV/0!"},{"$error":"#DIV/0!"},{"$error":"#DIV/0!"},{"$error":"#DIV/0!"},{"$error":"#DIV/0!"},{"$error":"#DIV/0!"}]
[null,{"$f":"'Background Controls'!I8","v":"Energy Generation"},0,0,0,{"$error":"#DIV/0!"},{"$error":"#DIV/0!"},{"$error":"#DIV/0!"},{"$error":"#DIV/0!"},{"$error":"#DIV/0!"},{"$error":"#DIV/0!"}]
[null,{"$f":"'Background Controls'!I9","v":0},0,0,0,{"$error":"#DIV/0!"},{"$error":"#DIV/0!"},{"$error":"#DIV/0!"},{"$error":"#DIV/0!"},{"$error":"#DIV/0!"},{"$error":"#DIV/0!"}]
[null,{"$f":"'Background Controls'!I10","v":0},0,0,0,{"$error":"#DIV/0!"},{"$error":"#DIV/0!"},{"$error":"#DIV/0!"},{"$error":"#DIV/0!"},{"$error":"#DIV/0!"},{"$error":"#DIV/0!"}]
[null,{"$f":"'Background Controls'!I11","v":0},0,0,0,{"$error":"#DIV/0!"},{"$error":"#DIV/0!"},{"$error":"#DIV/0!"},{"$error":"#DIV/0!"},{"$error":"#DIV/0!"},{"$error":"#DIV/0!"}]
[null,{"$f":"'Background Controls'!I12","v":0},0,0,0,{"$error":"#DIV/0!"},{"$error":"#DIV/0!"},{"$error":"#DIV/0!"},{"$error":"#DIV/0!"},{"$error":"#DIV/0!"},{"$error":"#DIV/0!"}]
[null,{"$f":"'Background Controls'!I13","v":0},0,0,0,{"$error":"#DIV/0!"},{"$error":"#DIV/0!"},{"$error":"#DIV/0!"},{"$error":"#DIV/0!"},{"$error":"#DIV/0!"},{"$error":"#DIV/0!"}]
[null,{"$f":"'Background Controls'!I14","v":0},0,0,0,{"$error":"#DIV/0!"},{"$error":"#DIV/0!"},{"$error":"#DIV/0!"},{"$error":"#DIV/0!"},{"$error":"#DIV/0!"},{"$error":"#DIV/0!"}]
[null,{"$f":"'Background Controls'!I15","v":0},0,0,0,{"$error":"#DIV/0!"},{"$error":"#DIV/0!"},{"$error":"#DIV/0!"},{"$error":"#DIV/0!"},{"$error":"#DIV/0!"},{"$error":"#DIV/0!"}]
[null,{"$f":"'Background Controls'!I16","v":0},0,0,0,{"$error":"#DIV/0!"},{"$error":"#DIV/0!"},{"$error":"#DIV/0!"},{"$error":"#DIV/0!"},{"$error":"#DIV/0!"},{"$error":"#DIV/0!"}]
[null,{"$f":"'Background Controls'!I17","v":0},0,0,0,{"$error":"#DIV/0!"},{"$error":"#DIV/0!"},{"$error":"#DIV/0!"},{"$error":"#DIV/0!"},{"$error":"#DIV/0!"},{"$error":"#DIV/0!"}]
[null,{"$f":"'Background Controls'!I18","v":0},0,0,0,{"$error":"#DIV/0!"},{"$error":"#DIV/0!"},{"$error":"#DIV/0!"},{"$error":"#DIV/0!"},{"$error":"#DIV/0!"},{"$error":"#DIV/0!"}]
[null,{"$f":"'Background Controls'!I19","v":0},0,0,0,{"$error":"#DIV/0!"},{"$error":"#DIV/0!"},{"$error":"#DIV/0!"},{"$error":"#DIV/0!"},{"$error":"#DIV/0!"},{"$error":"#DIV/0!"}]
[null,{"$f":"'Background Controls'!I20","v":0},0,0,0,{"$error":"#DIV/0!"},{"$error":"#DIV/0!"},{"$error":"#DIV/0!"},{"$error":"#DIV/0!"},{"$error":"#DIV/0!"},{"$error":"#DIV/0!"}]
[null,{"$f":"'Background Controls'!I21","v":0},0,0,0,{"$error":"#DIV/0!"},{"$error":"#DIV/0!"},{"$error":"#DIV/0!"},{"$error":"#DIV/0!"},{"$error":"#DIV/0!"},{"$error":"#DIV/0!"}]
[null,{"$f":"'Background Controls'!I22","v":0},0,0,0,{"$error":"#DIV/0!"},{"$error":"#DIV/0!"},{"$error":"#DIV/0!"},{"$error":"#DIV/0!"},{"$error":"#DIV/0!"},{"$error":"#DIV/0!"}]
[null,{"$f":"'Background Controls'!I23","v":0},0,0,0,{"$error":"#DIV/0!"},{"$error":"#DIV/0!"},{"$error":"#DIV/0!"},{"$error":"#DIV/0!"},{"$error":"#DIV/0!"},{"$error":"#DIV/0!"}]
[null,{"$f":"'Background Controls'!I24","v":0},0,0,0,{"$error":"#DIV/0!"},{"$error":"#DIV/0!"},{"$error":"#DIV/0!"},{"$error":"#DIV/0!"},{"$error":"#DIV/0!"},{"$error":"#DIV/0!"}]
[null,"Total",{"$f":"SUM(C164:C183)","v":0},0,0,{"$error":"#DIV/0!"},{"$error":"#DIV/0!"},{"$error":"#DIV/0!"},{"$error":"#DIV/0!"},{"$error":"#DIV/0!"},{"$error":"#DIV/0!"}]
[]
[]
[]
["Community Greenhouse Gas Inventory Tool"]

{"sheet":"Electricity MarketBased-Calcs","index":25,"n_rows":342,"n_cols":9,"rows_kept":342,"cut":false,"hidden":false,"merged":[[17,1,17,5],[61,1,61,4],[341,0,341,12]]}
["Market-based Electricity Use - Calculation & Summary "]
["Jump to…"]
["GHG Summary"]
["Emissions by Sector"]
["Electricity Summary"]
["Electricity Use by Sector"]
["Background Calculations"]
["CO2 emissions by contractual instrument"]
["CH4 emissions by contractual instrument"]
["N2O emissions by contractual instrument"]
["Activity data by sector and utility"]
["CO2 emissions by sector and utility"]
["CH4 emissions by sector and utility"]
["N2O emissions by sector and utility"]
[]
["GHG Summary"]
[]
[null,"Emissions by Sector (in MT CO2e)"]
[null,null,"CO2","CH4","N2O","Total"]
["Dstart",{"$f":"'Background Controls'!I5","v":"Residential"},{"$f":"IF(ISNA(VLOOKUP($B20, elec_calcs_deptCO2_contractual, 8, FALSE)),0, VLOOKUP($B20, elec_calcs_deptCO2_contractual, 8, FALSE))+IF(ISNA(VLOOKUP($B20, elec_calc_deptCO2_location_adjusted, 8, FALSE)),0, VLOOKUP($B20, elec_calc_deptCO2_location_adjusted, 8, FALSE))","v":0},{"$f":"IF(ISNA(VLOOKUP($B20, elec_calcs_deptCH4_contractual, 8, FALSE)),0, VLOOKUP($B20, elec_calcs_deptCH4_contractual, 8, FALSE))+IF(ISNA(VLOOKUP($B20, elec_calc_deptCH4_location_adjusted, 8, FALSE)),0, VLOOKUP($B20, elec_calc_deptCH4_location_adjusted, 8, FALSE))","v":0},{"$f":"IF(ISNA(VLOOKUP($B20, elec_calcs_deptN2O_contractual, 8, FALSE)),0, VLOOKUP($B20, elec_calcs_deptN2O_contractual, 8, FALSE))+IF(ISNA(VLOOKUP($B20, elec_calc_deptN2O_location_adjusted, 8, FALSE)),0, VLOOKUP($B20, elec_calc_deptN2O_location_adjusted, 8, FALSE))","v":0},{"$f":"SUM(C20:E20)","v":0}]
[null,{"$f":"'Background Controls'!I6","v":"Commercial/Institutional"},{"$f":"IF(ISNA(VLOOKUP($B21, elec_calcs_deptCO2_contractual, 8, FALSE)),0, VLOOKUP($B21, elec_calcs_deptCO2_contractual, 8, FALSE))+IF(ISNA(VLOOKUP($B21, elec_calc_deptCO2_location_adjusted, 8, FALSE)),0, VLOOKUP($B21, elec_calc_deptCO2_location_adjusted, 8, FALSE))","v":0},0,0,{"$f":"SUM(C21:E21)","v":0}]
[null,{"$f":"'Background Controls'!I7","v":"Industrial"},0,0,0,0]
[null,{"$f":"'Background Controls'!I8","v":"Energy Generation"},0,0,0,0]
[null,{"$f":"'Background Controls'!I9","v":0},0,0,0,0]
[null,{"$f":"'Background Controls'!I10","v":0},0,0,0,0]
[null,{"$f":"'Background Controls'!I11","v":0},0,0,0,0]
[null,{"$f":"'Background Controls'!I12","v":0},0,0,0,0]
[null,{"$f":"'Background Controls'!I13","v":0},0,0,0,0]
[null,{"$f":"'Background Controls'!I14","v":0},0,0,0,0]
[null,{"$f":"'Background Controls'!I15","v":0},0,0,0,0]
[null,{"$f":"'Background Controls'!I16","v":0},0,0,0,0]
[null,{"$f":"'Background Controls'!I17","v":0},0,0,0,0]
[null,{"$f":"'Background Controls'!I18","v":0},0,0,0,0]
[null,{"$f":"'Background Controls'!I19","v":0},0,0,0,0]
[null,{"$f":"'Background Controls'!I20","v":0},0,0,0,0]
[null,{"$f":"'Background Controls'!I21","v":0},0,0,0,0]
[null,{"$f":"'Background Controls'!I22","v":0},0,0,0,0]
[null,{"$f":"'Background Controls'!I23","v":0},0,0,0,0]
[null,{"$f":"'Background Controls'!I24","v":0},0,0,0,0]
[null,"Total Emissions from Electricity Use",{"$f":"SUM(C20:C39)","v":0},{"$f":"SUM(D20:D39)","v":0},{"$f":"SUM(E20:E39)","v":0},{"$f":"SUM(F20:F39)","v":0}]
[]
[]
[]
[]
[]
[]
[]
[]
[]
[]
[]
[]
[]
[]
[]
[]
[]
[]
[]
["Electricity Summary"]
[]
[null,"Electricity Use by Sector (in kWh)"]
[null,"Sector","Grid-Supplied kWh","Contractual Instrument kWh","Market-Based kWh"]
["Dstart",{"$f":"'Background Controls'!I5","v":"Residential"},{"$f":"SUMIFS(elec_data_consump,elec_data_dept,B64,elec_data_contract_binary,\"No\")","v":0},{"$f":"SUMIFS(elec_data_consump,elec_data_dept,B64,elec_data_contract_binary,\"Yes\")","v":0},{"$f":"C64-D64","v":0}]
[null,{"$f":"'Background Controls'!I6","v":"Commercial/Institutional"},{"$f":"SUMIFS(elec_data_consump,elec_data_dept,B65,elec_data_contract_binary,\"No\")","v":0},{"$f":"SUMIFS(elec_data_consump,elec_data_dept,B65,elec_data_contract_binary,\"Yes\")","v":0},{"$f":"C65-D65","v":0}]
[null,{"$f":"'Background Controls'!I7","v":"Industrial"},0,0,{"$f":"C66-D66","v":0}]
[null,{"$f":"'Background Controls'!I8","v":"Energy Generation"},0,0,{"$f":"SUMIF(elec_data_dept, C67, elec_data_consump)","v":0}]
[null,{"$f":"'Background Controls'!I9","v":0},0,0,0]
[null,{"$f":"'Background Controls'!I10","v":0},0,0,0]
[null,{"$f":"'Background Controls'!I11","v":0},0,0,0]
[null,{"$f":"'Background Controls'!I12","v":0},0,0,0]
[null,{"$f":"'Background Controls'!I13","v":0},0,0,0]
[null,{"$f":"'Background Controls'!I14","v":0},0,0,0]
[null,{"$f":"'Background Controls'!I15","v":0},0,0,0]
[null,{"$f":"'Background Controls'!I16","v":0},0,0,0]
[null,{"$f":"'Background Controls'!I17","v":0},0,0,0]
[null,{"$f":"'Background Controls'!I18","v":0},0,0,0]
[null,{"$f":"'Background Controls'!I19","v":0},0,0,0]
[null,{"$f":"'Background Controls'!I20","v":0},0,0,0]
[null,{"$f":"'Background Controls'!I21","v":0},0,0,0]
[null,{"$f":"'Background Controls'!I22","v":0},0,0,0]
[null,{"$f":"'Background Controls'!I23","v":0},0,0,0]
[null,{"$f":"'Background Controls'!I24","v":0},0,0,0]
[null,"Total Electricity Use",{"$f":"SUM(C64:C83)","v":0},{"$f":"SUM(D64:D83)","v":0},{"$f":"SUM(E64:E83)","v":0}]
[]
[]
[]
[]
[]
[]
[]
[]
[]
[]
[]
[]
[]
[]
[]
[]
[]
[]
[]
[]
[]
["Background Calculations"]
["Contractual Instrument Calculations"]
["CO2 Emissions by Contractual Instrument "]
["Emissions = Electricity Consumed (kWh) × Contractual Instrument Emissions Factor (lb CO2/MWh) × MWh/kWh × MT/lb × CO2 GWP"]
[null,"Contractual Instrument","kWh","EF (lb CO2/MWh)","MWh/kWh","MT/lb","MT CO2","× GWP =","MT CO2e"]
[null,{"$f":"IF('Background Controls'!$B$73=0,\"-\",'Background Controls'!$B$73)","v":""},{"$f":"SUMIF(elec_data_contract, B111, elec_data_consump)","v":0},{"$f":"IFERROR(VLOOKUP(B111, elec_contract_factors, 2, FALSE),\"-\")","v":"-"},{"$f":"kWh_MWh","v":1E-3},{"$f":"lb_mt","v":4.5359236999999999E-4},{"$f":"IFERROR(C111*D111*E111*F111,\"-\")","v":"-"},{"$f":"CO2_CO2e","v":1},{"$f":"IFERROR(G111*H111,\"-\")","v":"-"}]
[null,{"$f":"IF('Background Controls'!$B$74=0,\"-\",'Background Controls'!$B$74)","v":""},0,"-",1E-3,4.5359236999999999E-4,"-",1,"-"]
[null,{"$f":"IF('Background Controls'!$B$75=0,\"-\",'Background Controls'!$B$75)","v":""},0,"-",1E-3,4.5359236999999999E-4,{"$f":"IFERROR(C113*D113*E113*F113,\"-\")","v":"-"},1,{"$f":"IFERROR(G113*H113,\"-\")","v":"-"}]
[null,{"$f":"IF('Background Controls'!$B$76=0,\"-\",'Background Controls'!$B$76)","v":""},0,"-",1E-3,4.5359236999999999E-4,"-",1,"-"]
[null,{"$f":"IF('Background Controls'!$B$77=0,\"-\",'Background Controls'!$B$77)","v":""},0,"-",1E-3,4.5359236999999999E-4,"-",1,"-"]
[null,{"$f":"IF('Background Controls'!$B$78=0,\"-\",'Background Controls'!$B$78)","v":""},0,"-",1E-3,4.5359236999999999E-4,"-",1,"-"]
[]
["CH4 Emissions by Contractual Instrument"]
["Emissions = Electricity Consumed (kWh) × Contractual Instrument Emissions Factor (lb CH4/MWh) × MWh/kWh × MT/lb × CH4 GWP"]
[null,"Contractual Instrument","kWh","EF (lb CH4/MWh)","MWh/kWh","MT/lb","MT CH4","× GWP =","MT CO2e"]
[null,{"$f":"IF('Background Controls'!$B$73=0,\"-\",'Background Controls'!$B$73)","v":""},{"$f":"SUMIF(elec_data_contract, B121, elec_data_consump)","v":0},{"$f":"IFERROR(VLOOKUP(B121, elec_contract_factors, 3, FALSE),\"-\")","v":"-"},{"$f":"kWh_MWh","v":1E-3},{"$f":"lb_mt","v":4.5359236999999999E-4},{"$f":"IFERROR(C121*D121*E121*F121,\"-\")","v":"-"},{"$f":"CH4_CO2e","v":28},{"$f":"IFERROR(G121*H121,\"-\")","v":"-"}]
[null,{"$f":"IF('Background Controls'!$B$74=0,\"-\",'Background Controls'!$B$74)","v":""},0,"-",1E-3,4.5359236999999999E-4,"-",28,"-"]
[null,{"$f":"IF('Background Controls'!$B$75=0,\"-\",'Background Controls'!$B$75)","v":""},0,"-",1E-3,4.5359236999999999E-4,"-",28,"-"]
[null,{"$f":"IF('Background Controls'!$B$76=0,\"-\",'Background Controls'!$B$76)","v":""},0,"-",1E-3,4.5359236999999999E-4,"-",28,"-"]
[null,{"$f":"IF('Background Controls'!$B$77=0,\"-\",'Background Controls'!$B$77)","v":""},0,"-",1E-3,4.5359236999999999E-4,"-",28,"-"]
[null,{"$f":"IF('Background Controls'!$B$78=0,\"-\",'Background Controls'!$B$78)","v":""},0,"-",1E-3,4.5359236999999999E-4,"-",28,"-"]
[]
["N2O Emissions by Contractual Instrument"]
["Emissions = Electricity Consumed (kWh) × Contractual Instrument Emissions Factor (lb N2O/MWh) × MWh/kWh × MT/lb × N2O GWP"]
[null,"Contractual Instrument","kWh","EF (lb N2O/MWh)","MWh/kWh","MT/lb","MT N2O","× GWP =","MT CO2e"]
[null,{"$f":"IF('Background Controls'!$B$73=0,\"-\",'Background Controls'!$B$73)","v":""},{"$f":"SUMIF(elec_data_contract, B131, elec_data_consump)","v":0},{"$f":"IFERROR(VLOOKUP(B131, elec_contract_factors, 4, FALSE),\"-\")","v":"-"},{"$f":"kWh_MWh","v":1E-3},{"$f":"lb_mt","v":4.5359236999999999E-4},{"$f":"IFERROR(C131*D131*E131*F131,\"-\")","v":"-"},{"$f":"N2O_CO2e","v":265},{"$f":"IFERROR(G131*H131,\"-\")","v":"-"}]
[null,{"$f":"IF('Background Controls'!$B$74=0,\"-\",'Background Controls'!$B$74)","v":""},0,"-",1E-3,4.5359236999999999E-4,"-",265,"-"]
[null,{"$f":"IF('Background Controls'!$B$75=0,\"-\",'Background Controls'!$B$75)","v":""},0,"-",1E-3,4.5359236999999999E-4,"-",265,"-"]
[null,{"$f":"IF('Background Controls'!$B$76=0,\"-\",'Background Controls'!$B$76)","v":""},0,"-",1E-3,4.5359236999999999E-4,"-",265,"-"]
[null,{"$f":"IF('Background Controls'!$B$77=0,\"-\",'Background Controls'!$B$77)","v":""},0,"-",1E-3,4.5359236999999999E-4,"-",265,"-"]
[null,{"$f":"IF('Background Controls'!$B$78=0,\"-\",'Background Controls'!$B$78)","v":""},0,"-",1E-3,4.5359236999999999E-4,"-",265,"-"]
[]
["Activity Data by Sector and Contractual Instrument"]
["Electricity use data by sector and fuel type (kWh)"]
[null,"Sector",{"$f":"IF('Background Controls'!$B$73=0,\"-\",'Background Controls'!$B$73)","v":""},{"$f":"IF('Background Controls'!$B$74=0,\"-\",'Background Controls'!$B$74)","v":""},{"$f":"IF('Background Controls'!$B$75=0,\"-\",'Background Controls'!$B$75)","v":""},{"$f":"IF('Background Controls'!$B$76=0,\"-\",'Background Controls'!$B$76)","v":""},{"$f":"IF('Background Controls'!$B$77=0,\"-\",'Background Controls'!$B$77)","v":""},{"$f":"IF('Background Controls'!$B$78=0,\"-\",'Background Controls'!$B$78)","v":""},"TOTAL"]
["Dstart",{"$f":"'Background Controls'!I5","v":"Residential"},{"$f":"SUMIFS(elec_data_consump, elec_data_dept, $B141, elec_data_contract, C$140)","v":0},{"$f":"SUMIFS(elec_data_consump, elec_data_dept, $B141, elec_data_contract, D$140)","v":0},{"$f":"SUMIFS(elec_data_consump, elec_data_dept, $B141, elec_data_contract, E$140)","v":0},0,0,0,{"$f":"SUM(C141:H141)","v":0}]
[null,{"$f":"'Background Controls'!I6","v":"Commercial/Institutional"},0,0,0,0,0,0,0]
[null,{"$f":"'Background Controls'!I7","v":"Industrial"},0,0,0,0,0,0,0]
[null,{"$f":"'Background Controls'!I8","v":"Energy Generation"},0,0,0,0,0,0,0]
[null,{"$f":"'Background Controls'!I9","v":0},0,0,0,0,0,0,0]
[null,{"$f":"'Background Controls'!I10","v":0},{"$f":"SUMIFS(elec_data_consump, elec_data_dept, $B146, elec_data_contract, C$140)","v":0},0,0,0,0,0,0]
[null,{"$f":"'Background Controls'!I11","v":0},0,0,0,0,0,0,0]
[null,{"$f":"'Background Controls'!I12","v":0},0,0,0,0,0,0,0]
[null,{"$f":"'Background Controls'!I13","v":0},0,0,0,0,0,0,0]
[null,{"$f":"'Background Controls'!I14","v":0},0,0,0,0,0,0,0]
[null,{"$f":"'Background Controls'!I15","v":0},{"$f":"SUMIFS(elec_data_consump, elec_data_dept, $B151, elec_data_contract, C$140)","v":0},0,0,0,0,0,0]
[null,{"$f":"'Background Controls'!I16","v":0},0,0,0,0,0,0,0]
[null,{"$f":"'Background Controls'!I17","v":0},0,0,0,0,0,0,0]
[null,{"$f":"'Background Controls'!I18","v":0},0,0,0,0,0,0,0]
[null,{"$f":"'Background Controls'!I19","v":0},0,0,0,0,0,0,0]
[null,{"$f":"'Background Controls'!I20","v":0},0,0,0,0,0,0,0]
[null,{"$f":"'Background Controls'!I21","v":0},0,0,0,0,0,0,0]
[null,{"$f":"'Background Controls'!I22","v":0},0,0,0,0,0,0,0]
[null,{"$f":"'Background Controls'!I23","v":0},0,0,0,0,0,0,0]
[null,{"$f":"'Background Controls'!I24","v":0},0,0,0,0,0,0,0]
[null,"Total",{"$f":"SUM(C141:C160)","v":0},0,0,0,0,0,{"$f":"SUM(I141:I160)","v":0}]
[]
["CO2 Emissions by Sector and Contractual Instrument"]
["Emissions = Electricity Consumed (kWh) × Emissions Factor (lb CO2/MWh) × MWh/kWh × MT/lb × CO2 GWP"]
[null,"Sector",{"$f":"IF('Background Controls'!$B$73=0,\"-\",'Background Controls'!$B$73)","v":""},{"$f":"IF('Background Controls'!$B$74=0,\"-\",'Background Controls'!$B$74)","v":""},{"$f":"IF('Background Controls'!$B$75=0,\"-\",'Background Controls'!$B$75)","v":""},{"$f":"IF('Background Controls'!$B$76=0,\"-\",'Background Controls'!$B$76)","v":""},{"$f":"IF('Background Controls'!$B$77=0,\"-\",'Background Controls'!$B$77)","v":""},{"$f":"IF('Background Controls'!$B$78=0,\"-\",'Background Controls'!$B$78)","v":""},"TOTAL"]
["Dstart",{"$f":"'Background Controls'!I5","v":"Residential"},{"$f":"IFERROR(C141*VLOOKUP(C$165, elec_contract_factors, 2, FALSE)*kWh_MWh*lb_mt*CO2_CO2e,\"-\")","v":"-"},{"$f":"IFERROR(D141*VLOOKUP(D$165, elec_contract_factors, 2, FALSE)*kWh_MWh*lb_mt*CO2_CO2e,\"-\")","v":"-"},"-","-","-","-",{"$f":"SUM(C166:H166)","v":0}]
[null,{"$f":"'Background Controls'!I6","v":"Commercial/Institutional"},"-","-","-","-","-","-",0]
[null,{"$f":"'Background Controls'!I7","v":"Industrial"},"-","-","-","-","-","-",0]
[null,{"$f":"'Background Controls'!I8","v":"Energy Generation"},"-","-","-","-","-","-",0]
[null,{"$f":"'Background Controls'!I9","v":0},"-","-","-","-","-","-",0]
[null,{"$f":"'Background Controls'!I10","v":0},"-","-","-","-","-","-",0]
[null,{"$f":"'Background Controls'!I11","v":0},"-","-","-","-","-","-",0]
[null,{"$f":"'Background Controls'!I12","v":0},"-","-","-","-","-","-",0]
[null,{"$f":"'Background Controls'!I13","v":0},"-","-","-","-","-","-",0]
[null,{"$f":"'Background Controls'!I14","v":0},"-","-","-","-","-","-",0]
[null,{"$f":"'Background Controls'!I15","v":0},{"$f":"IFERROR(C151*VLOOKUP(C$165, elec_contract_factors, 2, FALSE)*kWh_MWh*lb_mt*CO2_CO2e,\"-\")","v":"-"},"-","-","-","-","-",0]
[null,{"$f":"'Background Controls'!I16","v":0},"-","-","-","-","-","-",0]
[null,{"$f":"'Background Controls'!I17","v":0},"-","-","-","-","-","-",0]
[null,{"$f":"'Background Controls'!I18","v":0},"-","-","-","-","-","-",0]
[null,{"$f":"'Background Controls'!I19","v":0},"-","-","-","-","-","-",0]
[null,{"$f":"'Background Controls'!I20","v":0},"-","-","-","-","-","-",0]
[null,{"$f":"'Background Controls'!I21","v":0},"-","-","-","-","-","-",0]
[null,{"$f":"'Background Controls'!I22","v":0},"-","-","-","-","-","-",0]
[null,{"$f":"'Background Controls'!I23","v":0},"-","-","-","-","-","-",0]
[null,{"$f":"'Background Controls'!I24","v":0},"-","-","-","-","-","-",0]
[null,"Total",{"$f":"SUM(C166:C185)","v":0},0,0,0,0,0,{"$f":"SUM(I166:I185)","v":0}]
[]
["CH4 emissions by Sector and Contractual Instrument"]
["Emissions = Electricity Consumed (kWh) ×  Emissions Factor (lb CH4/kWh) × MWh/kWh × MT/lb × CH4 GWP"]
[null,"Sector",{"$f":"IF('Background Controls'!$B$73=0,\"-\",'Background Controls'!$B$73)","v":""},{"$f":"IF('Background Controls'!$B$74=0,\"-\",'Background Controls'!$B$74)","v":""},{"$f":"IF('Background Controls'!$B$75=0,\"-\",'Background Controls'!$B$75)","v":""},{"$f":"IF('Background Controls'!$B$76=0,\"-\",'Background Controls'!$B$76)","v":""},{"$f":"IF('Background Controls'!$B$77=0,\"-\",'Background Controls'!$B$77)","v":""},{"$f":"IF('Background Controls'!$B$78=0,\"-\",'Background Controls'!$B$78)","v":""},"TOTAL"]
["Dstart",{"$f":"'Background Controls'!I5","v":"Residential"},{"$f":"IFERROR(C141*VLOOKUP(C$165, elec_contract_factors,3, FALSE)*kWh_MWh*lb_mt*CH4_CO2e,\"-\")","v":"-"},"-","-","-","-","-",{"$f":"SUM(C191:H191)","v":0}]
[null,{"$f":"'Background Controls'!I6","v":"Commercial/Institutional"},"-","-","-","-","-","-",0]
[null,{"$f":"'Background Controls'!I7","v":"Industrial"},"-","-","-","-","-","-",0]
[null,{"$f":"'Background Controls'!I8","v":"Energy Generation"},"-","-","-","-","-","-",0]
[null,{"$f":"'Background Controls'!I9","v":0},"-","-","-","-","-","-",0]
[null,{"$f":"'Background Controls'!I10","v":0},"-","-","-","-","-","-",0]
[null,{"$f":"'Background Controls'!I11","v":0},"-","-","-","-","-","-",0]
[null,{"$f":"'Background Controls'!I12","v":0},"-","-","-","-","-","-",0]
[null,{"$f":"'Background Controls'!I13","v":0},"-","-","-","-","-","-",0]
[null,{"$f":"'Background Controls'!I14","v":0},"-","-","-","-","-","-",0]
[null,{"$f":"'Background Controls'!I15","v":0},{"$f":"IFERROR(C151*VLOOKUP(C$165, elec_contract_factors,3, FALSE)*kWh_MWh*lb_mt*CH4_CO2e,\"-\")","v":"-"},"-","-","-","-","-",0]
[null,{"$f":"'Background Controls'!I16","v":0},"-","-","-","-","-","-",0]
[null,{"$f":"'Background Controls'!I17","v":0},"-","-","-","-","-","-",0]
[null,{"$f":"'Background Controls'!I18","v":0},"-","-","-","-","-","-",0]
[null,{"$f":"'Background Controls'!I19","v":0},"-","-","-","-","-","-",0]
[null,{"$f":"'Background Controls'!I20","v":0},"-","-","-","-","-","-",0]
[null,{"$f":"'Background Controls'!I21","v":0},"-","-","-","-","-","-",0]
[null,{"$f":"'Background Controls'!I22","v":0},"-","-","-","-","-","-",0]
[null,{"$f":"'Background Controls'!I23","v":0},"-","-","-","-","-","-",0]
[null,{"$f":"'Background Controls'!I24","v":0},"-","-","-","-","-","-",0]
[null,"Total",{"$f":"SUM(C191:C210)","v":0},0,0,0,0,0,{"$f":"SUM(I191:I210)","v":0}]
[]
["N2O emissions by Sector and Contractual Instrument"]
["Emissions = Electricity Consumed (kWh) × Emissions Factor (lb N2O/kWh) × MWh/kWh × MT/lb × N2O GWP"]
[null,"Sector",{"$f":"IF('Background Controls'!$B$73=0,\"-\",'Background Controls'!$B$73)","v":""},{"$f":"IF('Background Controls'!$B$74=0,\"-\",'Background Controls'!$B$74)","v":""},{"$f":"IF('Background Controls'!$B$75=0,\"-\",'Background Controls'!$B$75)","v":""},{"$f":"IF('Background Controls'!$B$76=0,\"-\",'Background Controls'!$B$76)","v":""},{"$f":"IF('Background Controls'!$B$77=0,\"-\",'Background Controls'!$B$77)","v":""},{"$f":"IF('Background Controls'!$B$78=0,\"-\",'Background Controls'!$B$78)","v":""},"TOTAL"]
["Dstart",{"$f":"'Background Controls'!I5","v":"Residential"},{"$f":"IFERROR(C141*VLOOKUP(C$165, elec_contract_factors,4, FALSE)*kWh_MWh*lb_mt*N2O_CO2e,\"-\")","v":"-"},{"$f":"IFERROR(D141*VLOOKUP(D$165, elec_contract_factors,4, FALSE)*kWh_MWh*lb_mt*N2O_CO2e,\"-\")","v":"-"},"-","-","-","-",{"$f":"SUM(C216:H216)","v":0}]
[null,{"$f":"'Background Controls'!I6","v":"Commercial/Institutional"},{"$f":"IFERROR(C142*VLOOKUP(C$165, elec_contract_factors,4, FALSE)*kWh_MWh*lb_mt*N2O_CO2e,\"-\")","v":"-"},"-","-","-","-","-",0]
[null,{"$f":"'Background Controls'!I7","v":"Industrial"},"-","-","-","-","-","-",0]
[null,{"$f":"'Background Controls'!I8","v":"Energy Generation"},"-","-","-","-","-","-",0]
[null,{"$f":"'Background Controls'!I9","v":0},"-","-","-","-","-","-",0]
[null,{"$f":"'Background Controls'!I10","v":0},"-","-","-","-","-","-",0]
[null,{"$f":"'Background Controls'!I11","v":0},"-","-","-","-","-","-",0]
[null,{"$f":"'Background Controls'!I12","v":0},"-","-","-","-","-","-",0]
[null,{"$f":"'Background Controls'!I13","v":0},"-","-","-","-","-","-",0]
[null,{"$f":"'Background Controls'!I14","v":0},{"$f":"IFERROR(C150*VLOOKUP(C$165, elec_contract_factors,4, FALSE)*kWh_MWh*lb_mt*N2O_CO2e,\"-\")","v":"-"},"-","-","-","-","-",0]
[null,{"$f":"'Background Controls'!I15","v":0},{"$f":"IFERROR(C151*VLOOKUP(C$165, elec_contract_factors,4, FALSE)*kWh_MWh*lb_mt*N2O_CO2e,\"-\")","v":"-"},"-","-","-","-","-",0]
[null,{"$f":"'Background Controls'!I16","v":0},"-","-","-","-","-","-",0]
[null,{"$f":"'Background Controls'!I17","v":0},"-","-","-","-","-","-",0]
[null,{"$f":"'Background Controls'!I18","v":0},"-","-","-","-","-","-",0]
[null,{"$f":"'Background Controls'!I19","v":0},"-","-","-","-","-","-",0]
[null,{"$f":"'Background Controls'!I20","v":0},"-","-","-","-","-","-",0]
[null,{"$f":"'Background Controls'!I21","v":0},"-","-","-","-","-","-",0]
[null,{"$f":"'Background Controls'!I22","v":0},"-","-","-","-","-","-",0]
[null,{"$f":"'Background Controls'!I23","v":0},"-","-","-","-","-","-",0]
[null,{"$f":"'Background Controls'!I24","v":0},"-","-","-","-","-","-",0]
[null,"Total",{"$f":"SUM(C216:C235)","v":0},0,0,0,0,0,{"$f":"SUM(I216:I235)","v":0}]
[]
["Market-Based Calculations"]
[]
["Activity Data by Sector and Utility"]
["Electricity use data by sector and fuel type (kWh) with electricity from contractual instruments removed"]
[null,"Sector",{"$f":"IF('Background Controls'!$B$62=0,\"-\",'Background Controls'!$B$62)","v":"AKGD eGRID subregion"},{"$f":"IF('Background Controls'!$B$63=0,\"-\",'Background Controls'!$B$63)","v":"-"},{"$f":"IF('Background Controls'!$B$64=0,\"-\",'Background Controls'!$B$64)","v":"-"},{"$f":"IF('Background Controls'!$B$65=0,\"-\",'Background Controls'!$B$65)","v":"-"},{"$f":"IF('Background Controls'!$B$66=0,\"-\",'Background Controls'!$B$66)","v":"-"},{"$f":"IF('Background Controls'!$B$67=0,\"-\",'Background Controls'!$B$67)","v":"-"},"TOTAL"]
["Dstart",{"$f":"'Background Controls'!I5","v":"Residential"},{"$f":"IFERROR('Electricity LocationBased-Calcs'!C141-$I141*'Electricity LocationBased-Calcs'!C141/'Electricity LocationBased-Calcs'!$I141,0)","v":0},{"$f":"IFERROR('Electricity LocationBased-Calcs'!D141-$I141*'Electricity LocationBased-Calcs'!D141/'Electricity LocationBased-Calcs'!$I141,0)","v":0},{"$f":"IFERROR('Electricity LocationBased-Calcs'!E141-$I141*'Electricity LocationBased-Calcs'!E141/'Electricity LocationBased-Calcs'!$I141,0)","v":0},{"$f":"IFERROR('Electricity LocationBased-Calcs'!F141-$I141*'Electricity LocationBased-Calcs'!F141/'Electricity LocationBased-Calcs'!$I141,0)","v":0},{"$f":"IFERROR('Electricity LocationBased-Calcs'!G141-$I141*'Electricity LocationBased-Calcs'!G141/'Electricity LocationBased-Calcs'!$I141,0)","v":0},{"$f":"IFERROR('Electricity LocationBased-Calcs'!H141-$I141*'Electricity LocationBased-Calcs'!H141/'Electricity LocationBased-Calcs'!$I141,0)","v":0},{"$f":"SUM(C243:H243)","v":0}]
[null,{"$f":"'Background Controls'!I6","v":"Commercial/Institutional"},{"$f":"IFERROR('Electricity LocationBased-Calcs'!C142-$I142*'Electricity LocationBased-Calcs'!C142/'Electricity LocationBased-Calcs'!$I142,0)","v":0},{"$f":"IFERROR('Electricity LocationBased-Calcs'!D142-$I142*'Electricity LocationBased-Calcs'!D142/'Electricity LocationBased-Calcs'!$I142,0)","v":0},{"$f":"IFERROR('Electricity LocationBased-Calcs'!E142-$I142*'Electricity LocationBased-Calcs'!E142/'Electricity LocationBased-Calcs'!$I142,0)","v":0},{"$f":"IFERROR('Electricity LocationBased-Calcs'!F142-$I142*'Electricity LocationBased-Calcs'!F142/'Electricity LocationBased-Calcs'!$I142,0)","v":0},{"$f":"IFERROR('Electricity LocationBased-Calcs'!G142-$I142*'Electricity LocationBased-Calcs'!G142/'Electricity LocationBased-Calcs'!$I142,0)","v":0},{"$f":"IFERROR('Electricity LocationBased-Calcs'!H142-$I142*'Electricity LocationBased-Calcs'!H142/'Electricity LocationBased-Calcs'!$I142,0)","v":0},{"$f":"SUM(C244:H244)","v":0}]
[null,{"$f":"'Background Controls'!I7","v":"Industrial"},{"$f":"IFERROR('Electricity LocationBased-Calcs'!C143-$I143*'Electricity LocationBased-Calcs'!C143/'Electricity LocationBased-Calcs'!$I143,0)","v":0},{"$f":"IFERROR('Electricity LocationBased-Calcs'!D143-$I143*'Electricity LocationBased-Calcs'!D143/'Electricity LocationBased-Calcs'!$I143,0)","v":0},{"$f":"IFERROR('Electricity LocationBased-Calcs'!E143-$I143*'Electricity LocationBased-Calcs'!E143/'Electricity LocationBased-Calcs'!$I143,0)","v":0},{"$f":"IFERROR('Electricity LocationBased-Calcs'!F143-$I143*'Electricity LocationBased-Calcs'!F143/'Electricity LocationBased-Calcs'!$I143,0)","v":0},{"$f":"IFERROR('Electricity LocationBased-Calcs'!G143-$I143*'Electricity LocationBased-Calcs'!G143/'Electricity LocationBased-Calcs'!$I143,0)","v":0},{"$f":"IFERROR('Electricity LocationBased-Calcs'!H143-$I143*'Electricity LocationBased-Calcs'!H143/'Electricity LocationBased-Calcs'!$I143,0)","v":0},0]
[null,{"$f":"'Background Controls'!I8","v":"Energy Generation"},{"$f":"IFERROR('Electricity LocationBased-Calcs'!C144-$I144*'Electricity LocationBased-Calcs'!C144/'Electricity LocationBased-Calcs'!$I144,0)","v":0},{"$f":"IFERROR('Electricity LocationBased-Calcs'!D144-$I144*'Electricity LocationBased-Calcs'!D144/'Electricity LocationBased-Calcs'!$I144,0)","v":0},{"$f":"IFERROR('Electricity LocationBased-Calcs'!E144-$I144*'Electricity LocationBased-Calcs'!E144/'Electricity LocationBased-Calcs'!$I144,0)","v":0},{"$f":"IFERROR('Electricity LocationBased-Calcs'!F144-$I144*'Electricity LocationBased-Calcs'!F144/'Electricity LocationBased-Calcs'!$I144,0)","v":0},{"$f":"IFERROR('Electricity LocationBased-Calcs'!G144-$I144*'Electricity LocationBased-Calcs'!G144/'Electricity LocationBased-Calcs'!$I144,0)","v":0},{"$f":"IFERROR('Electricity LocationBased-Calcs'!H144-$I144*'Electricity LocationBased-Calcs'!H144/'Electricity LocationBased-Calcs'!$I144,0)","v":0},0]
[null,{"$f":"'Background Controls'!I9","v":0},{"$f":"IFERROR('Electricity LocationBased-Calcs'!C145-$I145*'Electricity LocationBased-Calcs'!C145/'Electricity LocationBased-Calcs'!$I145,0)","v":0},{"$f":"IFERROR('Electricity LocationBased-Calcs'!D145-$I145*'Electricity LocationBased-Calcs'!D145/'Electricity LocationBased-Calcs'!$I145,0)","v":0},{"$f":"IFERROR('Electricity LocationBased-Calcs'!E145-$I145*'Electricity LocationBased-Calcs'!E145/'Electricity LocationBased-Calcs'!$I145,0)","v":0},{"$f":"IFERROR('Electricity LocationBased-Calcs'!F145-$I145*'Electricity LocationBased-Calcs'!F145/'Electricity LocationBased-Calcs'!$I145,0)","v":0},{"$f":"IFERROR('Electricity LocationBased-Calcs'!G145-$I145*'Electricity LocationBased-Calcs'!G145/'Electricity LocationBased-Calcs'!$I145,0)","v":0},{"$f":"IFERROR('Electricity LocationBased-Calcs'!H145-$I145*'Electricity LocationBased-Calcs'!H145/'Electricity LocationBased-Calcs'!$I145,0)","v":0},0]
[null,{"$f":"'Background Controls'!I10","v":0},{"$f":"IFERROR('Electricity LocationBased-Calcs'!C146-$I146*'Electricity LocationBased-Calcs'!C146/'Electricity LocationBased-Calcs'!$I146,0)","v":0},{"$f":"IFERROR('Electricity LocationBased-Calcs'!D146-$I146*'Electricity LocationBased-Calcs'!D146/'Electricity LocationBased-Calcs'!$I146,0)","v":0},{"$f":"IFERROR('Electricity LocationBased-Calcs'!E146-$I146*'Electricity LocationBased-Calcs'!E146/'Electricity LocationBased-Calcs'!$I146,0)","v":0},{"$f":"IFERROR('Electricity LocationBased-Calcs'!F146-$I146*'Electricity LocationBased-Calcs'!F146/'Electricity LocationBased-Calcs'!$I146,0)","v":0},{"$f":"IFERROR('Electricity LocationBased-Calcs'!G146-$I146*'Electricity LocationBased-Calcs'!G146/'Electricity LocationBased-Calcs'!$I146,0)","v":0},{"$f":"IFERROR('Electricity LocationBased-Calcs'!H146-$I146*'Electricity LocationBased-Calcs'!H146/'Electricity LocationBased-Calcs'!$I146,0)","v":0},0]
[null,{"$f":"'Background Controls'!I11","v":0},{"$f":"IFERROR('Electricity LocationBased-Calcs'!C147-$I147*'Electricity LocationBased-Calcs'!C147/'Electricity LocationBased-Calcs'!$I147,0)","v":0},{"$f":"IFERROR('Electricity LocationBased-Calcs'!D147-$I147*'Electricity LocationBased-Calcs'!D147/'Electricity LocationBased-Calcs'!$I147,0)","v":0},{"$f":"IFERROR('Electricity LocationBased-Calcs'!E147-$I147*'Electricity LocationBased-Calcs'!E147/'Electricity LocationBased-Calcs'!$I147,0)","v":0},{"$f":"IFERROR('Electricity LocationBased-Calcs'!F147-$I147*'Electricity LocationBased-Calcs'!F147/'Electricity LocationBased-Calcs'!$I147,0)","v":0},{"$f":"IFERROR('Electricity LocationBased-Calcs'!G147-$I147*'Electricity LocationBased-Calcs'!G147/'Electricity LocationBased-Calcs'!$I147,0)","v":0},{"$f":"IFERROR('Electricity LocationBased-Calcs'!H147-$I147*'Electricity LocationBased-Calcs'!H147/'Electricity LocationBased-Calcs'!$I147,0)","v":0},0]
[null,{"$f":"'Background Controls'!I12","v":0},{"$f":"IFERROR('Electricity LocationBased-Calcs'!C148-$I148*'Electricity LocationBased-Calcs'!C148/'Electricity LocationBased-Calcs'!$I148,0)","v":0},{"$f":"IFERROR('Electricity LocationBased-Calcs'!D148-$I148*'Electricity LocationBased-Calcs'!D148/'Electricity LocationBased-Calcs'!$I148,0)","v":0},{"$f":"IFERROR('Electricity LocationBased-Calcs'!E148-$I148*'Electricity LocationBased-Calcs'!E148/'Electricity LocationBased-Calcs'!$I148,0)","v":0},{"$f":"IFERROR('Electricity LocationBased-Calcs'!F148-$I148*'Electricity LocationBased-Calcs'!F148/'Electricity LocationBased-Calcs'!$I148,0)","v":0},{"$f":"IFERROR('Electricity LocationBased-Calcs'!G148-$I148*'Electricity LocationBased-Calcs'!G148/'Electricity LocationBased-Calcs'!$I148,0)","v":0},{"$f":"IFERROR('Electricity LocationBased-Calcs'!H148-$I148*'Electricity LocationBased-Calcs'!H148/'Electricity LocationBased-Calcs'!$I148,0)","v":0},0]
[null,{"$f":"'Background Controls'!I13","v":0},{"$f":"IFERROR('Electricity LocationBased-Calcs'!C149-$I149*'Electricity LocationBased-Calcs'!C149/'Electricity LocationBased-Calcs'!$I149,0)","v":0},{"$f":"IFERROR('Electricity LocationBased-Calcs'!D149-$I149*'Electricity LocationBased-Calcs'!D149/'Electricity LocationBased-Calcs'!$I149,0)","v":0},{"$f":"IFERROR('Electricity LocationBased-Calcs'!E149-$I149*'Electricity LocationBased-Calcs'!E149/'Electricity LocationBased-Calcs'!$I149,0)","v":0},{"$f":"IFERROR('Electricity LocationBased-Calcs'!F149-$I149*'Electricity LocationBased-Calcs'!F149/'Electricity LocationBased-Calcs'!$I149,0)","v":0},{"$f":"IFERROR('Electricity LocationBased-Calcs'!G149-$I149*'Electricity LocationBased-Calcs'!G149/'Electricity LocationBased-Calcs'!$I149,0)","v":0},{"$f":"IFERROR('Electricity LocationBased-Calcs'!H149-$I149*'Electricity LocationBased-Calcs'!H149/'Electricity LocationBased-Calcs'!$I149,0)","v":0},0]
[null,{"$f":"'Background Controls'!I14","v":0},{"$f":"IFERROR('Electricity LocationBased-Calcs'!C150-$I150*'Electricity LocationBased-Calcs'!C150/'Electricity LocationBased-Calcs'!$I150,0)","v":0},{"$f":"IFERROR('Electricity LocationBased-Calcs'!D150-$I150*'Electricity LocationBased-Calcs'!D150/'Electricity LocationBased-Calcs'!$I150,0)","v":0},{"$f":"IFERROR('Electricity LocationBased-Calcs'!E150-$I150*'Electricity LocationBased-Calcs'!E150/'Electricity LocationBased-Calcs'!$I150,0)","v":0},{"$f":"IFERROR('Electricity LocationBased-Calcs'!F150-$I150*'Electricity LocationBased-Calcs'!F150/'Electricity LocationBased-Calcs'!$I150,0)","v":0},{"$f":"IFERROR('Electricity LocationBased-Calcs'!G150-$I150*'Electricity LocationBased-Calcs'!G150/'Electricity LocationBased-Calcs'!$I150,0)","v":0},{"$f":"IFERROR('Electricity LocationBased-Calcs'!H150-$I150*'Electricity LocationBased-Calcs'!H150/'Electricity LocationBased-Calcs'!$I150,0)","v":0},0]
[null,{"$f":"'Background Controls'!I15","v":0},{"$f":"IFERROR('Electricity LocationBased-Calcs'!C151-$I151*'Electricity LocationBased-Calcs'!C151/'Electricity LocationBased-Calcs'!$I151,0)","v":0},{"$f":"IFERROR('Electricity LocationBased-Calcs'!D151-$I151*'Electricity LocationBased-Calcs'!D151/'Electricity LocationBased-Calcs'!$I151,0)","v":0},{"$f":"IFERROR('Electricity LocationBased-Calcs'!E151-$I151*'Electricity LocationBased-Calcs'!E151/'Electricity LocationBased-Calcs'!$I151,0)","v":0},{"$f":"IFERROR('Electricity LocationBased-Calcs'!F151-$I151*'Electricity LocationBased-Calcs'!F151/'Electricity LocationBased-Calcs'!$I151,0)","v":0},{"$f":"IFERROR('Electricity LocationBased-Calcs'!G151-$I151*'Electricity LocationBased-Calcs'!G151/'Electricity LocationBased-Calcs'!$I151,0)","v":0},{"$f":"IFERROR('Electricity LocationBased-Calcs'!H151-$I151*'Electricity LocationBased-Calcs'!H151/'Electricity LocationBased-Calcs'!$I151,0)","v":0},0]
[null,{"$f":"'Background Controls'!I16","v":0},{"$f":"IFERROR('Electricity LocationBased-Calcs'!C152-$I152*'Electricity LocationBased-Calcs'!C152/'Electricity LocationBased-Calcs'!$I152,0)","v":0},{"$f":"IFERROR('Electricity LocationBased-Calcs'!D152-$I152*'Electricity LocationBased-Calcs'!D152/'Electricity LocationBased-Calcs'!$I152,0)","v":0},{"$f":"IFERROR('Electricity LocationBased-Calcs'!E152-$I152*'Electricity LocationBased-Calcs'!E152/'Electricity LocationBased-Calcs'!$I152,0)","v":0},{"$f":"IFERROR('Electricity LocationBased-Calcs'!F152-$I152*'Electricity LocationBased-Calcs'!F152/'Electricity LocationBased-Calcs'!$I152,0)","v":0},{"$f":"IFERROR('Electricity LocationBased-Calcs'!G152-$I152*'Electricity LocationBased-Calcs'!G152/'Electricity LocationBased-Calcs'!$I152,0)","v":0},{"$f":"IFERROR('Electricity LocationBased-Calcs'!H152-$I152*'Electricity LocationBased-Calcs'!H152/'Electricity LocationBased-Calcs'!$I152,0)","v":0},0]
[null,{"$f":"'Background Controls'!I17","v":0},{"$f":"IFERROR('Electricity LocationBased-Calcs'!C153-$I153*'Electricity LocationBased-Calcs'!C153/'Electricity LocationBased-Calcs'!$I153,0)","v":0},{"$f":"IFERROR('Electricity LocationBased-Calcs'!D153-$I153*'Electricity LocationBased-Calcs'!D153/'Electricity LocationBased-Calcs'!$I153,0)","v":0},{"$f":"IFERROR('Electricity LocationBased-Calcs'!E153-$I153*'Electricity LocationBased-Calcs'!E153/'Electricity LocationBased-Calcs'!$I153,0)","v":0},{"$f":"IFERROR('Electricity LocationBased-Calcs'!F153-$I153*'Electricity LocationBased-Calcs'!F153/'Electricity LocationBased-Calcs'!$I153,0)","v":0},{"$f":"IFERROR('Electricity LocationBased-Calcs'!G153-$I153*'Electricity LocationBased-Calcs'!G153/'Electricity LocationBased-Calcs'!$I153,0)","v":0},{"$f":"IFERROR('Electricity LocationBased-Calcs'!H153-$I153*'Electricity LocationBased-Calcs'!H153/'Electricity LocationBased-Calcs'!$I153,0)","v":0},0]
[null,{"$f":"'Background Controls'!I18","v":0},{"$f":"IFERROR('Electricity LocationBased-Calcs'!C154-$I154*'Electricity LocationBased-Calcs'!C154/'Electricity LocationBased-Calcs'!$I154,0)","v":0},{"$f":"IFERROR('Electricity LocationBased-Calcs'!D154-$I154*'Electricity LocationBased-Calcs'!D154/'Electricity LocationBased-Calcs'!$I154,0)","v":0},{"$f":"IFERROR('Electricity LocationBased-Calcs'!E154-$I154*'Electricity LocationBased-Calcs'!E154/'Electricity LocationBased-Calcs'!$I154,0)","v":0},{"$f":"IFERROR('Electricity LocationBased-Calcs'!F154-$I154*'Electricity LocationBased-Calcs'!F154/'Electricity LocationBased-Calcs'!$I154,0)","v":0},{"$f":"IFERROR('Electricity LocationBased-Calcs'!G154-$I154*'Electricity LocationBased-Calcs'!G154/'Electricity LocationBased-Calcs'!$I154,0)","v":0},{"$f":"IFERROR('Electricity LocationBased-Calcs'!H154-$I154*'Electricity LocationBased-Calcs'!H154/'Electricity LocationBased-Calcs'!$I154,0)","v":0},0]
[null,{"$f":"'Background Controls'!I19","v":0},{"$f":"IFERROR('Electricity LocationBased-Calcs'!C155-$I155*'Electricity LocationBased-Calcs'!C155/'Electricity LocationBased-Calcs'!$I155,0)","v":0},{"$f":"IFERROR('Electricity LocationBased-Calcs'!D155-$I155*'Electricity LocationBased-Calcs'!D155/'Electricity LocationBased-Calcs'!$I155,0)","v":0},{"$f":"IFERROR('Electricity LocationBased-Calcs'!E155-$I155*'Electricity LocationBased-Calcs'!E155/'Electricity LocationBased-Calcs'!$I155,0)","v":0},{"$f":"IFERROR('Electricity LocationBased-Calcs'!F155-$I155*'Electricity LocationBased-Calcs'!F155/'Electricity LocationBased-Calcs'!$I155,0)","v":0},{"$f":"IFERROR('Electricity LocationBased-Calcs'!G155-$I155*'Electricity LocationBased-Calcs'!G155/'Electricity LocationBased-Calcs'!$I155,0)","v":0},{"$f":"IFERROR('Electricity LocationBased-Calcs'!H155-$I155*'Electricity LocationBased-Calcs'!H155/'Electricity LocationBased-Calcs'!$I155,0)","v":0},0]
[null,{"$f":"'Background Controls'!I20","v":0},{"$f":"IFERROR('Electricity LocationBased-Calcs'!C156-$I156*'Electricity LocationBased-Calcs'!C156/'Electricity LocationBased-Calcs'!$I156,0)","v":0},{"$f":"IFERROR('Electricity LocationBased-Calcs'!D156-$I156*'Electricity LocationBased-Calcs'!D156/'Electricity LocationBased-Calcs'!$I156,0)","v":0},{"$f":"IFERROR('Electricity LocationBased-Calcs'!E156-$I156*'Electricity LocationBased-Calcs'!E156/'Electricity LocationBased-Calcs'!$I156,0)","v":0},{"$f":"IFERROR('Electricity LocationBased-Calcs'!F156-$I156*'Electricity LocationBased-Calcs'!F156/'Electricity LocationBased-Calcs'!$I156,0)","v":0},{"$f":"IFERROR('Electricity LocationBased-Calcs'!G156-$I156*'Electricity LocationBased-Calcs'!G156/'Electricity LocationBased-Calcs'!$I156,0)","v":0},{"$f":"IFERROR('Electricity LocationBased-Calcs'!H156-$I156*'Electricity LocationBased-Calcs'!H156/'Electricity LocationBased-Calcs'!$I156,0)","v":0},0]
[null,{"$f":"'Background Controls'!I21","v":0},{"$f":"IFERROR('Electricity LocationBased-Calcs'!C157-$I157*'Electricity LocationBased-Calcs'!C157/'Electricity LocationBased-Calcs'!$I157,0)","v":0},{"$f":"IFERROR('Electricity LocationBased-Calcs'!D157-$I157*'Electricity LocationBased-Calcs'!D157/'Electricity LocationBased-Calcs'!$I157,0)","v":0},{"$f":"IFERROR('Electricity LocationBased-Calcs'!E157-$I157*'Electricity LocationBased-Calcs'!E157/'Electricity LocationBased-Calcs'!$I157,0)","v":0},{"$f":"IFERROR('Electricity LocationBased-Calcs'!F157-$I157*'Electricity LocationBased-Calcs'!F157/'Electricity LocationBased-Calcs'!$I157,0)","v":0},{"$f":"IFERROR('Electricity LocationBased-Calcs'!G157-$I157*'Electricity LocationBased-Calcs'!G157/'Electricity LocationBased-Calcs'!$I157,0)","v":0},{"$f":"IFERROR('Electricity LocationBased-Calcs'!H157-$I157*'Electricity LocationBased-Calcs'!H157/'Electricity LocationBased-Calcs'!$I157,0)","v":0},0]
[null,{"$f":"'Background Controls'!I22","v":0},{"$f":"IFERROR('Electricity LocationBased-Calcs'!C158-$I158*'Electricity LocationBased-Calcs'!C158/'Electricity LocationBased-Calcs'!$I158,0)","v":0},{"$f":"IFERROR('Electricity LocationBased-Calcs'!D158-$I158*'Electricity LocationBased-Calcs'!D158/'Electricity LocationBased-Calcs'!$I158,0)","v":0},{"$f":"IFERROR('Electricity LocationBased-Calcs'!E158-$I158*'Electricity LocationBased-Calcs'!E158/'Electricity LocationBased-Calcs'!$I158,0)","v":0},{"$f":"IFERROR('Electricity LocationBased-Calcs'!F158-$I158*'Electricity LocationBased-Calcs'!F158/'Electricity LocationBased-Calcs'!$I158,0)","v":0},{"$f":"IFERROR('Electricity LocationBased-Calcs'!G158-$I158*'Electricity LocationBased-Calcs'!G158/'Electricity LocationBased-Calcs'!$I158,0)","v":0},{"$f":"IFERROR('Electricity LocationBased-Calcs'!H158-$I158*'Electricity LocationBased-Calcs'!H158/'Electricity LocationBased-Calcs'!$I158,0)","v":0},0]
[null,{"$f":"'Background Controls'!I23","v":0},{"$f":"IFERROR('Electricity LocationBased-Calcs'!C159-$I159*'Electricity LocationBased-Calcs'!C159/'Electricity LocationBased-Calcs'!$I159,0)","v":0},{"$f":"IFERROR('Electricity LocationBased-Calcs'!D159-$I159*'Electricity LocationBased-Calcs'!D159/'Electricity LocationBased-Calcs'!$I159,0)","v":0},{"$f":"IFERROR('Electricity LocationBased-Calcs'!E159-$I159*'Electricity LocationBased-Calcs'!E159/'Electricity LocationBased-Calcs'!$I159,0)","v":0},{"$f":"IFERROR('Electricity LocationBased-Calcs'!F159-$I159*'Electricity LocationBased-Calcs'!F159/'Electricity LocationBased-Calcs'!$I159,0)","v":0},{"$f":"IFERROR('Electricity LocationBased-Calcs'!G159-$I159*'Electricity LocationBased-Calcs'!G159/'Electricity LocationBased-Calcs'!$I159,0)","v":0},{"$f":"IFERROR('Electricity LocationBased-Calcs'!H159-$I159*'Electricity LocationBased-Calcs'!H159/'Electricity LocationBased-Calcs'!$I159,0)","v":0},0]
[null,{"$f":"'Background Controls'!I24","v":0},{"$f":"IFERROR('Electricity LocationBased-Calcs'!C160-$I160*'Electricity LocationBased-Calcs'!C160/'Electricity LocationBased-Calcs'!$I160,0)","v":0},{"$f":"IFERROR('Electricity LocationBased-Calcs'!D160-$I160*'Electricity LocationBased-Calcs'!D160/'Electricity LocationBased-Calcs'!$I160,0)","v":0},{"$f":"IFERROR('Electricity LocationBased-Calcs'!E160-$I160*'Electricity LocationBased-Calcs'!E160/'Electricity LocationBased-Calcs'!$I160,0)","v":0},{"$f":"IFERROR('Electricity LocationBased-Calcs'!F160-$I160*'Electricity LocationBased-Calcs'!F160/'Electricity LocationBased-Calcs'!$I160,0)","v":0},{"$f":"IFERROR('Electricity LocationBased-Calcs'!G160-$I160*'Electricity LocationBased-Calcs'!G160/'Electricity LocationBased-Calcs'!$I160,0)","v":0},{"$f":"IFERROR('Electricity LocationBased-Calcs'!H160-$I160*'Electricity LocationBased-Calcs'!H160/'Electricity LocationBased-Calcs'!$I160,0)","v":0},0]
[null,"Total",{"$f":"SUM(C243:C262)","v":0},0,0,0,0,0,0]
[]
["CO2 Emissions by Sector and Utility"]
["Emissions = Electricity Consumed (kWh) × Utility Emissions Factor (lb CO2/MWh) × MWh/kWh × MT/lb × CO2 GWP"]
[null,"Sector",{"$f":"IF('Background Controls'!$B$62=0,\"-\",'Background Controls'!$B$62)","v":"AKGD eGRID subregion"},{"$f":"IF('Background Controls'!$B$63=0,\"-\",'Background Controls'!$B$63)","v":"-"},{"$f":"IF('Background Controls'!$B$64=0,\"-\",'Background Controls'!$B$64)","v":"-"},{"$f":"IF('Background Controls'!$B$65=0,\"-\",'Background Controls'!$B$65)","v":"-"},{"$f":"IF('Background Controls'!$B$66=0,\"-\",'Background Controls'!$B$66)","v":"-"},{"$f":"IF('Background Controls'!$B$67=0,\"-\",'Background Controls'!$B$67)","v":"-"},"TOTAL"]
["Dstart",{"$f":"'Background Controls'!I5","v":"Residential"},{"$f":"IFERROR(C243*VLOOKUP(C$267, elec_control_factors, 2, FALSE)*kWh_MWh*lb_mt*CO2_CO2e,\"-\")","v":0},{"$f":"IFERROR(D243*VLOOKUP(D$267, elec_control_factors, 2, FALSE)*kWh_MWh*lb_mt*CO2_CO2e,\"-\")","v":"-"},{"$f":"IFERROR(E243*VLOOKUP(E$267, elec_control_factors, 2, FALSE)*kWh_MWh*lb_mt*CO2_CO2e,\"-\")","v":"-"},"-","-","-",{"$f":"SUM(C268:H268)","v":0}]
[null,{"$f":"'Background Controls'!I6","v":"Commercial/Institutional"},{"$f":"IFERROR(C244*VLOOKUP(C$267, elec_control_factors, 2, FALSE)*kWh_MWh*lb_mt*CO2_CO2e,\"-\")","v":0},"-","-","-","-","-",{"$f":"SUM(C269:H269)","v":0}]
[null,{"$f":"'Background Controls'!I7","v":"Industrial"},{"$f":"IFERROR(C245*VLOOKUP(C$267, elec_control_factors, 2, FALSE)*kWh_MWh*lb_mt*CO2_CO2e,\"-\")","v":0},"-","-","-","-","-",0]
[null,{"$f":"'Background Controls'!I8","v":"Energy Generation"},0,"-","-","-","-","-",0]
[null,{"$f":"'Background Controls'!I9","v":0},0,"-","-","-","-","-",0]
[null,{"$f":"'Background Controls'!I10","v":0},0,"-","-","-","-","-",0]
[null,{"$f":"'Background Controls'!I11","v":0},0,"-","-","-","-","-",0]
[null,{"$f":"'Background Controls'!I12","v":0},0,"-","-","-","-","-",0]
[null,{"$f":"'Background Controls'!I13","v":0},0,"-","-","-","-","-",0]
[null,{"$f":"'Background Controls'!I14","v":0},0,"-","-","-","-","-",0]
[null,{"$f":"'Background Controls'!I15","v":0},{"$f":"IFERROR(C253*VLOOKUP(C$267, elec_control_factors, 2, FALSE)*kWh_MWh*lb_mt*CO2_CO2e,\"-\")","v":0},"-","-","-","-","-",0]
[null,{"$f":"'Background Controls'!I16","v":0},0,"-","-","-","-","-",0]
[null,{"$f":"'Background Controls'!I17","v":0},0,"-","-","-","-","-",0]
[null,{"$f":"'Background Controls'!I18","v":0},0,"-","-","-","-","-",0]
[null,{"$f":"'Background Controls'!I19","v":0},0,"-","-","-","-","-",0]
[null,{"$f":"'Background Controls'!I20","v":0},0,"-","-","-","-","-",0]
[null,{"$f":"'Background Controls'!I21","v":0},0,"-","-","-","-","-",0]
[null,{"$f":"'Background Controls'!I22","v":0},0,"-","-","-","-","-",0]
[null,{"$f":"'Background Controls'!I23","v":0},0,"-","-","-","-","-",0]
[null,{"$f":"'Background Controls'!I24","v":0},0,"-","-","-","-","-",0]
[null,"Total",{"$f":"SUM(C268:C287)","v":0},0,0,0,0,0,{"$f":"SUM(I268:I287)","v":0}]
[]
["CH4 emissions by Sector and Utility"]
["Emissions = Electricity Consumed (kWh) × Utility Emissions Factor (lb CH4/kWh) × MWh/kWh × MT/lb × CH4 GWP"]
[null,"Sector",{"$f":"IF('Background Controls'!$B$62=0,\"-\",'Background Controls'!$B$62)","v":"AKGD eGRID subregion"},{"$f":"IF('Background Controls'!$B$63=0,\"-\",'Background Controls'!$B$63)","v":"-"},{"$f":"IF('Background Controls'!$B$64=0,\"-\",'Background Controls'!$B$64)","v":"-"},{"$f":"IF('Background Controls'!$B$65=0,\"-\",'Background Controls'!$B$65)","v":"-"},{"$f":"IF('Background Controls'!$B$66=0,\"-\",'Background Controls'!$B$66)","v":"-"},{"$f":"IF('Background Controls'!$B$67=0,\"-\",'Background Controls'!$B$67)","v":"-"},"TOTAL"]
["Dstart",{"$f":"'Background Controls'!I5","v":"Residential"},{"$f":"IFERROR(C243*VLOOKUP(C$292, elec_control_factors,3, FALSE)*kWh_MWh*lb_mt*CH4_CO2e,\"-\")","v":0},{"$f":"IFERROR(D243*VLOOKUP(D$292, elec_control_factors,3, FALSE)*kWh_MWh*lb_mt*CH4_CO2e,\"-\")","v":"-"},"-","-","-","-",{"$f":"SUM(C293:H293)","v":0}]
[null,{"$f":"'Background Controls'!I6","v":"Commercial/Institutional"},0,"-","-","-","-","-",0]
[null,{"$f":"'Background Controls'!I7","v":"Industrial"},0,"-","-","-","-","-",0]
[null,{"$f":"'Background Controls'!I8","v":"Energy Generation"},0,"-","-","-","-","-",0]
[null,{"$f":"'Background Controls'!I9","v":0},0,"-","-","-","-","-",0]
[null,{"$f":"'Background Controls'!I10","v":0},0,"-","-","-","-","-",0]
[null,{"$f":"'Background Controls'!I11","v":0},0,"-","-","-","-","-",0]
[null,{"$f":"'Background Controls'!I12","v":0},0,"-","-","-","-","-",0]
[null,{"$f":"'Background Controls'!I13","v":0},0,"-","-","-","-","-",0]
[null,{"$f":"'Background Controls'!I14","v":0},0,"-","-","-","-","-",0]
[null,{"$f":"'Background Controls'!I15","v":0},{"$f":"IFERROR(C253*VLOOKUP(C$292, elec_control_factors,3, FALSE)*kWh_MWh*lb_mt*CH4_CO2e,\"-\")","v":0},"-","-","-","-","-",0]
[null,{"$f":"'Background Controls'!I16","v":0},0,"-","-","-","-","-",0]
[null,{"$f":"'Background Controls'!I17","v":0},0,"-","-","-","-","-",0]
[null,{"$f":"'Background Controls'!I18","v":0},0,"-","-","-","-","-",0]
[null,{"$f":"'Background Controls'!I19","v":0},0,"-","-","-","-","-",0]
[null,{"$f":"'Background Controls'!I20","v":0},0,"-","-","-","-","-",0]
[null,{"$f":"'Background Controls'!I21","v":0},0,"-","-","-","-","-",0]
[null,{"$f":"'Background Controls'!I22","v":0},0,"-","-","-","-","-",0]
[null,{"$f":"'Background Controls'!I23","v":0},0,"-","-","-","-","-",0]
[null,{"$f":"'Background Controls'!I24","v":0},0,"-","-","-","-","-",0]
[null,"Total",{"$f":"SUM(C293:C312)","v":0},0,0,0,0,0,{"$f":"SUM(I293:I312)","v":0}]
[]
["N2O emissions by Sector and Utility"]
["Emissions = Electricity Consumed (kWh) × Utility Emissions Factor (lb N2O/kWh) × MWh/kWh × MT/lb × N2O GWP"]
[null,"Sector",{"$f":"IF('Background Controls'!$B$62=0,\"-\",'Background Controls'!$B$62)","v":"AKGD eGRID subregion"},{"$f":"IF('Background Controls'!$B$63=0,\"-\",'Background Controls'!$B$63)","v":"-"},{"$f":"IF('Background Controls'!$B$64=0,\"-\",'Background Controls'!$B$64)","v":"-"},{"$f":"IF('Background Controls'!$B$65=0,\"-\",'Background Controls'!$B$65)","v":"-"},{"$f":"IF('Background Controls'!$B$66=0,\"-\",'Background Controls'!$B$66)","v":"-"},{"$f":"IF('Background Controls'!$B$67=0,\"-\",'Background Controls'!$B$67)","v":"-"},"TOTAL"]
["Dstart",{"$f":"'Background Controls'!I5","v":"Residential"},{"$f":"IFERROR(C243*VLOOKUP(C$317, elec_control_factors,4, FALSE)*kWh_MWh*lb_mt*N2O_CO2e,\"-\")","v":0},"-","-","-","-","-",{"$f":"SUM(C318:H318)","v":0}]
[null,{"$f":"'Background Controls'!I6","v":"Commercial/Institutional"},0,"-","-","-","-","-",0]
[null,{"$f":"'Background Controls'!I7","v":"Industrial"},0,"-","-","-","-","-",0]
[null,{"$f":"'Background Controls'!I8","v":"Energy Generation"},0,"-","-","-","-","-",0]
[null,{"$f":"'Background Controls'!I9","v":0},0,"-","-","-","-","-",0]
[null,{"$f":"'Background Controls'!I10","v":0},0,"-","-","-","-","-",0]
[null,{"$f":"'Background Controls'!I11","v":0},0,"-","-","-","-","-",0]
[null,{"$f":"'Background Controls'!I12","v":0},0,"-","-","-","-","-",0]
[null,{"$f":"'Background Controls'!I13","v":0},0,"-","-","-","-","-",0]
[null,{"$f":"'Background Controls'!I14","v":0},0,"-","-","-","-","-",0]
[null,{"$f":"'Background Controls'!I15","v":0},{"$f":"IFERROR(C253*VLOOKUP(C$317, elec_control_factors,4, FALSE)*kWh_MWh*lb_mt*N2O_CO2e,\"-\")","v":0},"-","-","-","-","-",0]
[null,{"$f":"'Background Controls'!I16","v":0},0,"-","-","-","-","-",0]
[null,{"$f":"'Background Controls'!I17","v":0},0,"-","-","-","-","-",0]
[null,{"$f":"'Background Controls'!I18","v":0},0,"-","-","-","-","-",0]
[null,{"$f":"'Background Controls'!I19","v":0},0,"-","-","-","-","-",0]
[null,{"$f":"'Background Controls'!I20","v":0},0,"-","-","-","-","-",0]
[null,{"$f":"'Background Controls'!I21","v":0},0,"-","-","-","-","-",0]
[null,{"$f":"'Background Controls'!I22","v":0},0,"-","-","-","-","-",0]
[null,{"$f":"'Background Controls'!I23","v":0},0,"-","-","-","-","-",0]
[null,{"$f":"'Background Controls'!I24","v":0},0,"-","-","-","-","-",0]
[null,"Total",{"$f":"SUM(C318:C337)","v":0},0,0,0,0,0,{"$f":"SUM(I318:I337)","v":0}]
[]
[]
[]
["Local GHG Inventory Tool: Community Module"]

{"sheet":"Water","index":26,"n_rows":243,"n_cols":18,"rows_kept":243,"cut":false,"hidden":false,"merged":[[242,0,242,11],[50,1,50,5],[129,1,129,3],[155,1,155,3],[182,1,182,3],[209,1,209,3]]}
["Water"]
["Data Entry and Calculations"]
[]
[]
[]
[]
[]
[]
[]
[null,"Please answer the following questions about your community's water use."]
[]
[null,"1) Does your community import water?"]
[null,null,null,null,null,null,null,null,null,null,null,null,null,null,null,null,1]
[]
[{"$f":"IF($Q$13=2, \"Show\", \"Hide\")","v":"Hide"},"If no, then you have no Scope 3 emissions to calculate. Please enter any electricity or other energy use related to water on the appropriate Scope 1 tabs."]
[{"$f":"IF($Q$13=2, \"Show\", \"Hide\")","v":"Hide"}]
[null,"2) What percent of  water comes from imported sources?"]
[null,"Please enter the percent of water from imported, as opposed to local, sources. The percent of water from local sources will be computed automatically."]
[null,"% imported"]
[null,"% local",{"$f":"C21-C19","v":1}]
[null,"Total",1]
[]
[null,"3) How much water is consumed by each sector?"]
[null,"Please enter data in the yellow cells below."]
[]
[]
[null,"Sector","Water Use (gal)"]
["Dstart",{"$f":"'Background Controls'!I5","v":"Residential"}]
[null,{"$f":"'Background Controls'!I6","v":"Commercial/Institutional"}]
[null,{"$f":"'Background Controls'!I7","v":"Industrial"}]
[null,{"$f":"'Background Controls'!I8","v":"Energy Generation"}]
[null,{"$f":"'Background Controls'!I9","v":0}]
[null,{"$f":"'Background Controls'!I10","v":0}]
[null,{"$f":"'Background Controls'!I11","v":0}]
[null,{"$f":"'Background Controls'!I12","v":0}]
[null,{"$f":"'Background Controls'!I13","v":0}]
[null,{"$f":"'Background Controls'!I14","v":0}]
[null,{"$f":"'Background Controls'!I15","v":0}]
[null,{"$f":"'Background Controls'!I16","v":0}]
[null,{"$f":"'Background Controls'!I17","v":0}]
[null,{"$f":"'Background Controls'!I18","v":0}]
[null,{"$f":"'Background Controls'!I19","v":0}]
[null,{"$f":"'Background Controls'!I20","v":0}]
[null,{"$f":"'Background Controls'!I21","v":0}]
[null,{"$f":"'Background Controls'!I22","v":0}]
[null,{"$f":"'Background Controls'!I23","v":0}]
[null,{"$f":"'Background Controls'!I24","v":0}]
[]
["Water Emissions Summary"]
[]
[null,"Water Consumption Emissions (MT CO2e)"]
[null,"Sector","CO2","CH4","N2O","TOTAL"]
["Dstart",{"$f":"'Background Controls'!I5","v":"Residential"},{"$f":"IF(ISERROR(D160),\"\",D160)","v":"-"},{"$f":"IF(ISERROR(D187),\"\",D187)","v":"-"},{"$f":"IF(ISERROR(D214),\"\",D214)","v":"-"},{"$f":"SUM(C53:E53)","v":0}]
[null,{"$f":"'Background Controls'!I6","v":"Commercial/Institutional"},{"$f":"D161","v":"-"},{"$f":"D188","v":"-"},{"$f":"D215","v":"-"},{"$f":"SUM(C54:E54)","v":0}]
[null,{"$f":"'Background Controls'!I7","v":"Industrial"},"-","-","-",0]
[null,{"$f":"'Background Controls'!I8","v":"Energy Generation"},"-","-","-",0]
[null,{"$f":"'Background Controls'!I9","v":0},"-","-","-",0]
[null,{"$f":"'Background Controls'!I10","v":0},"-","-","-",0]
[null,{"$f":"'Background Controls'!I11","v":0},"-","-","-",0]
[null,{"$f":"'Background Controls'!I12","v":0},"-","-","-",0]
[null,{"$f":"'Background Controls'!I13","v":0},"-","-","-",0]
[null,{"$f":"'Background Controls'!I14","v":0},"-","-","-",0]
[null,{"$f":"'Background Controls'!I15","v":0},"-","-","-",0]
[null,{"$f":"'Background Controls'!I16","v":0},"-","-","-",0]
[null,{"$f":"'Background Controls'!I17","v":0},"-","-","-",0]
[null,{"$f":"'Background Controls'!I18","v":0},"-","-","-",0]
[null,{"$f":"'Background Controls'!I19","v":0},"-","-","-",0]
[null,{"$f":"'Background Controls'!I20","v":0},"-","-","-",0]
[null,{"$f":"'Background Controls'!I21","v":0},"-","-","-",0]
[null,{"$f":"'Background Controls'!I22","v":0},"-","-","-",0]
[null,{"$f":"'Background Controls'!I23","v":0},"-","-","-",0]
[null,{"$f":"'Background Controls'!I24","v":0},"-","-","-",0]
[null,"Total Emissions from Water Consumption",{"$f":"IF(ISERROR(SUM(C53:C72)),\"\",SUM(C53:C72))","v":0},{"$f":"IF(ISERROR(SUM(D53:D72)),\"\",SUM(D53:D72))","v":0},{"$f":"IF(ISERROR(SUM(E53:E72)),\"\",SUM(E53:E72))","v":0},{"$f":"IF(ISERROR(SUM(F53:F72)),\"\",SUM(F53:F72))","v":0}]
[]
[null,null,null,null,null,null,null,null,null,null,null,null,null,null,null,null,"emissions",true]
[null,"Check to display:",null,null,null,null,null,null,null,null,null,null,null,null,null,null,"water",true]
[null,null,null,null,null,null,null,null,null,null,null,null,null,null,null,null,"both",{"$f":"AND(R75:R76)","v":true}]
[null,null,null,null,null,null,null,null,null,null,null,null,null,null,null,null,null,{"$f":"IF(R77=TRUE, Q77, IF(R75=TRUE, Q75, IF(R76=TRUE, Q76,\"both\")))","v":"both"}]
[]
[]
[]
[]
[]
[]
[]
[]
[]
[]
[]
[]
[]
[]
[]
[]
[]
[]
[]
[]
[]
[null,"Check to Display: ",null,null,null,null,null,null,null,null,null,null,null,null,null,null,"emissions",true]
[null,null,null,null,null,null,null,null,null,null,null,null,null,null,null,null,"water",true]
[null,null,null,null,null,null,null,null,null,null,null,null,null,null,null,null,"both",{"$f":"AND(R100:R101)","v":true}]
[null,null,null,null,null,null,null,null,null,null,null,null,null,null,null,null,null,{"$f":"IF(R102=TRUE, Q102, IF(R100=TRUE, Q100, IF(R101=TRUE, Q101,\"both\")))","v":"both"}]
[]
[]
[]
[]
[]
[]
[]
[]
[]
[]
[]
[]
[]
[]
[]
[]
[]
[]
[]
[]
[]
[]
["Background Calculations"]
[]
["Imported Water Consumption by Sector"]
["Imported Water (gallons) = Total Water Consumption (gal) × Percent of Water Imported"]
[null,"Imported Water by Sector (gallons)"]
[null,"Sector","Imported Water","TOTAL"]
["Dstart",{"$f":"'Background Controls'!I5","v":"Residential"},{"$f":"$C28*$C$19","v":0},{"$f":"C132","v":0}]
[null,{"$f":"'Background Controls'!I6","v":"Commercial/Institutional"},{"$f":"$C29*$C$19","v":0},0]
[null,{"$f":"'Background Controls'!I7","v":"Industrial"},0,0]
[null,{"$f":"'Background Controls'!I8","v":"Energy Generation"},0,0]
[null,{"$f":"'Background Controls'!I9","v":0},0,0]
[null,{"$f":"'Background Controls'!I10","v":0},0,0]
[null,{"$f":"'Background Controls'!I11","v":0},0,0]
[null,{"$f":"'Background Controls'!I12","v":0},0,0]
[null,{"$f":"'Background Controls'!I13","v":0},0,0]
[null,{"$f":"'Background Controls'!I14","v":0},0,0]
[null,{"$f":"'Background Controls'!I15","v":0},0,0]
[null,{"$f":"'Background Controls'!I16","v":0},0,0]
[null,{"$f":"'Background Controls'!I17","v":0},{"$f":"$C40*$C$19","v":0},0]
[null,{"$f":"'Background Controls'!I18","v":0},0,0]
[null,{"$f":"'Background Controls'!I19","v":0},0,0]
[null,{"$f":"'Background Controls'!I20","v":0},0,0]
[null,{"$f":"'Background Controls'!I21","v":0},0,0]
[null,{"$f":"'Background Controls'!I22","v":0},0,0]
[null,{"$f":"'Background Controls'!I23","v":0},0,0]
[null,{"$f":"'Background Controls'!I24","v":0},0,0]
[null,"Total",{"$f":"SUM(C132:C151)","v":0},0]
[]
["Emissions from Imported Water by Sector"]
["CO2 Emissions (MT CO2e) = Imported Water Consumed (gal) × Water Electricity Intensity (kWh/Mgal) × Electricity Emission Factor (lb CO2/MWH) × MG/gal × MT/lb × MWh/kWh × GWP CO2"]
[null,"CO2 Emissions from Imported Water (MT CO2e)"]
[null,null,null,"TOTAL"]
[null,"Energy Intensity of Water (kWh/MG)",{"$f":"AVERAGE(Factors!$C$334:$C$337)","v":5604.397429120615}]
[null,"EF (lb CO2/MWh)",{"$f":"IF(MyYear=0,\"\",VLOOKUP(\"CO2\", water_factors_elec, elec_colindex_MyYear, FALSE))","v":1067.68}]
["Dstart",{"$f":"'Background Controls'!I5","v":"Residential"},{"$f":"IF(C132=0,\"-\",C132*C$158*gal_MG*C$159*lb_mt*kWh_MWh*CO2_CO2e)","v":"-"},{"$f":"C160","v":"-"}]
[null,{"$f":"'Background Controls'!I6","v":"Commercial/Institutional"},"-","-"]
[null,{"$f":"'Background Controls'!I7","v":"Industrial"},"-","-"]
[null,{"$f":"'Background Controls'!I8","v":"Energy Generation"},"-","-"]
[null,{"$f":"'Background Controls'!I9","v":0},"-","-"]
[null,{"$f":"'Background Controls'!I10","v":0},"-","-"]
[null,{"$f":"'Background Controls'!I11","v":0},"-","-"]
[null,{"$f":"'Background Controls'!I12","v":0},"-","-"]
[null,{"$f":"'Background Controls'!I13","v":0},"-","-"]
[null,{"$f":"'Background Controls'!I14","v":0},"-","-"]
[null,{"$f":"'Background Controls'!I15","v":0},"-","-"]
[null,{"$f":"'Background Controls'!I16","v":0},"-","-"]
[null,{"$f":"'Background Controls'!I17","v":0},"-","-"]
[null,{"$f":"'Background Controls'!I18","v":0},"-","-"]
[null,{"$f":"'Background Controls'!I19","v":0},"-","-"]
[null,{"$f":"'Background Controls'!I20","v":0},"-","-"]
[null,{"$f":"'Background Controls'!I21","v":0},"-","-"]
[null,{"$f":"'Background Controls'!I22","v":0},"-","-"]
[null,{"$f":"'Background Controls'!I23","v":0},"-","-"]
[null,{"$f":"'Background Controls'!I24","v":0},"-","-"]
[null,"Total",{"$f":"SUM(C160:C179)","v":0},0]
[]
["CH4 Emissions (MT CO2e) = Imported Water Consumed (gal) × Water Electricity Intensity (kWh/Mgal) × Electricity Emission Factor (lb CH4/MWH) × MG/gal × MT/lb × MWh/kWh × GWP CH4"]
[null,"CH4 Emissions from Imported Water (MT CO2e)"]
[null,null,null,"TOTAL"]
[null,"Energy Intensity of Water (kWh/MG)",{"$f":"C158","v":5604.397429120615}]
[null,"EF (lb CH4/MWh)",{"$f":"IF(MyYear=0,\"\",VLOOKUP(\"CH4\", water_factors_elec, elec_colindex_MyYear, FALSE))","v":9.0999999999999998E-2}]
["Dstart",{"$f":"'Background Controls'!I5","v":"Residential"},{"$f":"IF(C132=0,\"-\",C132*C$185*gal_MG*C$186*lb_mt*kWh_MWh*CH4_CO2e)","v":"-"},{"$f":"C187","v":"-"}]
[null,{"$f":"'Background Controls'!I6","v":"Commercial/Institutional"},"-","-"]
[null,{"$f":"'Background Controls'!I7","v":"Industrial"},"-","-"]
[null,{"$f":"'Background Controls'!I8","v":"Energy Generation"},"-","-"]
[null,{"$f":"'Background Controls'!I9","v":0},"-","-"]
[null,{"$f":"'Background Controls'!I10","v":0},"-","-"]
[null,{"$f":"'Background Controls'!I11","v":0},"-","-"]
[null,{"$f":"'Background Controls'!I12","v":0},"-","-"]
[null,{"$f":"'Background Controls'!I13","v":0},"-","-"]
[null,{"$f":"'Background Controls'!I14","v":0},"-","-"]
[null,{"$f":"'Background Controls'!I15","v":0},"-","-"]
[null,{"$f":"'Background Controls'!I16","v":0},"-","-"]
[null,{"$f":"'Background Controls'!I17","v":0},"-","-"]
[null,{"$f":"'Background Controls'!I18","v":0},"-","-"]
[null,{"$f":"'Background Controls'!I19","v":0},"-","-"]
[null,{"$f":"'Background Controls'!I20","v":0},"-","-"]
[null,{"$f":"'Background Controls'!I21","v":0},"-","-"]
[null,{"$f":"'Background Controls'!I22","v":0},"-","-"]
[null,{"$f":"'Background Controls'!I23","v":0},"-","-"]
[null,{"$f":"'Background Controls'!I24","v":0},"-","-"]
[null,"Total",{"$f":"SUM(C187:C206)","v":0},0]
[]
["N2O Emissions (MT CO2e) = Imported Water Consumed (gal) × Water Electricity Intensity (kWh/Mgal) × Electricity Emission Factor (lb N2O/MWH) × MG/gal × MT/lb × MWh/kWh × GWP N2O"]
[null,"N2O Emissions from Imported Water (MT CO2e)"]
[null,null,null,"TOTAL"]
[null,"Energy Intensity of Water (kWh/MG)",{"$f":"C185","v":5604.397429120615}]
[null,"EF (lb N2O/MWh)",{"$f":"IF(MyYear=0,\"\",VLOOKUP(\"N2O\", water_factors_elec, elec_colindex_MyYear, FALSE))","v":1.2E-2}]
["Dstart",{"$f":"'Background Controls'!I5","v":"Residential"},{"$f":"IF(C132=0,\"-\",C132*C$212*gal_MG*C$213*lb_mt*kWh_MWh*N2O_CO2e)","v":"-"},{"$f":"C214","v":"-"}]
[null,{"$f":"'Background Controls'!I6","v":"Commercial/Institutional"},"-",{"$f":"C215","v":"-"}]
[null,{"$f":"'Background Controls'!I7","v":"Industrial"},"-",{"$f":"C216","v":"-"}]
[null,{"$f":"'Background Controls'!I8","v":"Energy Generation"},"-",{"$f":"C217","v":"-"}]
[null,{"$f":"'Background Controls'!I9","v":0},"-",{"$f":"C218","v":"-"}]
[null,{"$f":"'Background Controls'!I10","v":0},"-","-"]
[null,{"$f":"'Background Controls'!I11","v":0},"-","-"]
[null,{"$f":"'Background Controls'!I12","v":0},"-","-"]
[null,{"$f":"'Background Controls'!I13","v":0},"-","-"]
[null,{"$f":"'Background Controls'!I14","v":0},"-","-"]
[null,{"$f":"'Background Controls'!I15","v":0},"-","-"]
[null,{"$f":"'Background Controls'!I16","v":0},"-","-"]
[null,{"$f":"'Background Controls'!I17","v":0},"-","-"]
[null,{"$f":"'Background Controls'!I18","v":0},"-","-"]
[null,{"$f":"'Background Controls'!I19","v":0},"-","-"]
[null,{"$f":"'Background Controls'!I20","v":0},"-","-"]
[null,{"$f":"'Background Controls'!I21","v":0},"-","-"]
[null,{"$f":"'Background Controls'!I22","v":0},"-","-"]
[null,{"$f":"'Background Controls'!I23","v":0},"-","-"]
[null,{"$f":"'Background Controls'!I24","v":0},"-","-"]
[null,"Total",{"$f":"SUM(C214:C233)","v":0},{"$f":"C234","v":0}]
[]
["Total Emissions by Import Source"]
[null,null,"Imported Water"]
[null,"Total Emissions       (MT CO2e)",{"$f":"C180+C207+C234","v":0}]
[]
[]
[]
[]
["Local GHG Inventory Tool: Community Module"]

{"sheet":"Agriculture & Land Management","index":27,"n_rows":69,"n_cols":6,"rows_kept":69,"cut":false,"hidden":false,"merged":[[68,0,68,21],[33,1,33,5]]}
["Agriculture & Land Management"]
["Data Entry & Calculations"]
[]
[]
[]
[]
["1. Enter Fertilizer Consumption Data for Each Sector."]
["Please enter the amount of synthetic, organic, or manure fertilizer applied."]
[]
[null,"Sector","Synthetic \n(short tons N)","Organic \n(short tons)","Manure \n(short tons)"]
["Dstart",{"$f":"'Background Controls'!I5","v":"Residential"}]
[null,{"$f":"'Background Controls'!I6","v":"Commercial/Institutional"}]
[null,{"$f":"'Background Controls'!I7","v":"Industrial"}]
[null,{"$f":"'Background Controls'!I8","v":"Energy Generation"}]
[null,{"$f":"'Background Controls'!I9","v":0}]
[null,{"$f":"'Background Controls'!I10","v":0}]
[null,{"$f":"'Background Controls'!I11","v":0}]
[null,{"$f":"'Background Controls'!I12","v":0}]
[null,{"$f":"'Background Controls'!I13","v":0}]
[null,{"$f":"'Background Controls'!I14","v":0}]
[null,{"$f":"'Background Controls'!I15","v":0}]
[null,{"$f":"'Background Controls'!I16","v":0}]
[null,{"$f":"'Background Controls'!I17","v":0}]
[null,{"$f":"'Background Controls'!I18","v":0}]
[null,{"$f":"'Background Controls'!I19","v":0}]
[null,{"$f":"'Background Controls'!I20","v":0}]
[null,{"$f":"'Background Controls'!I21","v":0}]
[null,{"$f":"'Background Controls'!I22","v":0}]
[null,{"$f":"'Background Controls'!I23","v":0}]
[null,{"$f":"'Background Controls'!I24","v":0}]
[]
["Fertilizer Emissions Summary"]
[]
[null,"Fertilizer Application Emissions (MT CO2e)"]
[null,null,"Synthetic N2O","Organic N2O","Manure N2O","TOTAL"]
["Dstart",{"$f":"'Background Controls'!I5","v":"Residential"},{"$f":"((C11*Factors!$B$355*(1-Factors!$C$355)*Factors!$E$355)+(C11*Factors!$B$355*Factors!$C$355*Factors!$F$355)+(C11*Factors!$B$355*(1-Factors!$C$355)*Factors!$D$355*Factors!$G$355))*N2O_N2ON*GWP_N2O*mt_shortton","v":0},{"$f":"((D11*Factors!$B$356*(1-Factors!$C$356)*Factors!$E$356)+(D11*Factors!$B$356*Factors!$C$356*Factors!$F$356)+(D11*Factors!$B$356*(1-Factors!$C$356)*Factors!$D$356*Factors!$G$356))*N2O_N2ON*GWP_N2O*mt_shortton","v":0},{"$f":"((E11*Factors!$B$357*(1-Factors!$C$357)*Factors!$E$357)+(E11*Factors!$B$357*Factors!$C$357*Factors!$F$357)+(E11*Factors!$B$357*(1-Factors!$C$357)*Factors!$D$357*Factors!$G$357))*N2O_N2ON*GWP_N2O*mt_shortton","v":0},{"$f":"SUM(C36:E36)","v":0}]
[null,{"$f":"'Background Controls'!I6","v":"Commercial/Institutional"},{"$f":"((C12*Factors!$B$355*(1-Factors!$C$355)*Factors!$E$355)+(C12*Factors!$B$355*Factors!$C$355*Factors!$F$355)+(C12*Factors!$B$355*(1-Factors!$C$355)*Factors!$D$355*Factors!$G$355))*N2O_N2ON*GWP_N2O*mt_shortton","v":0},{"$f":"((D12*Factors!$B$356*(1-Factors!$C$356)*Factors!$E$356)+(D12*Factors!$B$356*Factors!$C$356*Factors!$F$356)+(D12*Factors!$B$356*(1-Factors!$C$356)*Factors!$D$356*Factors!$G$356))*N2O_N2ON*GWP_N2O*mt_shortton","v":0},{"$f":"((E12*Factors!$B$357*(1-Factors!$C$357)*Factors!$E$357)+(E12*Factors!$B$357*Factors!$C$357*Factors!$F$357)+(E12*Factors!$B$357*(1-Factors!$C$357)*Factors!$D$357*Factors!$G$357))*N2O_N2ON*GWP_N2O*mt_shortton","v":0},{"$f":"SUM(C37:E37)","v":0}]
[null,{"$f":"'Background Controls'!I7","v":"Industrial"},{"$f":"((C13*Factors!$B$355*(1-Factors!$C$355)*Factors!$E$355)+(C13*Factors!$B$355*Factors!$C$355*Factors!$F$355)+(C13*Factors!$B$355*(1-Factors!$C$355)*Factors!$D$355*Factors!$G$355))*N2O_N2ON*GWP_N2O*mt_shortton","v":0},{"$f":"((D13*Factors!$B$356*(1-Factors!$C$356)*Factors!$E$356)+(D13*Factors!$B$356*Factors!$C$356*Factors!$F$356)+(D13*Factors!$B$356*(1-Factors!$C$356)*Factors!$D$356*Factors!$G$356))*N2O_N2ON*GWP_N2O*mt_shortton","v":0},{"$f":"((E13*Factors!$B$357*(1-Factors!$C$357)*Factors!$E$357)+(E13*Factors!$B$357*Factors!$C$357*Factors!$F$357)+(E13*Factors!$B$357*(1-Factors!$C$357)*Factors!$D$357*Factors!$G$357))*N2O_N2ON*GWP_N2O*mt_shortton","v":0},0]
[null,{"$f":"'Background Controls'!I8","v":"Energy Generation"},{"$f":"((C14*Factors!$B$355*(1-Factors!$C$355)*Factors!$E$355)+(C14*Factors!$B$355*Factors!$C$355*Factors!$F$355)+(C14*Factors!$B$355*(1-Factors!$C$355)*Factors!$D$355*Factors!$G$355))*N2O_N2ON*GWP_N2O*mt_shortton","v":0},{"$f":"((D14*Factors!$B$356*(1-Factors!$C$356)*Factors!$E$356)+(D14*Factors!$B$356*Factors!$C$356*Factors!$F$356)+(D14*Factors!$B$356*(1-Factors!$C$356)*Factors!$D$356*Factors!$G$356))*N2O_N2ON*GWP_N2O*mt_shortton","v":0},{"$f":"((E14*Factors!$B$357*(1-Factors!$C$357)*Factors!$E$357)+(E14*Factors!$B$357*Factors!$C$357*Factors!$F$357)+(E14*Factors!$B$357*(1-Factors!$C$357)*Factors!$D$357*Factors!$G$357))*N2O_N2ON*GWP_N2O*mt_shortton","v":0},0]
[null,{"$f":"'Background Controls'!I9","v":0},{"$f":"((C15*Factors!$B$355*(1-Factors!$C$355)*Factors!$E$355)+(C15*Factors!$B$355*Factors!$C$355*Factors!$F$355)+(C15*Factors!$B$355*(1-Factors!$C$355)*Factors!$D$355*Factors!$G$355))*N2O_N2ON*GWP_N2O*mt_shortton","v":0},{"$f":"((D15*Factors!$B$356*(1-Factors!$C$356)*Factors!$E$356)+(D15*Factors!$B$356*Factors!$C$356*Factors!$F$356)+(D15*Factors!$B$356*(1-Factors!$C$356)*Factors!$D$356*Factors!$G$356))*N2O_N2ON*GWP_N2O*mt_shortton","v":0},{"$f":"((E15*Factors!$B$357*(1-Factors!$C$357)*Factors!$E$357)+(E15*Factors!$B$357*Factors!$C$357*Factors!$F$357)+(E15*Factors!$B$357*(1-Factors!$C$357)*Factors!$D$357*Factors!$G$357))*N2O_N2ON*GWP_N2O*mt_shortton","v":0},0]
[null,{"$f":"'Background Controls'!I10","v":0},{"$f":"((C16*Factors!$B$355*(1-Factors!$C$355)*Factors!$E$355)+(C16*Factors!$B$355*Factors!$C$355*Factors!$F$355)+(C16*Factors!$B$355*(1-Factors!$C$355)*Factors!$D$355*Factors!$G$355))*N2O_N2ON*GWP_N2O*mt_shortton","v":0},{"$f":"((D16*Factors!$B$356*(1-Factors!$C$356)*Factors!$E$356)+(D16*Factors!$B$356*Factors!$C$356*Factors!$F$356)+(D16*Factors!$B$356*(1-Factors!$C$356)*Factors!$D$356*Factors!$G$356))*N2O_N2ON*GWP_N2O*mt_shortton","v":0},{"$f":"((E16*Factors!$B$357*(1-Factors!$C$357)*Factors!$E$357)+(E16*Factors!$B$357*Factors!$C$357*Factors!$F$357)+(E16*Factors!$B$357*(1-Factors!$C$357)*Factors!$D$357*Factors!$G$357))*N2O_N2ON*GWP_N2O*mt_shortton","v":0},0]
[null,{"$f":"'Background Controls'!I11","v":0},{"$f":"((C17*Factors!$B$355*(1-Factors!$C$355)*Factors!$E$355)+(C17*Factors!$B$355*Factors!$C$355*Factors!$F$355)+(C17*Factors!$B$355*(1-Factors!$C$355)*Factors!$D$355*Factors!$G$355))*N2O_N2ON*GWP_N2O*mt_shortton","v":0},{"$f":"((D17*Factors!$B$356*(1-Factors!$C$356)*Factors!$E$356)+(D17*Factors!$B$356*Factors!$C$356*Factors!$F$356)+(D17*Factors!$B$356*(1-Factors!$C$356)*Factors!$D$356*Factors!$G$356))*N2O_N2ON*GWP_N2O*mt_shortton","v":0},{"$f":"((E17*Factors!$B$357*(1-Factors!$C$357)*Factors!$E$357)+(E17*Factors!$B$357*Factors!$C$357*Factors!$F$357)+(E17*Factors!$B$357*(1-Factors!$C$357)*Factors!$D$357*Factors!$G$357))*N2O_N2ON*GWP_N2O*mt_shortton","v":0},0]
[null,{"$f":"'Background Controls'!I12","v":0},{"$f":"((C18*Factors!$B$355*(1-Factors!$C$355)*Factors!$E$355)+(C18*Factors!$B$355*Factors!$C$355*Factors!$F$355)+(C18*Factors!$B$355*(1-Factors!$C$355)*Factors!$D$355*Factors!$G$355))*N2O_N2ON*GWP_N2O*mt_shortton","v":0},{"$f":"((D18*Factors!$B$356*(1-Factors!$C$356)*Factors!$E$356)+(D18*Factors!$B$356*Factors!$C$356*Factors!$F$356)+(D18*Factors!$B$356*(1-Factors!$C$356)*Factors!$D$356*Factors!$G$356))*N2O_N2ON*GWP_N2O*mt_shortton","v":0},{"$f":"((E18*Factors!$B$357*(1-Factors!$C$357)*Factors!$E$357)+(E18*Factors!$B$357*Factors!$C$357*Factors!$F$357)+(E18*Factors!$B$357*(1-Factors!$C$357)*Factors!$D$357*Factors!$G$357))*N2O_N2ON*GWP_N2O*mt_shortton","v":0},0]
[null,{"$f":"'Background Controls'!I13","v":0},{"$f":"((C19*Factors!$B$355*(1-Factors!$C$355)*Factors!$E$355)+(C19*Factors!$B$355*Factors!$C$355*Factors!$F$355)+(C19*Factors!$B$355*(1-Factors!$C$355)*Factors!$D$355*Factors!$G$355))*N2O_N2ON*GWP_N2O*mt_shortton","v":0},{"$f":"((D19*Factors!$B$356*(1-Factors!$C$356)*Factors!$E$356)+(D19*Factors!$B$356*Factors!$C$356*Factors!$F$356)+(D19*Factors!$B$356*(1-Factors!$C$356)*Factors!$D$356*Factors!$G$356))*N2O_N2ON*GWP_N2O*mt_shortton","v":0},{"$f":"((E19*Factors!$B$357*(1-Factors!$C$357)*Factors!$E$357)+(E19*Factors!$B$357*Factors!$C$357*Factors!$F$357)+(E19*Factors!$B$357*(1-Factors!$C$357)*Factors!$D$357*Factors!$G$357))*N2O_N2ON*GWP_N2O*mt_shortton","v":0},0]
[null,{"$f":"'Background Controls'!I14","v":0},{"$f":"((C20*Factors!$B$355*(1-Factors!$C$355)*Factors!$E$355)+(C20*Factors!$B$355*Factors!$C$355*Factors!$F$355)+(C20*Factors!$B$355*(1-Factors!$C$355)*Factors!$D$355*Factors!$G$355))*N2O_N2ON*GWP_N2O*mt_shortton","v":0},{"$f":"((D20*Factors!$B$356*(1-Factors!$C$356)*Factors!$E$356)+(D20*Factors!$B$356*Factors!$C$356*Factors!$F$356)+(D20*Factors!$B$356*(1-Factors!$C$356)*Factors!$D$356*Factors!$G$356))*N2O_N2ON*GWP_N2O*mt_shortton","v":0},{"$f":"((E20*Factors!$B$357*(1-Factors!$C$357)*Factors!$E$357)+(E20*Factors!$B$357*Factors!$C$357*Factors!$F$357)+(E20*Factors!$B$357*(1-Factors!$C$357)*Factors!$D$357*Factors!$G$357))*N2O_N2ON*GWP_N2O*mt_shortton","v":0},0]
[null,{"$f":"'Background Controls'!I15","v":0},{"$f":"((C21*Factors!$B$355*(1-Factors!$C$355)*Factors!$E$355)+(C21*Factors!$B$355*Factors!$C$355*Factors!$F$355)+(C21*Factors!$B$355*(1-Factors!$C$355)*Factors!$D$355*Factors!$G$355))*N2O_N2ON*GWP_N2O*mt_shortton","v":0},{"$f":"((D21*Factors!$B$356*(1-Factors!$C$356)*Factors!$E$356)+(D21*Factors!$B$356*Factors!$C$356*Factors!$F$356)+(D21*Factors!$B$356*(1-Factors!$C$356)*Factors!$D$356*Factors!$G$356))*N2O_N2ON*GWP_N2O*mt_shortton","v":0},{"$f":"((E21*Factors!$B$357*(1-Factors!$C$357)*Factors!$E$357)+(E21*Factors!$B$357*Factors!$C$357*Factors!$F$357)+(E21*Factors!$B$357*(1-Factors!$C$357)*Factors!$D$357*Factors!$G$357))*N2O_N2ON*GWP_N2O*mt_shortton","v":0},0]
[null,{"$f":"'Background Controls'!I16","v":0},{"$f":"((C22*Factors!$B$355*(1-Factors!$C$355)*Factors!$E$355)+(C22*Factors!$B$355*Factors!$C$355*Factors!$F$355)+(C22*Factors!$B$355*(1-Factors!$C$355)*Factors!$D$355*Factors!$G$355))*N2O_N2ON*GWP_N2O*mt_shortton","v":0},{"$f":"((D22*Factors!$B$356*(1-Factors!$C$356)*Factors!$E$356)+(D22*Factors!$B$356*Factors!$C$356*Factors!$F$356)+(D22*Factors!$B$356*(1-Factors!$C$356)*Factors!$D$356*Factors!$G$356))*N2O_N2ON*GWP_N2O*mt_shortton","v":0},{"$f":"((E22*Factors!$B$357*(1-Factors!$C$357)*Factors!$E$357)+(E22*Factors!$B$357*Factors!$C$357*Factors!$F$357)+(E22*Factors!$B$357*(1-Factors!$C$357)*Factors!$D$357*Factors!$G$357))*N2O_N2ON*GWP_N2O*mt_shortton","v":0},0]
[null,{"$f":"'Background Controls'!I17","v":0},{"$f":"((C23*Factors!$B$355*(1-Factors!$C$355)*Factors!$E$355)+(C23*Factors!$B$355*Factors!$C$355*Factors!$F$355)+(C23*Factors!$B$355*(1-Factors!$C$355)*Factors!$D$355*Factors!$G$355))*N2O_N2ON*GWP_N2O*mt_shortton","v":0},{"$f":"((D23*Factors!$B$356*(1-Factors!$C$356)*Factors!$E$356)+(D23*Factors!$B$356*Factors!$C$356*Factors!$F$356)+(D23*Factors!$B$356*(1-Factors!$C$356)*Factors!$D$356*Factors!$G$356))*N2O_N2ON*GWP_N2O*mt_shortton","v":0},{"$f":"((E23*Factors!$B$357*(1-Factors!$C$357)*Factors!$E$357)+(E23*Factors!$B$357*Factors!$C$357*Factors!$F$357)+(E23*Factors!$B$357*(1-Factors!$C$357)*Factors!$D$357*Factors!$G$357))*N2O_N2ON*GWP_N2O*mt_shortton","v":0},0]
[null,{"$f":"'Background Controls'!I18","v":0},{"$f":"((C24*Factors!$B$355*(1-Factors!$C$355)*Factors!$E$355)+(C24*Factors!$B$355*Factors!$C$355*Factors!$F$355)+(C24*Factors!$B$355*(1-Factors!$C$355)*Factors!$D$355*Factors!$G$355))*N2O_N2ON*GWP_N2O*mt_shortton","v":0},{"$f":"((D24*Factors!$B$356*(1-Factors!$C$356)*Factors!$E$356)+(D24*Factors!$B$356*Factors!$C$356*Factors!$F$356)+(D24*Factors!$B$356*(1-Factors!$C$356)*Factors!$D$356*Factors!$G$356))*N2O_N2ON*GWP_N2O*mt_shortton","v":0},{"$f":"((E24*Factors!$B$357*(1-Factors!$C$357)*Factors!$E$357)+(E24*Factors!$B$357*Factors!$C$357*Factors!$F$357)+(E24*Factors!$B$357*(1-Factors!$C$357)*Factors!$D$357*Factors!$G$357))*N2O_N2ON*GWP_N2O*mt_shortton","v":0},0]
[null,{"$f":"'Background Controls'!I19","v":0},{"$f":"((C25*Factors!$B$355*(1-Factors!$C$355)*Factors!$E$355)+(C25*Factors!$B$355*Factors!$C$355*Factors!$F$355)+(C25*Factors!$B$355*(1-Factors!$C$355)*Factors!$D$355*Factors!$G$355))*N2O_N2ON*GWP_N2O*mt_shortton","v":0},{"$f":"((D25*Factors!$B$356*(1-Factors!$C$356)*Factors!$E$356)+(D25*Factors!$B$356*Factors!$C$356*Factors!$F$356)+(D25*Factors!$B$356*(1-Factors!$C$356)*Factors!$D$356*Factors!$G$356))*N2O_N2ON*GWP_N2O*mt_shortton","v":0},{"$f":"((E25*Factors!$B$357*(1-Factors!$C$357)*Factors!$E$357)+(E25*Factors!$B$357*Factors!$C$357*Factors!$F$357)+(E25*Factors!$B$357*(1-Factors!$C$357)*Factors!$D$357*Factors!$G$357))*N2O_N2ON*GWP_N2O*mt_shortton","v":0},0]
[null,{"$f":"'Background Controls'!I20","v":0},{"$f":"((C26*Factors!$B$355*(1-Factors!$C$355)*Factors!$E$355)+(C26*Factors!$B$355*Factors!$C$355*Factors!$F$355)+(C26*Factors!$B$355*(1-Factors!$C$355)*Factors!$D$355*Factors!$G$355))*N2O_N2ON*GWP_N2O*mt_shortton","v":0},{"$f":"((D26*Factors!$B$356*(1-Factors!$C$356)*Factors!$E$356)+(D26*Factors!$B$356*Factors!$C$356*Factors!$F$356)+(D26*Factors!$B$356*(1-Factors!$C$356)*Factors!$D$356*Factors!$G$356))*N2O_N2ON*GWP_N2O*mt_shortton","v":0},{"$f":"((E26*Factors!$B$357*(1-Factors!$C$357)*Factors!$E$357)+(E26*Factors!$B$357*Factors!$C$357*Factors!$F$357)+(E26*Factors!$B$357*(1-Factors!$C$357)*Factors!$D$357*Factors!$G$357))*N2O_N2ON*GWP_N2O*mt_shortton","v":0},0]
[null,{"$f":"'Background Controls'!I21","v":0},{"$f":"((C27*Factors!$B$355*(1-Factors!$C$355)*Factors!$E$355)+(C27*Factors!$B$355*Factors!$C$355*Factors!$F$355)+(C27*Factors!$B$355*(1-Factors!$C$355)*Factors!$D$355*Factors!$G$355))*N2O_N2ON*GWP_N2O*mt_shortton","v":0},{"$f":"((D27*Factors!$B$356*(1-Factors!$C$356)*Factors!$E$356)+(D27*Factors!$B$356*Factors!$C$356*Factors!$F$356)+(D27*Factors!$B$356*(1-Factors!$C$356)*Factors!$D$356*Factors!$G$356))*N2O_N2ON*GWP_N2O*mt_shortton","v":0},{"$f":"((E27*Factors!$B$357*(1-Factors!$C$357)*Factors!$E$357)+(E27*Factors!$B$357*Factors!$C$357*Factors!$F$357)+(E27*Factors!$B$357*(1-Factors!$C$357)*Factors!$D$357*Factors!$G$357))*N2O_N2ON*GWP_N2O*mt_shortton","v":0},0]
[null,{"$f":"'Background Controls'!I22","v":0},{"$f":"((C28*Factors!$B$355*(1-Factors!$C$355)*Factors!$E$355)+(C28*Factors!$B$355*Factors!$C$355*Factors!$F$355)+(C28*Factors!$B$355*(1-Factors!$C$355)*Factors!$D$355*Factors!$G$355))*N2O_N2ON*GWP_N2O*mt_shortton","v":0},{"$f":"((D28*Factors!$B$356*(1-Factors!$C$356)*Factors!$E$356)+(D28*Factors!$B$356*Factors!$C$356*Factors!$F$356)+(D28*Factors!$B$356*(1-Factors!$C$356)*Factors!$D$356*Factors!$G$356))*N2O_N2ON*GWP_N2O*mt_shortton","v":0},{"$f":"((E28*Factors!$B$357*(1-Factors!$C$357)*Factors!$E$357)+(E28*Factors!$B$357*Factors!$C$357*Factors!$F$357)+(E28*Factors!$B$357*(1-Factors!$C$357)*Factors!$D$357*Factors!$G$357))*N2O_N2ON*GWP_N2O*mt_shortton","v":0},0]
[null,{"$f":"'Background Controls'!I23","v":0},{"$f":"((C29*Factors!$B$355*(1-Factors!$C$355)*Factors!$E$355)+(C29*Factors!$B$355*Factors!$C$355*Factors!$F$355)+(C29*Factors!$B$355*(1-Factors!$C$355)*Factors!$D$355*Factors!$G$355))*N2O_N2ON*GWP_N2O*mt_shortton","v":0},{"$f":"((D29*Factors!$B$356*(1-Factors!$C$356)*Factors!$E$356)+(D29*Factors!$B$356*Factors!$C$356*Factors!$F$356)+(D29*Factors!$B$356*(1-Factors!$C$356)*Factors!$D$356*Factors!$G$356))*N2O_N2ON*GWP_N2O*mt_shortton","v":0},{"$f":"((E29*Factors!$B$357*(1-Factors!$C$357)*Factors!$E$357)+(E29*Factors!$B$357*Factors!$C$357*Factors!$F$357)+(E29*Factors!$B$357*(1-Factors!$C$357)*Factors!$D$357*Factors!$G$357))*N2O_N2ON*GWP_N2O*mt_shortton","v":0},0]
[null,{"$f":"'Background Controls'!I24","v":0},{"$f":"((C30*Factors!$B$355*(1-Factors!$C$355)*Factors!$E$355)+(C30*Factors!$B$355*Factors!$C$355*Factors!$F$355)+(C30*Factors!$B$355*(1-Factors!$C$355)*Factors!$D$355*Factors!$G$355))*N2O_N2ON*GWP_N2O*mt_shortton","v":0},{"$f":"((D30*Factors!$B$356*(1-Factors!$C$356)*Factors!$E$356)+(D30*Factors!$B$356*Factors!$C$356*Factors!$F$356)+(D30*Factors!$B$356*(1-Factors!$C$356)*Factors!$D$356*Factors!$G$356))*N2O_N2ON*GWP_N2O*mt_shortton","v":0},{"$f":"((E30*Factors!$B$357*(1-Factors!$C$357)*Factors!$E$357)+(E30*Factors!$B$357*Factors!$C$357*Factors!$F$357)+(E30*Factors!$B$357*(1-Factors!$C$357)*Factors!$D$357*Factors!$G$357))*N2O_N2ON*GWP_N2O*mt_shortton","v":0},0]
[null,"Total Emissions from Fertilizer Application",{"$f":"IF(ISERROR(SUM(C36:C55)),\"\",SUM(C36:C55))","v":0},{"$f":"IF(ISERROR(SUM(D36:D55)),\"\",SUM(D36:D55))","v":0},{"$f":"IF(ISERROR(SUM(E36:E55)),\"\",SUM(E36:E55))","v":0},{"$f":"IF(ISERROR(SUM(F36:F55)),\"\",SUM(F36:F55))","v":0}]
[]
[]
[]
[]
[]
[]
[]
[]
[]
[]
[]
[]
["Local GHG Inventory Tool: Community Module"]

{"sheet":"Urban Forestry","index":28,"n_rows":69,"n_cols":4,"rows_kept":69,"cut":false,"hidden":false,"merged":[[68,0,68,21],[34,1,34,3]]}
["Urban Forestry"]
[]
[]
[]
[]
[]
["1. Enter Forestry Data"]
["Please enter the total urban area and percent of that area with tree cover below in your locality."]
[]
[null,"Sector","Total Urban Area (km2)","% Urban Area with Tree Cover"]
["Dstart",{"$f":"'Background Controls'!I5","v":"Residential"}]
[null,{"$f":"'Background Controls'!I6","v":"Commercial/Institutional"},{"$f":"60207/247.1","v":243.6543909348442},1]
[null,{"$f":"'Background Controls'!I7","v":"Industrial"}]
[null,{"$f":"'Background Controls'!I8","v":"Energy Generation"}]
[null,{"$f":"'Background Controls'!I9","v":0}]
[null,{"$f":"'Background Controls'!I10","v":0}]
[null,{"$f":"'Background Controls'!I11","v":0}]
[null,{"$f":"'Background Controls'!I12","v":0}]
[null,{"$f":"'Background Controls'!I13","v":0}]
[null,{"$f":"'Background Controls'!I14","v":0}]
[null,{"$f":"'Background Controls'!I15","v":0}]
[null,{"$f":"'Background Controls'!I16","v":0}]
[null,{"$f":"'Background Controls'!I17","v":0}]
[null,{"$f":"'Background Controls'!I18","v":0}]
[null,{"$f":"'Background Controls'!I19","v":0}]
[null,{"$f":"'Background Controls'!I20","v":0}]
[null,{"$f":"'Background Controls'!I21","v":0}]
[null,{"$f":"'Background Controls'!I22","v":0}]
[null,{"$f":"'Background Controls'!I23","v":0}]
[null,{"$f":"'Background Controls'!I24","v":0}]
[]
[]
["Urban Forestry Carbon Sequestration Summary"]
[]
[null,"Carbon Sequestered (MT CO2e)"]
[null,null,"Carbon Sequestration","TOTAL"]
["Dstart",{"$f":"'Background Controls'!I5","v":"Residential"},{"$f":"((C11*D11*Factors!$B$363*100)*44/12)","v":0},{"$f":"C37","v":0}]
[null,{"$f":"'Background Controls'!I6","v":"Commercial/Institutional"},{"$f":"((C12*D12*Factors!$B$363*100)*44/12)","v":199228.07365439096},{"$f":"C38","v":199228.07365439096}]
[null,{"$f":"'Background Controls'!I7","v":"Industrial"},{"$f":"((C13*D13*Factors!$B$363*100)*44/12)","v":0},0]
[null,{"$f":"'Background Controls'!I8","v":"Energy Generation"},{"$f":"((C14*D14*Factors!$B$363*100)*44/12)","v":0},0]
[null,{"$f":"'Background Controls'!I9","v":0},{"$f":"((C15*D15*Factors!$B$363*100)*44/12)","v":0},0]
[null,{"$f":"'Background Controls'!I10","v":0},{"$f":"((C16*D16*Factors!$B$363*100)*44/12)","v":0},0]
[null,{"$f":"'Background Controls'!I11","v":0},{"$f":"((C17*D17*Factors!$B$363*100)*44/12)","v":0},0]
[null,{"$f":"'Background Controls'!I12","v":0},{"$f":"((C18*D18*Factors!$B$363*100)*44/12)","v":0},0]
[null,{"$f":"'Background Controls'!I13","v":0},{"$f":"((C19*D19*Factors!$B$363*100)*44/12)","v":0},0]
[null,{"$f":"'Background Controls'!I14","v":0},{"$f":"((C20*D20*Factors!$B$363*100)*44/12)","v":0},0]
[null,{"$f":"'Background Controls'!I15","v":0},{"$f":"((C21*D21*Factors!$B$363*100)*44/12)","v":0},0]
[null,{"$f":"'Background Controls'!I16","v":0},{"$f":"((C22*D22*Factors!$B$363*100)*44/12)","v":0},0]
[null,{"$f":"'Background Controls'!I17","v":0},{"$f":"((C23*D23*Factors!$B$363*100)*44/12)","v":0},0]
[null,{"$f":"'Background Controls'!I18","v":0},{"$f":"((C24*D24*Factors!$B$363*100)*44/12)","v":0},0]
[null,{"$f":"'Background Controls'!I19","v":0},{"$f":"((C25*D25*Factors!$B$363*100)*44/12)","v":0},0]
[null,{"$f":"'Background Controls'!I20","v":0},{"$f":"((C26*D26*Factors!$B$363*100)*44/12)","v":0},0]
[null,{"$f":"'Background Controls'!I21","v":0},{"$f":"((C27*D27*Factors!$B$363*100)*44/12)","v":0},0]
[null,{"$f":"'Background Controls'!I22","v":0},{"$f":"((C28*D28*Factors!$B$363*100)*44/12)","v":0},0]
[null,{"$f":"'Background Controls'!I23","v":0},{"$f":"((C29*D29*Factors!$B$363*100)*44/12)","v":0},0]
[null,{"$f":"'Background Controls'!I24","v":0},{"$f":"((C30*D30*Factors!$B$363*100)*44/12)","v":0},0]
[null,"Total Sequestration from Urban Trees",{"$f":"IF(ISERROR(SUM(C37:C56)),\"\",SUM(C37:C56))","v":199228.07365439096},{"$f":"C57","v":199228.07365439096}]
[]
[]
[]
[]
[]
[]
[]
[]
[]
[]
[]
["Local GHG Inventory Tool: Community Module"]

{"sheet":"Waste Production","index":29,"n_rows":41,"n_cols":4,"rows_kept":41,"cut":false,"hidden":false,"merged":[[8,1,8,3],[40,0,40,13]]}
["Waste Production"]
[]
[]
[null,"To calculate Scope 3 emissions from waste, please visit  EPA's WAste Reduction Model (WARM). WARM is available both as a web-based calculator and in an Excel spreadsheet."]
[null,"https://www.epa.gov/warm"]
[]
[{"$f":"IF('Solid Waste-Control'!$A$10=2, \"Show\", \"Hide\")","v":"Hide"},"Please enter the results from EPA's WARM model here. "]
[{"$f":"IF('Solid Waste-Control'!$A$10=2, \"Show\", \"Hide\")","v":"Hide"}]
[{"$f":"IF('Solid Waste-Control'!$A$10=2, \"Show\", \"Hide\")","v":"Hide"},"Enter value from Baseline Waste Management Scenario."]
[{"$f":"IF('Solid Waste-Control'!$A$10=2, \"Show\", \"Hide\")","v":"Hide"}]
[{"$f":"IF('Solid Waste-Control'!$A$10=2, \"Show\", \"Hide\")","v":"Hide"},"Solid Waste Emissions (Scope 3)",null,"MT CO2e"]
[{"$f":"IF('Solid Waste-Control'!$A$10=2, \"Show\", \"Hide\")","v":"Hide"}]
[{"$f":"IF('Solid Waste-Control'!$A$10=2, \"Show\", \"Hide\")","v":"Hide"}]
[{"$f":"IF('Solid Waste-Control'!$A$10=2, \"Show\", \"Hide\")","v":"Hide"},"Please also describe how you would like these emissions to be allocated by sector."]
[{"$f":"IF('Solid Waste-Control'!$A$10=2, \"Show\", \"Hide\")","v":"Hide"},"For example, enter or estimate the percentage of total waste that comes from each sector."]
[{"$f":"IF('Solid Waste-Control'!$A$10=2, \"Show\", \"Hide\")","v":"Hide"},"Sector","Contribution to Total Waste (%)","MT CO2e"]
[{"$f":"IF('Solid Waste-Control'!$A$10=2, \"Dstart\", \"Hide\")","v":"Hide"},{"$f":"'Background Controls'!I5","v":"Residential"},null,{"$f":"$C$11*C17","v":0}]
[{"$f":"IF('Solid Waste-Control'!$A$10=2, \"Show\", \"Hide\")","v":"Hide"},{"$f":"'Background Controls'!I6","v":"Commercial/Institutional"},null,{"$f":"$C$11*C18","v":0}]
[{"$f":"IF('Solid Waste-Control'!$A$10=2, \"Show\", \"Hide\")","v":"Hide"},{"$f":"'Background Controls'!I7","v":"Industrial"},null,0]
[{"$f":"IF('Solid Waste-Control'!$A$10=2, \"Show\", \"Hide\")","v":"Hide"},{"$f":"'Background Controls'!I8","v":"Energy Generation"},null,0]
[{"$f":"IF('Solid Waste-Control'!$A$10=2, \"Show\", \"Hide\")","v":"Hide"},{"$f":"'Background Controls'!I9","v":0},null,0]
[{"$f":"IF('Solid Waste-Control'!$A$10=2, \"Show\", \"Hide\")","v":"Hide"},{"$f":"'Background Controls'!I10","v":0},null,0]
[{"$f":"IF('Solid Waste-Control'!$A$10=2, \"Show\", \"Hide\")","v":"Hide"},{"$f":"'Background Controls'!I11","v":0},null,0]
[{"$f":"IF('Solid Waste-Control'!$A$10=2, \"Show\", \"Hide\")","v":"Hide"},{"$f":"'Background Controls'!I12","v":0},null,0]
[{"$f":"IF('Solid Waste-Control'!$A$10=2, \"Show\", \"Hide\")","v":"Hide"},{"$f":"'Background Controls'!I13","v":0},null,0]
[{"$f":"IF('Solid Waste-Control'!$A$10=2, \"Show\", \"Hide\")","v":"Hide"},{"$f":"'Background Controls'!I14","v":0},null,0]
[{"$f":"IF('Solid Waste-Control'!$A$10=2, \"Show\", \"Hide\")","v":"Hide"},{"$f":"'Background Controls'!I15","v":0},null,0]
[{"$f":"IF('Solid Waste-Control'!$A$10=2, \"Show\", \"Hide\")","v":"Hide"},{"$f":"'Background Controls'!I16","v":0},null,0]
[{"$f":"IF('Solid Waste-Control'!$A$10=2, \"Show\", \"Hide\")","v":"Hide"},{"$f":"'Background Controls'!I17","v":0},null,0]
[{"$f":"IF('Solid Waste-Control'!$A$10=2, \"Show\", \"Hide\")","v":"Hide"},{"$f":"'Background Controls'!I18","v":0},null,0]
[{"$f":"IF('Solid Waste-Control'!$A$10=2, \"Show\", \"Hide\")","v":"Hide"},{"$f":"'Background Controls'!I19","v":0},null,0]
[{"$f":"IF('Solid Waste-Control'!$A$10=2, \"Show\", \"Hide\")","v":"Hide"},{"$f":"'Background Controls'!I20","v":0},null,0]
[{"$f":"IF('Solid Waste-Control'!$A$10=2, \"Show\", \"Hide\")","v":"Hide"},{"$f":"'Background Controls'!I21","v":0},null,0]
[{"$f":"IF('Solid Waste-Control'!$A$10=2, \"Show\", \"Hide\")","v":"Hide"},{"$f":"'Background Controls'!I22","v":0},null,0]
[{"$f":"IF('Solid Waste-Control'!$A$10=2, \"Show\", \"Hide\")","v":"Hide"},{"$f":"'Background Controls'!I23","v":0},null,0]
[{"$f":"IF('Solid Waste-Control'!$A$10=2, \"Show\", \"Hide\")","v":"Hide"},{"$f":"'Background Controls'!I24","v":0},null,0]
[{"$f":"IF('Solid Waste-Control'!$A$10=2, \"Show\", \"Hide\")","v":"Hide"},"Total",{"$f":"SUM(C17:C36)","v":0},{"$f":"SUM(D17:D36)","v":0}]
[{"$f":"IF('Solid Waste-Control'!$A$10=2, \"Show\", \"Hide\")","v":"Hide"}]
[]
[]
["Local GHG Inventory Tool: Community Module"]

{"sheet":"Additional Emission Sources","index":30,"n_rows":29,"n_cols":17,"rows_kept":29,"cut":false,"hidden":false,"merged":[[13,4,13,10],[28,0,28,14]]}
["Additional Emission Sources"]
[]
[]
[]
[]
[]
[]
[]
[2,"1) Would you like to add any additional emission sources?",null,null,null,null,null,null,null,null,null,null,null,null,null,null,1]
[]
[{"$f":"IF($Q$9=1, \"Show\", \"Hide\")","v":"Show"}]
[]
[]
[{"$f":"IF($Q$9=1, \"Show\", \"Hide\")","v":"Show"},null,null,null,"MT CO2e"]
[{"$f":"IF($Q$9=1, \"Show\", \"Hide\")","v":"Show"},"Description","Sector","Scope","CO2","CH4","N2O","HFCs","PFCs","SF6","Total"]
[{"$f":"IF($Q$9=1, \"Show\", \"Hide\")","v":"Show"},"Aviation Fuel Consumption (FY22/23)","Commercial/Institutional",3,{"$f":"AVERAGE(2357920,4738497)*9.75*0.001","v":34595.032874999997},{"$f":"AVERAGE(2357920,4738497)*0*0.001","v":0},{"$f":"AVERAGE(2357920,4738497)*0.0003*0.001*265","v":282.08257574999999},null,null,null,{"$f":"SUM(E16:J16)","v":34877.115450749996}]
["Show",null,null,null,null,null,null,null,null,null,0]
["Show",null,null,null,null,null,null,null,null,null,0]
["Show",null,null,null,null,null,null,null,null,null,0]
["Show",null,null,null,null,null,null,null,null,null,0]
["Show",null,null,null,null,null,null,null,null,null,0]
["Show",null,null,null,null,null,null,null,null,null,0]
["Show",null,null,null,null,null,null,null,null,null,0]
["Show",null,null,null,null,null,null,null,null,null,0]
["Show",null,null,null,null,null,null,null,null,null,0]
[]
[]
[]
["Local GHG Inventory Tool: Community Module"]

{"sheet":"Summary-Emissions","index":31,"n_rows":149,"n_cols":31,"rows_kept":149,"cut":false,"hidden":false,"merged":[[114,0,114,20],[88,1,88,12],[2,1,2,9],[2,22,2,30],[10,22,10,30],[11,1,11,9],[41,1,41,3]]}
["Inventory Emissions Summary"]
[null,null,null,null,null,{"$f":"IF(SUM('Additional Emission Sources'!H16:H25)>0, \"Show\", \"Hide\")","v":"Hide"},{"$f":"IF(SUM('Additional Emission Sources'!I16:I25)>0, \"Show\", \"Hide\")","v":"Hide"},{"$f":"IF(SUM('Additional Emission Sources'!J16:J25)>0, \"Show\", \"Hide\")","v":"Hide"},null,null,null,"Scope 2 Emissions Selection:","Location Based"]
[null,{"$f":" \"Total \" &MyCity &\" Emissions  (MT CO2e)\"","v":"Total Commonwealth of the Northern Mariana Islands Emissions  (MT CO2e)"},null,null,null,null,null,null,null,null,null,null,{"$f":"IF(ISERROR(I25/MyPopulation),0,I25/MyPopulation)","v":9.3635355266475209},{"$f":"\"Per capita Emissions for \"&MyCity &\"  (MT CO2e/person) \"","v":"Per capita Emissions for Commonwealth of the Northern Mariana Islands  (MT CO2e/person) "},null,null,null,null,null,null,null,null,{"$f":" \"Total \" &MyCity &\" Emissions  (MT CO2e)\"","v":"Total Commonwealth of the Northern Mariana Islands Emissions  (MT CO2e)"}]
[null,null,"CO2","CH4","N2O","HFCs","PFCs","SF6","Total MT CO2e","Percent of Total",null,null,null,null,null,null,null,null,null,null,null,null,null,"CO2","CH4","N2O","HFCs","PFCs","SF6","Total MT CO2e","Percent of Total"]
[null,"Scope 1",{"$f":"SUMIF($A$14:$A$24, RIGHT($B5, 1), C$14:C$24)+SUMIF('Additional Emission Sources'!$D$16:$D$25,  RIGHT($B5,1), 'Additional Emission Sources'!E$16:E$25)","v":397273.13640879397},{"$f":"SUMIF($A$14:$A$24, RIGHT($B5, 1), D$14:D$24)+SUMIF('Additional Emission Sources'!$D$16:$D$25,  RIGHT($B5,1), 'Additional Emission Sources'!F$16:F$25)","v":6568.1347987671061},{"$f":"SUMIF($A$14:$A$24, RIGHT($B5, 1), E$14:E$24)+SUMIF('Additional Emission Sources'!$D$16:$D$25,  RIGHT($B5,1), 'Additional Emission Sources'!G$16:G$25)","v":4448.386282389466},{"$f":"SUMIF('Additional Emission Sources'!$D$16:$D$25,  RIGHT($B5,1), 'Additional Emission Sources'!H$16:H$25)","v":0},{"$f":"SUMIF('Additional Emission Sources'!$D$16:$D$25,  RIGHT($B5,1), 'Additional Emission Sources'!I$16:I$25)","v":0},{"$f":"SUMIF('Additional Emission Sources'!$D$16:$D$25,  RIGHT($B5,1), 'Additional Emission Sources'!J$16:J$25)","v":0},{"$f":"SUM(C5:H5)","v":408289.65748995054},{"$f":"IF($I$9=0,0,I5/$I$9)","v":0.92130024726511517},null,null,null,null,null,null,null,null,null,null,null,null,"Scope 1",{"$f":"C5","v":397273.13640879397},{"$f":"D5","v":6568.1347987671061},4448.386282389466,0,0,0,408289.65748995054,0.92130024726511517]
[null,"Scope 2 - Location Based",{"$f":"SUMIF($A$14:$A$24, RIGHT(LEFT($B6, 11),5), C$14:C$24)+SUMIF('Additional Emission Sources'!$D$16:$D$25,  RIGHT(LEFT($B6, 7),1), 'Additional Emission Sources'!E$16:E$25)","v":0},{"$f":"SUMIF($A$14:$A$24, RIGHT(LEFT($B6, 11),5), D$14:D$24)+SUMIF('Additional Emission Sources'!$D$16:$D$25,  RIGHT(LEFT($B6, 7),1), 'Additional Emission Sources'!F$16:F$25)","v":0},{"$f":"SUMIF($A$14:$A$24, RIGHT(LEFT($B6, 11),5), E$14:E$24)+SUMIF('Additional Emission Sources'!$D$16:$D$25,  RIGHT(LEFT($B6, 7),1), 'Additional Emission Sources'!G$16:G$25)","v":0},{"$f":"SUMIF('Additional Emission Sources'!$D$16:$D$25,  RIGHT($B6,1), 'Additional Emission Sources'!H$16:H$25)","v":0},{"$f":"SUMIF('Additional Emission Sources'!$D$16:$D$25,  RIGHT($B6,1), 'Additional Emission Sources'!I$16:I$25)","v":0},{"$f":"SUMIF('Additional Emission Sources'!$D$16:$D$25,  RIGHT($B6,1), 'Additional Emission Sources'!J$16:J$25)","v":0},0,{"$f":"IF(OR($I$9=0,$M$2=\"Market Based\"),\"\",I6/$I$9)","v":0},null,null,null,null,null,null,null,null,null,null,null,null,"Scope 2 - Location Based",{"$f":"IF($M$2=\"Market Based\",C7,C6)","v":0},{"$f":"IF($M$2=\"Market Based\",D7,D6)","v":0},0,0,0,0,0,0]
[null,"Scope 2 - Market Based\n(for informational purposes only)",{"$f":"SUMIF($A$14:$A$24, RIGHT(LEFT($B7, 11),5), C$14:C$24)+SUMIF('Additional Emission Sources'!$D$16:$D$25,  RIGHT(LEFT($B7, 7),1), 'Additional Emission Sources'!E$16:E$25)","v":0},{"$f":"SUMIF($A$14:$A$24, RIGHT(LEFT($B7, 11),5), D$14:D$24)+SUMIF('Additional Emission Sources'!$D$16:$D$25,  RIGHT(LEFT($B7, 7),1), 'Additional Emission Sources'!F$16:F$25)","v":0},{"$f":"SUMIF($A$14:$A$24, RIGHT(LEFT($B7, 11),5), E$14:E$24)+SUMIF('Additional Emission Sources'!$D$16:$D$25,  RIGHT(LEFT($B7, 7),1), 'Additional Emission Sources'!G$16:G$25)","v":0},null,null,null,0,{"$f":"IF(OR($I$9=0,$M$2=\"Location Based\"),\"\",I7/$I$9)","v":""},null,null,null,null,null,null,null,null,null,null,null,null,"Scope 3",{"$f":"C8","v":0},{"$f":"D8","v":0},0,0,0,0,0,0]
[null,"Scope 3",{"$f":"SUMIF($A$13:$A$21, RIGHT($B7, 1), C$13:C$21)+SUMIF('Additional Emission Sources'!$D$16:$D$25,  RIGHT($B7,1), 'Additional Emission Sources'!E$16:E$25)","v":0},{"$f":"SUMIF($A$13:$A$21, RIGHT($B7, 1), D$13:D$21)+SUMIF('Additional Emission Sources'!$D$16:$D$25,  RIGHT($B7,1), 'Additional Emission Sources'!F$16:F$25)","v":0},{"$f":"SUMIF($A$13:$A$21, RIGHT($B7, 1), E$13:E$21)+SUMIF('Additional Emission Sources'!$D$16:$D$25,  RIGHT($B7,1), 'Additional Emission Sources'!G$16:G$25)","v":0},{"$f":"SUMIF($A$13:$A$21, RIGHT($B7, 1), F$13:F$21)+SUMIF('Additional Emission Sources'!$D$16:$D$25,  RIGHT($B7,1), 'Additional Emission Sources'!H$16:H$25)","v":0},{"$f":"SUMIF($A$13:$A$21, RIGHT($B7, 1), G$13:G$21)+SUMIF('Additional Emission Sources'!$D$16:$D$25,  RIGHT($B7,1), 'Additional Emission Sources'!I$16:I$25)","v":0},{"$f":"SUMIF($A$13:$A$21, RIGHT($B7, 1), H$13:H$21)+SUMIF('Additional Emission Sources'!$D$16:$D$25,  RIGHT($B7,1), 'Additional Emission Sources'!J$16:J$25)","v":0},0,{"$f":"IF($I$9=0,0,I8/$I$9)","v":0},null,null,null,null,null,null,null,null,null,null,null,null,"Total Gross Emissions",{"$f":"C9","v":431868.16928379395},6568.1347987671061,4730.4688581394657,0,0,0,443166.77294070052,0.92130024726511517]
[null,"Total Gross Emissions",{"$f":"C25","v":431868.16928379395},6568.1347987671061,4730.4688581394657,{"$f":"SUM(F5:F8)","v":0},0,0,443166.77294070052,{"$f":"SUM(J5:J8)","v":0.92130024726511517},null,null,null,null,null,null,null,null,null,null,null,null,"Total Net Emissions",{"$f":"C10","v":232640.09562940299},6568.1347987671061,4730.4688581394657,0,0,0,243938.69928630957,0.92130024726511517]
[null,"Total Net Emissions",232640.09562940299,6568.1347987671061,4730.4688581394657,0,0,0,243938.69928630957,{"$f":"SUM(J5:J8)","v":0.92130024726511517}]
[null,null,null,null,null,null,null,null,null,null,null,null,null,null,null,null,null,null,null,null,null,null,"Emissions by Source (MT CO2e)"]
[null,"Emissions by Source (MT CO2e)",null,null,null,null,null,null,null,null,null,null,null,null,null,null,null,null,null,null,null,null,"Source","CO2","CH4","N2O","HFCs","PFCs","SF6","Total","Percent of Total"]
["Scope","Source","CO2","CH4","N2O","HFCs","PFCs","SF6","Total","Percent of Total",null,null,null,null,null,null,null,null,null,null,null,null,"Stationary Combustion",{"$f":"C14","v":223840.08601879395},{"$f":"D14","v":253.68392450000002},480.18742851785709,"-","-","-",224573.95737181179,0.50674818394352339]
[1,"Stationary Combustion",{"$f":"'Stationary-Calcs'!C43","v":223840.08601879395},{"$f":"'Stationary-Calcs'!D43","v":253.68392450000002},{"$f":"'Stationary-Calcs'!E43","v":480.18742851785709},"-","-","-",{"$f":"SUM(C14:H14)","v":224573.95737181179},{"$f":"IF($I$9=0,0,I14/$I$9)","v":0.50674818394352339},null,null,null,null,null,null,null,null,null,null,null,null,"Mobile Combustion",{"$f":"C15","v":173433.05038999999},1154.5636270620482,3323.2435692733948,"-","-","-",177910.85758633542,0.40145351242328225]
[1,"Mobile Combustion",{"$f":"'Mobile-Summary'!C27","v":173433.05038999999},{"$f":"'Mobile-Summary'!D27","v":1154.5636270620482},{"$f":"'Mobile-Summary'!E27","v":3323.2435692733948},"-","-","-",177910.85758633542,0.40145351242328225,null,null,null,null,null,null,null,null,null,null,null,null,"Solid Waste",{"$f":"C16","v":"-"},376.78070920505888,"-","-","-","-",376.78070920505888,8.5020071948281042E-4]
[1,"Solid Waste","-",{"$f":"'Solid Waste-Entry'!$C$80","v":376.78070920505888},"-","-","-","-",376.78070920505888,8.5020071948281042E-4,null,null,null,null,null,null,null,null,null,null,null,null,"Wastewater Treatment",{"$f":"C17","v":"-"},4783.1065379999991,644.95528459821412,"-","-","-",5428.0618225982134,1.2248350178826547E-2]
[1,"Wastewater Treatment","-",{"$f":"'Wastewater- Calcs'!D15","v":4783.1065379999991},{"$f":"'Wastewater- Calcs'!D16","v":644.95528459821412},"-","-","-",5428.0618225982134,1.2248350178826547E-2,null,null,null,null,null,null,null,null,null,null,null,null,{"$f":"\"Electricity - \" &M2","v":"Electricity - Location Based"},{"$f":"IF($M$2=\"Market Based\",C19,C18)","v":0},{"$f":"IF($M$2=\"Market Based\",D19,D18)","v":0},0,"-","-","-",0,0]
["2 - L","Electricity - Location Based",{"$f":"'Electricity LocationBased-Calcs'!C40","v":0},{"$f":"'Electricity LocationBased-Calcs'!D40","v":0},{"$f":"'Electricity LocationBased-Calcs'!E40","v":0},"-","-","-",0,{"$f":"IF(OR($I$9=0,M2=\"Market Based\"),\"\",I18/$I$9)","v":0},null,null,null,null,null,null,null,null,null,null,null,null,"Water",{"$f":"C20","v":0},{"$f":"D20","v":0},0,"-","-","-",0,0]
["2 - M","Electricity - Market Based \n(for informational purposes only)",{"$f":"'Electricity MarketBased-Calcs'!C40","v":0},{"$f":"'Electricity MarketBased-Calcs'!D40","v":0},{"$f":"'Electricity MarketBased-Calcs'!E40","v":0},null,null,null,0,{"$f":"IF(OR($I$9=0,M2=\"Location Based\"),\"\",I19/$I$9)","v":""},null,null,null,null,null,null,null,null,null,null,null,null,"Ag & :and Management","-","-",0,0,0,0,0,0]
[3,"Water",{"$f":"Water!C73","v":0},{"$f":"Water!D73","v":0},{"$f":"Water!E73","v":0},"-","-","-",0,0,null,null,null,null,null,null,null,null,null,null,null,null,"Urban Forestry",-199228.07365439096,"-","-",0,0,0,-199228.07365439096,-0.44955553037603152]
[3,"Ag & Land Management","-","-",{"$f":"'Agriculture & Land Management'!F56","v":0},null,null,null,0,0,null,null,null,null,null,null,null,null,null,null,null,null,"Waste Generation","-",0,"-",0,0,0,0,0]
[3,"Urban Forestry",{"$f":"-'Urban Forestry'!D57","v":-199228.07365439096},"-","-",null,null,null,-199228.07365439096,-0.44955553037603152,null,null,null,null,null,null,null,null,null,null,null,null,"Other",34595.032874999997,0,282.08257574999999,0,0,0,34877.115450749996,7.8699752734884859E-2]
[3,"Waste Generation","-",{"$f":"'Waste Production'!C11","v":0},"-",null,null,null,0,0,null,null,null,null,null,null,null,null,null,null,null,null,"Total (Gross Emissions)",431868.16928379395,6568.1347987671061,4730.4688581394657,0,0,0,443166.77294070052,1]
[{"$f":"IF(SUM('Additional Emission Sources'!K16:K25)>0, \"Show\", \"Hide\")","v":"Show"},"Other",{"$f":"SUM('Additional Emission Sources'!E16:E25)","v":34595.032874999997},{"$f":"SUM('Additional Emission Sources'!F16:F25)","v":0},{"$f":"SUM('Additional Emission Sources'!G16:G25)","v":282.08257574999999},{"$f":"SUM('Additional Emission Sources'!H16:H25)","v":0},{"$f":"SUM('Additional Emission Sources'!I16:I25)","v":0},{"$f":"SUM('Additional Emission Sources'!J16:J25)","v":0},{"$f":"SUM(C24:H24)","v":34877.115450749996},{"$f":"IFERROR(I24/$I$9,0)","v":7.8699752734884859E-2},null,null,null,null,null,null,null,null,null,null,null,null,"Total (Net Emissions)",{"$f":"C26","v":232640.09562940299},{"$f":"SUM(Y13:Y21)","v":6568.1347987671061},{"$f":"SUM(Z13:Z21)","v":4448.386282389466},null,null,null,{"$f":"SUM(AD13:AD18,AD20:AD21)+AD19","v":209061.58383555958},{"$f":"IF($I$10=0,0,AD24/$I$9)","v":0.47174471688908365}]
[null,"Total (Gross Emissions)",{"$f":"IF($M$2=\"Market Based\",SUM(C14:C17,C19,C20:C21,C23:C24),SUM(C14:C17,C18,C20:C21,C23:C24))","v":431868.16928379395},{"$f":"IF($M$2=\"Market Based\",SUM(D14:D17,D19,D20:D21,D23:D24),SUM(D14:D17,D18,D20:D21,D23:D24))","v":6568.1347987671061},{"$f":"IF($M$2=\"Market Based\",SUM(E14:E17,E19,E20:E21,E23:E24),SUM(E14:E17,E18,E20:E21,E23:E24))","v":4730.4688581394657},{"$f":"IF($M$2=\"Market Based\",SUM(F14:F17,F19,F20:F21,F23:F24),SUM(F14:F17,F19,F20:F21,F23:F24))","v":0},{"$f":"IF($M$2=\"Market Based\",SUM(G14:G17,G19,G20:G21,G23:G24),SUM(G14:G17,G19,G20:G21,G23:G24))","v":0},{"$f":"IF($M$2=\"Market Based\",SUM(H14:H17,H19,H20:H21,H23:H24),SUM(H14:H17,H19,H20:H21,H23:H24))","v":0},{"$f":"IF($M$2=\"Market Based\",SUM(I14:I17,I19,I20:I21,I23:I24),SUM(I14:I17,I18,I20:I21,I23:I24))","v":443166.77294070052},{"$f":"IF($I$9=0,0,I25/$I$9)","v":1}]
[null,"Total (Net Emissions)",{"$f":"IF($M$2=\"Market Based\",SUM(C14:C17,C19,C20:C21,C23:C24)+C22,SUM(C14:C17,C18,C20:C21,C23:C24)+C22)","v":232640.09562940299},{"$f":"D25","v":6568.1347987671061},{"$f":"E25","v":4730.4688581394657},{"$f":"IF($M$2=\"Market Based\",SUM(F14:F17,F19,F20:F21,F23:F24)+F22,SUM(F14:F17,F19,F20:F21,F23:F24)+F22)","v":0},{"$f":"IF($M$2=\"Market Based\",SUM(G14:G17,G19,G20:G21,G23:G24)+G22,SUM(G14:G17,G19,G20:G21,G23:G24)+G22)","v":0},{"$f":"IF($M$2=\"Market Based\",SUM(H14:H17,H19,H20:H21,H23:H24)+H22,SUM(H14:H17,H19,H20:H21,H23:H24)+H22)","v":0},{"$f":"IF($M$2=\"Market Based\",SUM(I14:I17,I19,I20:I21,I23:I24)+I22,SUM(I14:I17,I18,I20:I21,I23:I24)+I22)","v":243938.69928630957},{"$f":"IF($I$10=0,0,I26/$I$9)","v":0.55044446962396842}]
[]
[]
[]
[]
[]
[]
[]
[]
[]
[]
[]
[]
[]
[]
[]
[null,"Gross Emissions by Sector",null,null,null,null,null,null,null,null,null,null,null,null,null,null,null,null,null,null,null,null,null,{"$f":"B44&\" (\"&TEXT(D44,\"#0%)\")","v":"Residential (0%)"}]
[null,"Sector","Total (MT CO2e)","Percent of Total",null,null,null,null,null,null,null,null,null,null,null,null,null,null,null,null,null,null,null,"Commercial/Institutional (52%)"]
["Dstart",{"$f":"'Background Controls'!I5","v":"Residential"},{"$f":"SUMIF($B$128:$B$149, B44, $M$128:$M$149)","v":0},{"$f":"IF($I$9=0,0,C44/$I$9)","v":0},null,null,null,null,null,null,null,null,null,null,null,null,null,null,null,null,null,null,null,"Industrial (0%)"]
[null,{"$f":"'Background Controls'!I6","v":"Commercial/Institutional"},{"$f":"SUMIF($B$128:$B$149, B45, $M$128:$M$149)","v":230262.45805968362},{"$f":"IF($I$9=0,0,C45/$I$9)","v":0.51958421099971475},null,null,null,null,null,null,null,null,null,null,null,null,null,null,null,null,null,null,null,"Energy Generation (48%)"]
[null,{"$f":"'Background Controls'!I7","v":"Industrial"},92.192014285714293,{"$f":"IF($I$9=0,0,C46/$I$9)","v":2.080300688473555E-4},null,null,null,null,null,null,null,null,null,null,null,null,null,null,null,null,null,null,null,"0 (0%)"]
[null,{"$f":"'Background Controls'!I8","v":"Energy Generation"},212435.34215752609,0.47935755821195497,null,null,null,null,null,null,null,null,null,null,null,null,null,null,null,null,null,null,null,"0 (0%)"]
[null,{"$f":"'Background Controls'!I9","v":0},0,0,null,null,null,null,null,null,null,null,null,null,null,null,null,null,null,null,null,null,null,"0 (0%)"]
[null,{"$f":"'Background Controls'!I10","v":0},0,0,null,null,null,null,null,null,null,null,null,null,null,null,null,null,null,null,null,null,null,"0 (0%)"]
[null,{"$f":"'Background Controls'!I11","v":0},0,0,null,null,null,null,null,null,null,null,null,null,null,null,null,null,null,null,null,null,null,"0 (0%)"]
[null,{"$f":"'Background Controls'!I12","v":0},0,0,null,null,null,null,null,null,null,null,null,null,null,null,null,null,null,null,null,null,null,"0 (0%)"]
[null,{"$f":"'Background Controls'!I13","v":0},0,0,null,null,null,null,null,null,null,null,null,null,null,null,null,null,null,null,null,null,null,"0 (0%)"]
[null,{"$f":"'Background Controls'!I14","v":0},0,0,null,null,null,null,null,null,null,null,null,null,null,null,null,null,null,null,null,null,null,"0 (0%)"]
[null,{"$f":"'Background Controls'!I15","v":0},0,0,null,null,null,null,null,null,null,null,null,null,null,null,null,null,null,null,null,null,null,"0 (0%)"]
[null,{"$f":"'Background Controls'!I16","v":0},0,0,null,null,null,null,null,null,null,null,null,null,null,null,null,null,null,null,null,null,null,"0 (0%)"]
[null,{"$f":"'Background Controls'!I17","v":0},0,0,null,null,null,null,null,null,null,null,null,null,null,null,null,null,null,null,null,null,null,"0 (0%)"]
[null,{"$f":"'Background Controls'!I18","v":0},0,0,null,null,null,null,null,null,null,null,null,null,null,null,null,null,null,null,null,null,null,"0 (0%)"]
[null,{"$f":"'Background Controls'!I19","v":0},0,0,null,null,null,null,null,null,null,null,null,null,null,null,null,null,null,null,null,null,null,"0 (0%)"]
[null,{"$f":"'Background Controls'!I20","v":0},0,0,null,null,null,null,null,null,null,null,null,null,null,null,null,null,null,null,null,null,null,"0 (0%)"]
[null,{"$f":"'Background Controls'!I21","v":0},0,0,null,null,null,null,null,null,null,null,null,null,null,null,null,null,null,null,null,null,null,"0 (0%)"]
[null,{"$f":"'Background Controls'!I22","v":0},0,0,null,null,null,null,null,null,null,null,null,null,null,null,null,null,null,null,null,null,null,"0 (0%)"]
[null,{"$f":"'Background Controls'!I23","v":0},0,0,null,null,null,null,null,null,null,null,null,null,null,null,null,null,null,null,null,null,null,"Total (100%)"]
[null,{"$f":"'Background Controls'!I24","v":0},0,0]
[null,"Total",{"$f":"SUM(C44:C63)","v":442789.99223149545},{"$f":"SUM(D44:D63)","v":0.99914979928051717}]
[]
[]
[]
[]
[]
[]
[]
[]
[]
[]
[]
[]
[]
[]
[]
[]
[]
[]
[]
[]
[]
[]
[]
[]
[null,"Total Emissions by Sector and Source (MT CO2e)"]
[null,"Sector","Stationary","Electricity","Mobile","Solid Waste","Waste\nwater","Water","Agriculture & Land Management","Urban Forestry","Other","TOTAL GROSS","TOTAL NET"]
["Dstart",{"$f":"'Background Controls'!I5","v":"Residential"},{"$f":"C128","v":0},{"$f":"G128","v":0},{"$f":"D128","v":0},{"$f":"IF(B$148=$B91, K128+E$148, K128)","v":0},{"$f":"IF(B$149=$B91, F128+F$149, F128)","v":0},{"$f":"H128","v":0},0,0,{"$f":"L128","v":0},{"$f":"SUM(C91:I91,K91)","v":0},{"$f":"SUM(C91:K91)","v":0}]
[null,{"$f":"'Background Controls'!I6","v":"Commercial/Institutional"},{"$f":"C129","v":12046.423200000001},{"$f":"G129","v":0},{"$f":"D129","v":177910.85758633542},{"$f":"IF(B$148=$B92, K129+E$148, K129)","v":0},{"$f":"IF(B$149=$B92, F129+F$149, F129)","v":5428.0618225982134},0,0,-199228.07365439096,{"$f":"L129","v":34877.115450749996},230262.45805968362,31034.384405292665]
[null,{"$f":"'Background Controls'!I7","v":"Industrial"},92.192014285714293,0,0,0,0,0,0,0,0,92.192014285714293,92.192014285714293]
[null,{"$f":"'Background Controls'!I8","v":"Energy Generation"},212435.34215752609,0,0,0,0,0,0,0,0,212435.34215752609,212435.34215752609]
[null,{"$f":"'Background Controls'!I9","v":0},0,0,0,0,0,0,0,0,0,0,0]
[null,{"$f":"'Background Controls'!I10","v":0},0,0,0,0,0,0,0,0,0,0,0]
[null,{"$f":"'Background Controls'!I11","v":0},0,0,0,0,0,0,0,0,0,0,0]
[null,{"$f":"'Background Controls'!I12","v":0},0,0,0,0,0,0,0,0,0,0,0]
[null,{"$f":"'Background Controls'!I13","v":0},0,0,0,0,0,0,0,0,0,0,0]
[null,{"$f":"'Background Controls'!I14","v":0},0,0,0,0,0,0,0,0,0,0,0]
[null,{"$f":"'Background Controls'!I15","v":0},0,0,0,0,0,0,0,0,0,0,0]
[null,{"$f":"'Background Controls'!I16","v":0},0,0,0,0,0,0,0,0,0,0,0]
[null,{"$f":"'Background Controls'!I17","v":0},0,0,0,0,0,0,0,0,0,0,0]
[null,{"$f":"'Background Controls'!I18","v":0},0,0,0,0,0,0,0,0,0,0,0]
[null,{"$f":"'Background Controls'!I19","v":0},0,0,0,0,0,0,0,0,0,0,0]
[null,{"$f":"'Background Controls'!I20","v":0},0,0,0,0,0,0,0,0,0,0,0]
[null,{"$f":"'Background Controls'!I21","v":0},0,0,0,0,0,0,0,0,0,0,0]
[null,{"$f":"'Background Controls'!I22","v":0},0,0,0,0,0,0,0,0,0,0,0]
[null,{"$f":"'Background Controls'!I23","v":0},0,0,0,0,0,0,0,0,0,0,0]
[null,{"$f":"'Background Controls'!I24","v":0},0,0,0,0,0,0,0,0,0,0,0]
[null,"Total",{"$f":"SUM(C91:C110)","v":224573.95737181179},{"$f":"SUM(D91:D110)","v":0},177910.85758633542,0,5428.0618225982134,0,0,-199228.07365439096,34877.115450749996,{"$f":"SUM(L91:L110)","v":442789.99223149545},{"$f":"SUM(M91:M110)","v":243561.91857710446}]
[]
[]
[]
["Local GHG Inventory Tool: Community Module"]
[]
[]
[]
[]
[]
[]
[]
[]
[]
[]
[null,"Total Emissions by Sector by Source"]
[null,null,"Stationary","Mobile","Solid Waste","Waste-water","Electricity","Water","Ag & Land Management","Urban Forestry","Waste Production","Other","TOTAL Gross","TOTAL Net"]
["Dstart",{"$f":"'Background Controls'!I5","v":"Residential"},{"$f":"'Stationary-Calcs'!F23","v":0},{"$f":"'Mobile-Summary'!F7","v":0},null,null,{"$f":"IF(M$2=\"Location Based\",'Electricity LocationBased-Calcs'!F20,'Electricity MarketBased-Calcs'!F20)","v":0},{"$f":"Water!F53","v":0},{"$f":"'Agriculture & Land Management'!F36","v":0},{"$f":"-'Urban Forestry'!D37","v":0},{"$f":"'Waste Production'!D17","v":0},{"$f":"SUMIF('Additional Emission Sources'!$C$16:$C$25,B128, 'Additional Emission Sources'!$K$16:$K$25)","v":0},{"$f":"SUM(C128:I128,K128:L128)","v":0},{"$f":"SUM(C128:L128)","v":0}]
[null,{"$f":"'Background Controls'!I6","v":"Commercial/Institutional"},{"$f":"'Stationary-Calcs'!F24","v":12046.423200000001},{"$f":"'Mobile-Summary'!F8","v":177910.85758633542},null,null,{"$f":"IF(M$2=\"Location Based\",'Electricity LocationBased-Calcs'!F21,'Electricity MarketBased-Calcs'!F21)","v":0},{"$f":"Water!F54","v":0},{"$f":"'Agriculture & Land Management'!F37","v":0},{"$f":"-'Urban Forestry'!D38","v":-199228.07365439096},{"$f":"'Waste Production'!D18","v":0},{"$f":"SUMIF('Additional Emission Sources'!$C$16:$C$25,B129, 'Additional Emission Sources'!$K$16:$K$25)","v":34877.115450749996},224834.3962370854,25606.322582694447]
[null,{"$f":"'Background Controls'!I7","v":"Industrial"},{"$f":"'Stationary-Calcs'!F25","v":92.192014285714293},{"$f":"'Mobile-Summary'!F9","v":0},null,null,{"$f":"IF(M$2=\"Location Based\",'Electricity LocationBased-Calcs'!F22,'Electricity MarketBased-Calcs'!F22)","v":0},{"$f":"Water!F55","v":0},{"$f":"'Agriculture & Land Management'!F38","v":0},{"$f":"-'Urban Forestry'!D39","v":0},{"$f":"'Waste Production'!D19","v":0},{"$f":"SUMIF('Additional Emission Sources'!$C$16:$C$25,B130, 'Additional Emission Sources'!$K$16:$K$25)","v":0},92.192014285714293,92.192014285714293]
[null,{"$f":"'Background Controls'!I8","v":"Energy Generation"},{"$f":"'Stationary-Calcs'!F26","v":212435.34215752609},{"$f":"'Mobile-Summary'!F10","v":0},null,null,{"$f":"IF(M$2=\"Location Based\",'Electricity LocationBased-Calcs'!F23,'Electricity MarketBased-Calcs'!F23)","v":0},{"$f":"Water!F56","v":0},{"$f":"'Agriculture & Land Management'!F39","v":0},{"$f":"-'Urban Forestry'!D40","v":0},{"$f":"'Waste Production'!D20","v":0},{"$f":"SUMIF('Additional Emission Sources'!$C$16:$C$25,B131, 'Additional Emission Sources'!$K$16:$K$25)","v":0},212435.34215752609,212435.34215752609]
[null,{"$f":"'Background Controls'!I9","v":0},{"$f":"'Stationary-Calcs'!F27","v":0},{"$f":"'Mobile-Summary'!F11","v":0},null,null,{"$f":"IF(M$2=\"Location Based\",'Electricity LocationBased-Calcs'!F24,'Electricity MarketBased-Calcs'!F24)","v":0},{"$f":"Water!F57","v":0},{"$f":"'Agriculture & Land Management'!F40","v":0},{"$f":"-'Urban Forestry'!D41","v":0},{"$f":"'Waste Production'!D21","v":0},{"$f":"SUMIF('Additional Emission Sources'!$C$16:$C$25,B132, 'Additional Emission Sources'!$K$16:$K$25)","v":0},0,0]
[null,{"$f":"'Background Controls'!I10","v":0},{"$f":"'Stationary-Calcs'!F28","v":0},{"$f":"'Mobile-Summary'!F12","v":0},null,null,{"$f":"IF(M$2=\"Location Based\",'Electricity LocationBased-Calcs'!F25,'Electricity MarketBased-Calcs'!F25)","v":0},{"$f":"Water!F58","v":0},{"$f":"'Agriculture & Land Management'!F41","v":0},{"$f":"-'Urban Forestry'!D42","v":0},{"$f":"'Waste Production'!D22","v":0},{"$f":"SUMIF('Additional Emission Sources'!$C$16:$C$25,B133, 'Additional Emission Sources'!$K$16:$K$25)","v":0},0,0]
[null,{"$f":"'Background Controls'!I11","v":0},{"$f":"'Stationary-Calcs'!F29","v":0},{"$f":"'Mobile-Summary'!F13","v":0},null,null,{"$f":"IF(M$2=\"Location Based\",'Electricity LocationBased-Calcs'!F26,'Electricity MarketBased-Calcs'!F26)","v":0},{"$f":"Water!F59","v":0},{"$f":"'Agriculture & Land Management'!F42","v":0},{"$f":"-'Urban Forestry'!D43","v":0},{"$f":"'Waste Production'!D23","v":0},{"$f":"SUMIF('Additional Emission Sources'!$C$16:$C$25,B134, 'Additional Emission Sources'!$K$16:$K$25)","v":0},0,0]
[null,{"$f":"'Background Controls'!I12","v":0},{"$f":"'Stationary-Calcs'!F30","v":0},{"$f":"'Mobile-Summary'!F14","v":0},null,null,{"$f":"IF(M$2=\"Location Based\",'Electricity LocationBased-Calcs'!F27,'Electricity MarketBased-Calcs'!F27)","v":0},{"$f":"Water!F60","v":0},{"$f":"'Agriculture & Land Management'!F43","v":0},{"$f":"-'Urban Forestry'!D44","v":0},{"$f":"'Waste Production'!D24","v":0},{"$f":"SUMIF('Additional Emission Sources'!$C$16:$C$25,B135, 'Additional Emission Sources'!$K$16:$K$25)","v":0},0,0]
[null,{"$f":"'Background Controls'!I13","v":0},{"$f":"'Stationary-Calcs'!F31","v":0},{"$f":"'Mobile-Summary'!F15","v":0},null,null,{"$f":"IF(M$2=\"Location Based\",'Electricity LocationBased-Calcs'!F28,'Electricity MarketBased-Calcs'!F28)","v":0},{"$f":"Water!F61","v":0},{"$f":"'Agriculture & Land Management'!F44","v":0},{"$f":"-'Urban Forestry'!D45","v":0},{"$f":"'Waste Production'!D25","v":0},{"$f":"SUMIF('Additional Emission Sources'!$C$16:$C$25,B136, 'Additional Emission Sources'!$K$16:$K$25)","v":0},0,0]
[null,{"$f":"'Background Controls'!I14","v":0},{"$f":"'Stationary-Calcs'!F32","v":0},{"$f":"'Mobile-Summary'!F16","v":0},null,null,{"$f":"IF(M$2=\"Location Based\",'Electricity LocationBased-Calcs'!F29,'Electricity MarketBased-Calcs'!F29)","v":0},{"$f":"Water!F62","v":0},{"$f":"'Agriculture & Land Management'!F45","v":0},{"$f":"-'Urban Forestry'!D46","v":0},{"$f":"'Waste Production'!D26","v":0},{"$f":"SUMIF('Additional Emission Sources'!$C$16:$C$25,B137, 'Additional Emission Sources'!$K$16:$K$25)","v":0},0,0]
[null,{"$f":"'Background Controls'!I15","v":0},{"$f":"'Stationary-Calcs'!F33","v":0},{"$f":"'Mobile-Summary'!F17","v":0},null,null,{"$f":"IF(M$2=\"Location Based\",'Electricity LocationBased-Calcs'!F30,'Electricity MarketBased-Calcs'!F30)","v":0},{"$f":"Water!F63","v":0},{"$f":"'Agriculture & Land Management'!F46","v":0},{"$f":"-'Urban Forestry'!D47","v":0},{"$f":"'Waste Production'!D27","v":0},{"$f":"SUMIF('Additional Emission Sources'!$C$16:$C$25,B138, 'Additional Emission Sources'!$K$16:$K$25)","v":0},0,0]
[null,{"$f":"'Background Controls'!I16","v":0},{"$f":"'Stationary-Calcs'!F34","v":0},{"$f":"'Mobile-Summary'!F18","v":0},null,null,{"$f":"IF(M$2=\"Location Based\",'Electricity LocationBased-Calcs'!F31,'Electricity MarketBased-Calcs'!F31)","v":0},{"$f":"Water!F64","v":0},{"$f":"'Agriculture & Land Management'!F47","v":0},{"$f":"-'Urban Forestry'!D48","v":0},{"$f":"'Waste Production'!D28","v":0},{"$f":"SUMIF('Additional Emission Sources'!$C$16:$C$25,B139, 'Additional Emission Sources'!$K$16:$K$25)","v":0},0,0]
[null,{"$f":"'Background Controls'!I17","v":0},{"$f":"'Stationary-Calcs'!F35","v":0},{"$f":"'Mobile-Summary'!F19","v":0},null,null,{"$f":"IF(M$2=\"Location Based\",'Electricity LocationBased-Calcs'!F32,'Electricity MarketBased-Calcs'!F32)","v":0},{"$f":"Water!F65","v":0},{"$f":"'Agriculture & Land Management'!F48","v":0},{"$f":"-'Urban Forestry'!D49","v":0},{"$f":"'Waste Production'!D29","v":0},{"$f":"SUMIF('Additional Emission Sources'!$C$16:$C$25,B140, 'Additional Emission Sources'!$K$16:$K$25)","v":0},0,0]
[null,{"$f":"'Background Controls'!I18","v":0},{"$f":"'Stationary-Calcs'!F36","v":0},{"$f":"'Mobile-Summary'!F20","v":0},null,null,{"$f":"IF(M$2=\"Location Based\",'Electricity LocationBased-Calcs'!F33,'Electricity MarketBased-Calcs'!F33)","v":0},{"$f":"Water!F66","v":0},{"$f":"'Agriculture & Land Management'!F49","v":0},{"$f":"-'Urban Forestry'!D50","v":0},{"$f":"'Waste Production'!D30","v":0},{"$f":"SUMIF('Additional Emission Sources'!$C$16:$C$25,B141, 'Additional Emission Sources'!$K$16:$K$25)","v":0},0,0]
[null,{"$f":"'Background Controls'!I19","v":0},{"$f":"'Stationary-Calcs'!F37","v":0},{"$f":"'Mobile-Summary'!F21","v":0},null,null,{"$f":"IF(M$2=\"Location Based\",'Electricity LocationBased-Calcs'!F34,'Electricity MarketBased-Calcs'!F34)","v":0},{"$f":"Water!F67","v":0},{"$f":"'Agriculture & Land Management'!F50","v":0},{"$f":"-'Urban Forestry'!D51","v":0},{"$f":"'Waste Production'!D31","v":0},{"$f":"SUMIF('Additional Emission Sources'!$C$16:$C$25,B142, 'Additional Emission Sources'!$K$16:$K$25)","v":0},0,0]
[null,{"$f":"'Background Controls'!I20","v":0},{"$f":"'Stationary-Calcs'!F38","v":0},{"$f":"'Mobile-Summary'!F22","v":0},null,null,{"$f":"IF(M$2=\"Location Based\",'Electricity LocationBased-Calcs'!F35,'Electricity MarketBased-Calcs'!F35)","v":0},{"$f":"Water!F68","v":0},{"$f":"'Agriculture & Land Management'!F51","v":0},{"$f":"-'Urban Forestry'!D52","v":0},{"$f":"'Waste Production'!D32","v":0},{"$f":"SUMIF('Additional Emission Sources'!$C$16:$C$25,B143, 'Additional Emission Sources'!$K$16:$K$25)","v":0},0,0]
[null,{"$f":"'Background Controls'!I21","v":0},{"$f":"'Stationary-Calcs'!F39","v":0},{"$f":"'Mobile-Summary'!F23","v":0},null,null,{"$f":"IF(M$2=\"Location Based\",'Electricity LocationBased-Calcs'!F36,'Electricity MarketBased-Calcs'!F36)","v":0},{"$f":"Water!F69","v":0},{"$f":"'Agriculture & Land Management'!F52","v":0},{"$f":"-'Urban Forestry'!D53","v":0},{"$f":"'Waste Production'!D33","v":0},{"$f":"SUMIF('Additional Emission Sources'!$C$16:$C$25,B144, 'Additional Emission Sources'!$K$16:$K$25)","v":0},0,0]
[null,{"$f":"'Background Controls'!I22","v":0},{"$f":"'Stationary-Calcs'!F40","v":0},{"$f":"'Mobile-Summary'!F24","v":0},null,null,{"$f":"IF(M$2=\"Location Based\",'Electricity LocationBased-Calcs'!F37,'Electricity MarketBased-Calcs'!F37)","v":0},{"$f":"Water!F70","v":0},{"$f":"'Agriculture & Land Management'!F53","v":0},{"$f":"-'Urban Forestry'!D54","v":0},{"$f":"'Waste Production'!D34","v":0},{"$f":"SUMIF('Additional Emission Sources'!$C$16:$C$25,B145, 'Additional Emission Sources'!$K$16:$K$25)","v":0},0,0]
[null,{"$f":"'Background Controls'!I23","v":0},{"$f":"'Stationary-Calcs'!F41","v":0},{"$f":"'Mobile-Summary'!F25","v":0},null,null,{"$f":"IF(M$2=\"Location Based\",'Electricity LocationBased-Calcs'!F38,'Electricity MarketBased-Calcs'!F38)","v":0},{"$f":"Water!F71","v":0},{"$f":"'Agriculture & Land Management'!F54","v":0},{"$f":"-'Urban Forestry'!D55","v":0},{"$f":"'Waste Production'!D35","v":0},{"$f":"SUMIF('Additional Emission Sources'!$C$16:$C$25,B146, 'Additional Emission Sources'!$K$16:$K$25)","v":0},0,0]
[null,{"$f":"'Background Controls'!I24","v":0},{"$f":"'Stationary-Calcs'!F42","v":0},{"$f":"'Mobile-Summary'!F26","v":0},null,null,{"$f":"IF(M$2=\"Location Based\",'Electricity LocationBased-Calcs'!F39,'Electricity MarketBased-Calcs'!F39)","v":0},{"$f":"Water!F72","v":0},{"$f":"'Agriculture & Land Management'!F55","v":0},{"$f":"-'Urban Forestry'!D56","v":0},{"$f":"'Waste Production'!D36","v":0},{"$f":"SUMIF('Additional Emission Sources'!$C$16:$C$25,B147, 'Additional Emission Sources'!$K$16:$K$25)","v":0},0,0]
["SW",{"$f":"sw_department","v":"no"},null,null,{"$f":"'Solid Waste-Entry'!$C$80","v":376.78070920505888},null,null,null,null,null,null,null,{"$f":"SUM(C148:L148)","v":376.78070920505888}]
["WW",{"$f":"wwt_department","v":"Commercial/Institutional"},null,null,null,{"$f":"'Wastewater- Calcs'!D17","v":5428.0618225982134},null,null,null,null,null,null,{"$f":"SUM(C149:L149)","v":5428.0618225982134}]

{"sheet":"Factors","index":32,"n_rows":364,"n_cols":37,"rows_kept":364,"cut":false,"hidden":false,"merged":[[28,9,28,11],[29,9,29,11],[52,6,52,7],[53,6,53,7],[54,6,54,7],[18,3,20,5],[347,0,347,15],[48,6,48,7],[306,0,306,13],[178,0,178,15],[331,0,331,1],[49,6,49,7],[50,6,50,7],[51,6,51,7],[317,6,317,8],[318,6,318,8],[319,6,319,8],[320,6,320,8],[321,6,321,8],[322,6,322,8],[55,6,55,7]]}
["Factors"]
[]
["Unit Conversion Factors"]
[null,null,"Multiply by"]
[null,"kWh to MWh",{"$f":"1/1000","v":1E-3},null,null,null,"Legend:"]
[null,"lbs to metric tons",4.5359236999999999E-4,null,null,null,"Hard-wired factor"]
[null,"kg to metric tons",{"$f":"0.001","v":1E-3},null,null,null,"Calculated factor"]
[null,"g to kg",1E-3]
[null,"lbs to MMT",{"$f":"C6*10^-6","v":4.5359236999999999E-10}]
[null,"scf to mcf",{"$f":"1/1000","v":1E-3}]
[null,"mcf_scf",1000]
[null,"ft3 to m3",2.8316846600000001E-2]
[null,"Per Day to Per Year",365.25]
[null,"grams to  MT",{"$f":"10^-6","v":9.9999999999999995E-7}]
[null,"lbs to kg",0.45359237000000002]
[null,"per Gallon to per MG",{"$f":"10^-6","v":9.9999999999999995E-7}]
[null,"ft3 CH4 to MT CH4",{"$f":"20/10^6","v":2.0000000000000002E-5}]
[null,"mt/short ton",0.90718474000000204]
[null,"CO2 to CO2e",1,"* Following  revised reporting requirements under the UNFCCC, this tool presents CO2 equivalent values based on the IPCC Fifth Assessment Report (AR5) GWP values."]
[null,"CH4 to CO2e",28]
[null,"N2O to CO2e",265]
[null,"Oil barrel to gallon",42]
[null,"C to CO2 ",{"$f":"44/12","v":3.6666666666666665}]
[null,"Liters to gallon ",{"$f":"1/3.785","v":0.26420079260237778}]
[]
["Stationary Fuel Factors"]
["Fuel Emission Factors"]
[null,null,"kg CO2","kg CH4","kg N2O",null,null,null,null,null,null,null,null,null,null,"Selected Inventory Year"]
[null,"Fuel","CO2","CH4","N2O","Heat Content (MMBtu/unit)","Unit",null,null,"Annually variable heat content ",null,null,null,null,null,{"$f":"MyYear","v":2022}]
[null,"Natural Gas",{"$f":"C50*F30","v":54.862613215666663},{"$f":"D50*$F30","v":4.8738999999999996E-3},{"$f":"E50*$F30","v":1.037E-4},{"$f":"F50*1000","v":1.0369999999999999},"mcf",null,null,"Annually variable carbon content "]
[null,"Digester Gas",{"$f":"C51*F31","v":34.105850000000004},{"$f":"D51*$F31","v":2.0960000000000002E-3},{"$f":"E51*$F31","v":4.1265000000000003E-4},{"$f":"F51*1000","v":0.65500000000000003},"mcf"]
[null,"Diesel",10.210000000000001,{"$f":"3*g_kg*$F32","v":4.1428571428571431E-4},{"$f":"0.6*g_kg*$F32","v":8.285714285714286E-5},{"$f":"5.8/Oil_barrel_to_gallon","v":0.1380952380952381},"gal"]
[null,"LPG",{"$f":"IFERROR((VLOOKUP($B33,Variable_Carbon_Coefficients,MATCH($P$29,$A$61:$AK$61,0),0)*C_to_CO2),0)*$F33","v":6.0224607740611882},2.7599999999999999E-4,5.5199999999999993E-5,9.1999999999999998E-2,"gal"]
[null,"Gasoline",{"$f":"IFERROR((VLOOKUP($B34,Variable_Carbon_Coefficients,MATCH($P$29,$A$61:$AK$61,0),0)*C_to_CO2),0)*$F34","v":8.4954458676091367},3.6071428571428572E-4,7.2142857142857127E-5,{"$f":"IFERROR(VLOOKUP(B34,Variable_Heat_Content,MATCH($P$29,$A$77:$AK$77,0),0),0)","v":0.12023809523809523},"gal"]
[null,"Residual Fuel Oil No. 5",10.210000000000001,4.2000000000000007E-4,8.3999999999999995E-5,0.14000000000000001,"gal"]
[null,"Residual Fuel Oil No. 6",11.27,4.4999999999999999E-4,8.9999999999999992E-5,0.15,"gal"]
[null,"Propane",{"$f":"IFERROR((VLOOKUP($B37,Variable_Carbon_Coefficients,MATCH($P$29,$A$61:$AK$61,0),0)*C_to_CO2),0)*$F37","v":5.721169999999999},2.7300000000000002E-4,5.4599999999999992E-5,9.0999999999999998E-2,"gal"]
[null,"Butane",{"$f":"6.67","v":6.67},3.0899999999999998E-4,6.1799999999999998E-5,0.10299999999999999,"gal"]
[null,"Jet Fuel",{"$f":"C52*$F39","v":9.7499999999999982},4.0500000000000003E-4,8.1000000000000004E-5,{"$f":"F52","v":0.13500000000000001},"gal"]
[null,"Residential Coal",2390.9013836509489,0.27422999999999997,3.9888E-2,{"$f":"F53","v":24.93},"short tons"]
[null,"Commercial Coal",{"$f":"C54*$F41","v":2051.399141447806},0.23529,3.4224000000000004E-2,{"$f":"F54","v":21.39},"short tons"]
[null,"Industrial Coal",2138.577605506634,0.24585000000000001,3.5760000000000007E-2,22.35,"short tons"]
[null,"Electric Power Coal",1890.5234630391508,0.21703,3.1567999999999999E-2,19.73,"short tons"]
[null,"Distillate Fuel Oil",{"$f":"IFERROR((VLOOKUP($B44,Variable_Carbon_Coefficients,MATCH($P$29,$A$61:$AK$61,0),0)*C_to_CO2),0)*$F44","v":10.280931639962359},{"$f":"3*g_kg*$F44","v":4.1607142857142863E-4},{"$f":"0.6*g_kg*$F44","v":8.3214285714285706E-5},{"$f":"IFERROR(VLOOKUP(B44,Variable_Heat_Content,MATCH($P$29,$A$77:$AK$77,0),0),0)","v":0.1386904761904762},"gal"]
[null,"Kerosene",10.15,4.0500000000000003E-4,8.1000000000000004E-5,0.13500000000000001,"gal"]
[]
["Emission Factors Per MMBtu (multiplied by heat content to determine emissions/unit)"]
[null,null,"kg/MMBtu"]
[null,"Fuel","CO2","CH4","N2O","MMBtu/Unit"]
[null,"Natural Gas",{"$f":"IFERROR((VLOOKUP($B50,Variable_Carbon_Coefficients,MATCH($P$29,$A$61:$AK$61,0),0)*C_to_CO2),0)","v":52.905123640951466},{"$f":"4.7*g_kg","v":4.7000000000000002E-3},{"$f":"0.1*g_kg","v":1E-4},{"$f":"IFERROR(VLOOKUP(B50,Variable_Heat_Content,MATCH($P$29,$A$77:$AK$77,0),0),0)","v":1.0369999999999999E-3},"MMBtu/scf"]
[null,"Digester Gas",52.07,3.2000000000000002E-3,6.3000000000000003E-4,6.5499999999999998E-4,"MMBtu/scf"]
[null,"Jet Fuel",{"$f":"IFERROR((VLOOKUP($B52,Variable_Carbon_Coefficients,MATCH($P$29,$A$61:$AK$61,0),0)*C_to_CO2),0)","v":72.2222222222222},{"$f":"3*g_kg","v":3.0000000000000001E-3},{"$f":"0.6*g_kg","v":5.9999999999999995E-4},{"$f":"5.67/Oil_barrel_to_gallon","v":0.13500000000000001},"MMBtu/gal"]
[null,"Residential Coal",{"$f":"IFERROR((VLOOKUP($B53,Variable_Carbon_Coefficients,MATCH($P$29,$A$61:$AK$61,0),0)*C_to_CO2),0)","v":95.904588192978295},{"$f":"11*g_kg","v":1.0999999999999999E-2},{"$f":"1.6*g_kg","v":1.6000000000000001E-3},24.93,"MMBtu/short ton"]
[null,"Commercial Coal",{"$f":"IFERROR((VLOOKUP($B54,Variable_Carbon_Coefficients,MATCH($P$29,$A$61:$AK$61,0),0)*C_to_CO2),0)","v":95.904588192978295},{"$f":"11*g_kg","v":1.0999999999999999E-2},{"$f":"1.6*g_kg","v":1.6000000000000001E-3},21.39,"MMBtu/short ton"]
[null,"Industrial Coal",{"$f":"IFERROR((VLOOKUP($B55,Variable_Carbon_Coefficients,MATCH($P$29,$A$61:$AK$61,0),0)*C_to_CO2),0)","v":95.685798904099954},{"$f":"11*g_kg","v":1.0999999999999999E-2},{"$f":"1.6*g_kg","v":1.6000000000000001E-3},22.35,"MMBtu/short ton"]
[null,"Electric Power Coal",{"$f":"IFERROR((VLOOKUP($B56,Variable_Carbon_Coefficients,MATCH($P$29,$A$61:$AK$61,0),0)*C_to_CO2),0)","v":95.819739637057822},{"$f":"11*g_kg","v":1.0999999999999999E-2},{"$f":"1.6*g_kg","v":1.6000000000000001E-3},19.73,"MMBtu/short ton"]
[]
["Source: The Climate Registry 2021 Default Emission Factors and Emissions Factors for Greenhouse Gas Inventories, U.S EPA April 2022"]
[]
["Annually Variable Carbon Content Coefficients (MMT Carbon/Qbtu = kg C/MMBtu)"]
["Fuel Type",1990,1991,1992,1993,1994,1995,1996,1997,1998,1999,2000,2001,2002,2003,2004,2005,2006,2007,2008,2009,2010,2011,2012,2013,2014,2015,2016,2017,2018,2019,2020,2021,2022,2023,2024,2025]
["Residential Coal",26.188403221531779,26.265573230967654,26.383192558471539,26.159033043068632,26.091045386983762,26.125178785663419,26.025855036863565,25.890869922857618,26.05516957877683,25.972353624013728,25.999060569647476,25.991107715662618,25.964551734270447,26.02716693872711,25.88579600257,26.036169679622709,26.261987709907,25.914168123912859,25.705698174336916,25.73345015802569,25.749810942329489,25.81266735450231,25.883027630938649,25.904476827329631,25.884448536287529,25.981544092334147,26.01385695348554,26.087352515682195,26.094091194618521,26.106167105273808,26.208874299954459,26.155796779903174,{"$f":"AG62","v":26.155796779903174},26.155796779903174,26.155796779903174,26.155796779903174]
["Commercial Coal",26.188403221531779,26.265573230967654,26.383192558471539,26.159033043068632,26.091045386983762,26.125178785663419,26.025855036863565,25.890869922857618,26.05516957877683,25.972353624013728,25.999060569647476,25.991107715662618,25.964551734270447,26.02716693872711,25.88579600257,26.036169679622709,26.261987709907,25.914168123912859,25.705698174336916,25.73345015802569,25.749810942329489,25.81266735450231,25.883027630938649,25.904476827329631,25.884448536287529,25.981544092334147,26.01385695348554,26.087352515682195,26.094091194618521,26.106167105273808,26.208874299954459,26.155796779903174,{"$f":"AG63","v":26.155796779903174},26.155796779903174,26.155796779903174,26.155796779903174]
["Industrial Coal",25.805642720842716,25.871881489576712,25.855929983116827,25.7596293373355,25.760898130645295,25.786514287120493,25.743650552579652,25.746983670488884,25.78479363546386,25.795891623557694,25.736471250030551,25.654338462605946,25.561804762419062,25.540878814005229,25.548258103728873,25.794744187902076,25.832832980649002,25.812379837011846,25.81183277073524,25.862590070178246,25.862499126220154,25.88209416744013,25.935452316860108,25.92550247708688,25.945628789887504,26.004165366210408,26.034587614654345,26.059260610389686,26.080642025139742,26.070809180622827,26.128213850965309,26.096126973845443,{"$f":"AG64","v":26.096126973845443},26.096126973845443,26.096126973845443,26.096126973845443]
["Electric Power Coal",25.937996057334406,25.96702960313344,25.980478757244502,25.877462041936699,25.878591831903154,25.91789491540214,25.920424261243117,25.910357205212129,25.932621499274997,25.963566646993332,25.982584881780109,25.986062888967851,26.040478918241558,26.076716277910279,26.084257586280138,26.076556063342331,26.026523902182998,26.033819892125507,26.037482691484755,26.039969620971139,26.045458638153619,26.045615716301278,26.058623054411257,26.049147311306413,26.04112929797094,26.068323582825943,26.063603453552993,26.080965214865213,26.086614483816899,26.078382988493807,26.120456105517995,26.132656264652134,{"$f":"AG65","v":26.132656264652134},26.132656264652134,26.132656264652134,26.132656264652134]
["LPG",17.462294236785919,17.511145342086159,17.502686164823544,17.530671016144865,17.507283232357413,17.523447352533289,17.531734863061672,17.559269576594321,17.582023852517612,17.590319657869905,17.589973597051099,17.610107872933416,17.58907051644135,17.635908379840441,17.618357181938354,17.60313706199593,17.602000816822571,17.594574853885629,17.66179236937003,17.715020407153261,17.778069805635166,17.740233870562516,17.684262284637942,17.656623754772959,17.728074079298114,17.714933298005359,17.726859254294904,17.776381839102324,17.776241733709352,17.8311889189035,17.822091128019789,17.853144587137912,{"$f":"AG66","v":17.853144587137912},17.853144587137912,17.853144587137912,17.853144587137912]
["Propane",17.146363636363635,17.146363636363635,17.146363636363635,17.146363636363635,17.146363636363635,17.146363636363635,17.146363636363635,17.146363636363635,17.146363636363635,17.146363636363635,17.146363636363635,17.146363636363635,17.146363636363635,17.146363636363635,17.146363636363635,17.146363636363635,17.146363636363635,17.146363636363635,17.146363636363635,17.146363636363635,17.146363636363635,17.146363636363635,17.146363636363635,17.146363636363635,17.146363636363635,17.146363636363635,17.146363636363635,17.146363636363635,17.146363636363635,17.146363636363635,17.146363636363635,17.146363636363635,{"$f":"AG67","v":17.146363636363635},17.146363636363635,17.146363636363635,17.146363636363635]
["Gasoline",19.422820377744564,19.438981221928678,19.491985360913997,19.439169784991449,19.363795946364121,19.357284669381631,19.354555468857317,19.355101442635394,19.366735691249527,19.321635852506081,19.47,19.34,19.36,19.61,19.43,19.32,19.47,19.57,19.350000000000001,19.440000000000001,19.39,19.38,19.350000000000001,19.28,19.260000000000002,19.252564540839455,19.262501967102367,19.279945488604678,19.268142985283784,19.265712984148887,19.26959818755628,19.26959818755628,{"$f":"AG68","v":19.26959818755628},19.26959818755628,19.26959818755628,19.26959818755628]
["Jet Fuel",19.399999999999999,19.399999999999999,19.39,19.37,19.350000000000001,19.34,19.696969696969692,19.696969696969692,19.696969696969692,19.696969696969692,19.696969696969692,19.696969696969692,19.696969696969692,19.696969696969692,19.696969696969692,19.696969696969692,19.696969696969692,19.696969696969692,19.696969696969692,19.696969696969692,19.696969696969692,19.696969696969692,19.696969696969692,19.696969696969692,19.696969696969692,19.696969696969692,19.696969696969692,19.696969696969692,19.696969696969692,19.696969696969692,19.696969696969692,19.696969696969692,{"$f":"AG69","v":19.696969696969692},19.696969696969692,19.696969696969692,19.696969696969692]
["Natural Gas",14.455165742468415,14.45183127669903,14.45183127669903,14.461854154819864,14.458506695525291,14.46520813937622,14.46520813937622,14.46520813937622,14.448503279340446,14.461854154819864,14.468568668292685,14.458506695525291,14.471935760742188,14.458506695525291,14.46520813937622,14.458506695525291,14.458506695525291,14.461854154819864,14.461854154819864,14.468568668292685,14.47530943597263,14.47868971330724,14.471935760742188,14.461854154819864,14.445181731589148,14.428670083895854,14.428670083895854,14.431959663127413,14.431959663127413,14.425386842967246,14.428670083895854,14.428670083895854,{"$f":"AG70","v":14.428670083895854},14.428670083895854,14.428670083895854,14.428670083895854]
["Distillate Fuel Oil",20.170000000000002,20.170000000000002,20.170000000000002,20.170000000000002,20.170000000000002,20.170000000000002,20.170000000000002,20.170000000000002,20.170000000000002,20.170000000000002,20.39,20.36,20.36,20.37,20.39,20.37,20.329999999999998,20.25,20.25,20.23,20.239999999999998,20.22,20.22,20.23,20.23,20.221641702001627,20.214239202481796,20.206427131077398,20.221719451899205,20.221719451899205,20.216892495282984,20.216892495282984,{"$f":"AG71","v":20.216892495282984},20.216892495282984,20.216892495282984,20.216892495282984]
[]
[]
["Source: CO2 from Fossil Fuel Combustion, Inventory of U.S. Greenhouse Gas Sources and Sinks"]
[]
["Annually Variable Heat Contents (MMBtu/Unit, see note)"]
["Fuel Type",1990,1991,1992,1993,1994,1995,1996,1997,1998,1999,2000,2001,2002,2003,2004,2005,2006,2007,2008,2009,2010,2011,2012,2013,2014,2015,2016,2017,2018,2019,2020,2021,2022,2023,2024,2025]
["Natural Gas",1.029E-3,1.0300000000000001E-3,1.0300000000000001E-3,1.0269999999999999E-3,1.0280000000000001E-3,1.026E-3,1.026E-3,1.026E-3,1.031E-3,1.0269999999999999E-3,1.0250000000000001E-3,1.0280000000000001E-3,1.024E-3,1.0280000000000001E-3,1.026E-3,1.0280000000000001E-3,1.0280000000000001E-3,1.0269999999999999E-3,1.0269999999999999E-3,1.0250000000000001E-3,1.023E-3,1.0219999999999999E-3,1.024E-3,1.0269999999999999E-3,1.0319999999999999E-3,1.0369999999999999E-3,1.0369999999999999E-3,1.036E-3,1.036E-3,1.0380000000000001E-3,1.0369999999999999E-3,1.0369999999999999E-3,{"$f":"AG78","v":1.0369999999999999E-3},1.0369999999999999E-3,1.0369999999999999E-3,1.0369999999999999E-3]
["Gasoline",0.12507142857142858,0.12507142857142858,0.12507142857142858,0.12421428571428571,0.12414285714285715,0.12390476190476189,0.12407142857142858,0.12392857142857143,0.12388095238095238,0.12385714285714286,0.12383333333333332,0.12383333333333332,0.12378571428571428,0.12373809523809524,0.12371428571428571,0.12361904761904763,0.12345238095238094,0.12242857142857144,0.12157142857142857,0.12119047619047618,0.12064285714285715,0.12054761904761904,0.12052380952380953,0.12047619047619047,0.12045238095238095,0.12040476190476192,0.12035714285714286,0.12030952380952381,0.12033333333333333,0.12028571428571427,0.12028571428571427,0.12023809523809523,{"$f":"AG79","v":0.12023809523809523},0.12023809523809523,0.12023809523809523,0.12023809523809523]
["Distillate Fuel Oil",0.1386904761904762,0.1386904761904762,0.1386904761904762,0.1386904761904762,0.1386904761904762,0.1386904761904762,0.1386904761904762,0.1386904761904762,0.1386904761904762,0.1386904761904762,0.1386904761904762,0.1386904761904762,0.1386904761904762,0.1386904761904762,0.1386904761904762,0.1386904761904762,0.1386904761904762,0.1386904761904762,0.1386904761904762,0.1386904761904762,0.1386904761904762,0.1386904761904762,0.1386904761904762,0.1386904761904762,0.1386904761904762,0.1386904761904762,0.1386904761904762,0.1386904761904762,0.1386904761904762,0.1386904761904762,0.1386904761904762,0.1386904761904762,{"$f":"AG80","v":0.1386904761904762},0.1386904761904762,0.1386904761904762,0.1386904761904762]
[]
[]
["Source: CO2 from Fossil Fuel Combustion, Inventory of U.S. Greenhouse Gas Sources and Sinks"]
[]
[]
[]
["Electricity Factors"]
[]
["eGRID Electricity Emission Factors by eGRID Subregion - Most recent available factor is applied to all future years."]
[null,null,"lbs CO2/MWh"]
["eGRID Subregion","Subregion Name",2000,2001,2002,2003,2004,2005,2006,2007,2008,2009,2010,2011,2012,2013,2014,2015,2016,2017,2018,2019,2020,2021,2022,2023,2024,2025]
["AKGD eGRID subregion","ASCC Alaska Grid",{"$f":"D92","v":1257.19},{"$f":"E92","v":1257.19},{"$f":"F92","v":1257.19},{"$f":"G92","v":1257.19},1257.19,1232.3599999999999,{"$f":"(H92+J92)/2","v":1258.54},1284.72,{"$f":"(J92+L92)/2","v":1282.7891},1280.8581999999999,1256.8658,{"$f":"(M92+O92)/2","v":1262.7985973501968},1268.7313947003938,{"$f":"(O92+Q92)/2","v":1097.6341973501969},926.53700000000003,{"$f":"(Q92+S92)/2","v":999.4085},1072.28,{"$f":"(S92+U92)/2","v":1055.9575},1039.635,1114.4000000000001,1097.6300000000001,1067.68,{"$f":"X92","v":1067.68},{"$f":"Y92","v":1067.68},{"$f":"Z92","v":1067.68},{"$f":"AA92","v":1067.68}]
["AKMS eGRID subregion","ASCC Miscellaneous",{"$f":"D93","v":480.1},480.1,480.1,{"$f":"G93","v":480.1},480.1,498.86,{"$f":"(H93+J93)/2","v":517.29500000000007},535.73,{"$f":"(J93+L93)/2","v":528.49594999999999},521.26189999999997,448.56979999999999,{"$f":"(M93+O93)/2","v":464.86939710695594},481.1689942139119,{"$f":"(O93+Q93)/2","v":580.83349710695597},680.49800000000005,591.81150000000002,503.125,{"$f":"(S93+U93)/2","v":514.10400000000004},525.08299999999997,549.31200000000001,534.07299999999998,485.18599999999998,{"$f":"X93","v":485.18599999999998},485.18599999999998,485.18599999999998,485.18599999999998]
["AZNM eGRID subregion","WECC Southwest",1254.02,1254.02,1254.02,1254.02,1254.02,1311.05,1281.83,1252.6099999999999,1221.9801499999999,1191.3503000000001,1177.6143,1165.2511044020443,1152.8879088040887,1014.2394544020444,875.59100000000001,959.61799999999994,1043.645,1033,1022.355,952.32100000000003,846.61599999999999,819.65599999999995,819.65599999999995,819.65599999999995,819.65599999999995,819.65599999999995]
["CAMX eGRID subregion","WECC California",878.71,878.71,878.71,878.71,878.71,724.12,702.56500000000005,681.01,669.84730000000002,658.68460000000005,610.81780000000003,630.56496823257794,650.31213646515573,609.47806823257793,568.64400000000001,548.25299999999993,527.86199999999997,512.19899999999996,496.536,453.209,513.45500000000004,531.678,531.678,531.678,531.678,531.678]
["ERCT eGRID subregion","ERCOT All",1420.56,1420.56,1420.56,1420.56,1420.56,1324.35,1288.46,1252.57,1217.1486500000001,1181.7273,1218.1672000000001,1180.6022506857801,1143.03730137156,1142.8936506857799,1142.75,1075.953,1009.1559999999999,970.41399999999999,931.67200000000003,868.64,818.6,813.55200000000002,813.55200000000002,813.55200000000002,813.55200000000002,813.55200000000002]
["FRCC eGRID subregion","FRCC All",1327.66,1327.66,1327.66,1327.66,1327.66,1318.57,1269.3399999999999,1220.1099999999999,1198.35825,1176.6065000000001,1196.7146,1161.0319819151573,1125.3493638303146,1100.2691819151573,1075.1890000000001,1043.4360000000001,1011.683,971.76250000000005,931.84199999999998,861.02800000000002,835.07899999999995,832.92399999999998,832.92399999999998,832.92399999999998,832.92399999999998,832.92399999999998]
["HIMS eGRID subregion","HICC Miscellaneous",1456.17,1456.17,1456.17,1456.17,1456.17,1514.92,1429.37,1343.82,1347.74125,1351.6624999999999,1330.1641,1265.1317411465557,1200.0993822931116,1070.4531911465558,940.80700000000002,1046.4115000000002,1152.0160000000001,1131.3525,1110.6890000000001,1185.595,1143.2270000000001,1134.3910000000001,1134.3910000000001,1134.3910000000001,1134.3910000000001,1134.3910000000001]
["HIOA eGRID subregion","HICC Oahu",1728.12,1728.12,1728.12,1728.12,1728.12,1811.98,1716.37,1620.76,1607.0541499999999,1593.3483000000001,1621.8643,1599.119914154629,1576.3755283092582,1527.9057641546292,1479.4359999999999,1571.1619999999998,1662.8879999999999,1666.4155000000001,1669.943,1694.5409999999999,1652.952,1633.097,1633.097,1633.097,1633.097,1633.097]
["MROE eGRID subregion","MRO East",1858.72,1858.72,1858.72,1858.72,1858.72,1834.72,1763.52,1692.32,1641.9859000000001,1591.6518000000001,1610.8030000000001,1566.6866712512328,1522.5703425024653,1593.1756712512326,1663.7809999999999,1665.9965,1668.212,1673.114,1678.0160000000001,1502.559,1526.374,1582.135,1582.135,1582.135,1582.135,1582.135]
["MROW eGRID subregion","MRO West",1813.81,1813.81,1813.81,1813.81,1813.81,1821.84,1772.2550000000001,1722.67,1675.6366,1628.6032,1536.3605,1480.7552585302801,1425.15001706056,1395.12950853028,1365.1089999999999,1301.963,1238.817,1239.3325,1239.848,1098.3530000000001,979.53599999999994,995.79,995.79,995.79,995.79,995.79]
["NEWE eGRID subregion","NPCC New England",908.9,908.9,908.9,908.9,908.9,927.68,877.81500000000005,827.95,778.17935,728.40869999999995,722.07349999999997,679.98686243934571,637.90022487869146,604.37611243934566,570.85199999999998,564.50399999999991,558.15599999999995,540.23399999999992,522.31200000000001,488.88799999999998,528.23800000000006,539.36699999999996,539.36699999999996,539.36699999999996,539.36699999999996,539.36699999999996]
["NWPP eGRID subregion","WECC Northwest",921.1,921.1,921.1,921.1,921.1,902.24,880.51499999999999,858.79,838.99894999999992,819.2079,842.57929999999999,754.16682448841198,665.75434897682396,786.35667448841195,906.95899999999995,779.07899999999995,651.19899999999996,645.11799999999994,639.03700000000003,715.24099999999999,599.96699999999998,634.59900000000005,634.59900000000005,634.59900000000005,634.59900000000005,634.59900000000005]
["NYCW eGRID subregion","NPCC NYC/Westchester",922.22,922.22,922.22,922.22,922.22,815.45,760.125,704.8,657.73434999999995,610.66869999999994,622.41610000000003,659.55667509212265,696.69725018424526,681.10162509212262,665.50599999999997,650.6579999999999,635.80999999999995,616.11199999999997,596.41399999999999,553.80100000000004,634.61199999999997,816.75599999999997,816.75599999999997,816.75599999999997,816.75599999999997,816.75599999999997]
["NYLI eGRID subregion","NPCC Long Island",1412.2,1412.2,1412.2,1412.2,1412.2,1536.8,1477.77,1418.74,1383.3641,1347.9882,1336.1102000000001,1268.6533074301778,1201.1964148603556,1198.7047074301777,1196.213,1187.2674999999999,1178.3219999999999,1181.2815000000001,1184.241,1208.9749999999999,1203.9269999999999,1210.94,1210.94,1210.94,1210.94,1210.94]
["NYUP eGRID subregion","NPCC Upstate NY",819.68,819.68,819.68,819.68,819.68,720.8,702.03499999999997,683.27,590.59424999999999,497.91849999999999,545.78689999999995,477.29285147496046,408.79880294992103,387.25590147496052,365.71300000000002,330.18700000000001,294.661,273.88650000000001,253.11199999999999,232.30500000000001,233.512,233.08099999999999,233.08099999999999,233.08099999999999,233.08099999999999,233.08099999999999]
["RFCE eGRID subregion","RFC East",1095.53,1095.53,1095.53,1095.53,1095.53,1139.07,1099.1949999999999,1059.32,1003.37185,947.42370000000005,1001.7161,930.13805230734692,858.56000461469387,844.00200230734686,829.44399999999996,793.81099999999992,758.178,737.072,715.96600000000001,695.03399999999999,652.45799999999997,672.78700000000003,672.78700000000003,672.78700000000003,672.78700000000003,672.78700000000003]
["RFCM eGRID subregion","RFC Michigan",1641.41,1641.41,1641.41,1641.41,1641.41,1563.28,1607.1949999999999,1651.11,1655.2833999999998,1659.4567999999999,1629.3819000000001,1599.3058123455107,1569.2297246910216,1550.3468623455108,1531.4639999999999,1401.7545,1272.0450000000001,1292.3025,1312.56,1189.335,1153.058,1214.0609999999999,{"$f":"X108","v":1214.0609999999999},1214.0609999999999,1214.0609999999999,1214.0609999999999]
["RFCW eGRID subregion","RFC West",1556.39,1556.39,1556.39,1556.39,1556.39,1537.82,1544.67,1551.52,1536.05655,1520.5931,1503.4707000000001,1441.4737681783181,1379.4768363566359,1380.180418178318,1380.884,1312.1615000000002,1243.4390000000001,1204.7674999999999,1166.096,1067.6790000000001,984.97699999999998,1046.1320000000001,1046.1320000000001,1046.1320000000001,1046.1320000000001,1046.1320000000001]
["RMPA eGRID subregion","WECC Rockies",2035.81,2035.81,2035.81,2035.81,2035.81,1883.08,1894.57,1906.06,1865.2862500000001,1824.5125,1896.7397000000001,1859.6950580648574,1822.6504161297148,1780.1702080648574,1737.69,1552.729,1367.768,1320.6914999999999,1273.615,1242.6110000000001,1144.8009999999999,1158.8599999999999,1158.8599999999999,1158.8599999999999,1158.8599999999999,1158.8599999999999]
["SPNO eGRID subregion","SPP North",1971.42,1971.42,1971.42,1971.42,1971.42,1960.94,1879.825,1798.71,1807.2336500000001,1815.7573,1799.4482,1760.5503731431795,1721.652546286359,1648.3222731431795,1574.992,1493.6709999999998,1412.35,1287.7684999999999,1163.1869999999999,1069.971,954.03200000000004,991.72900000000004,991.72900000000004,991.72900000000004,991.72900000000004,991.72900000000004]
["SPSO eGRID subregion","SPP South",1761.14,1761.14,1761.14,1761.14,1761.14,1658.14,1641.085,1624.03,1611.5234,1599.0168000000001,1580.6031,1559.61484810823,1538.6265962164603,1507.2397981082302,1475.8530000000001,1362.0909999999999,1248.329,1207.4555,1166.5820000000001,1001.985,931.75599999999997,1031.6010000000001,1031.6010000000001,1031.6010000000001,1031.6010000000001,1031.6010000000001]
["SRMV eGRID subregion","SERC Mississippi Valley",1135.46,1135.46,1135.46,1135.46,1135.46,1019.74,1011.9200000000001,1004.1,1003.25595,1002.4118999999999,1029.8161,1041.3671720468471,1052.9182440936943,1037.4481220468472,1021.978,930.43349999999998,838.88900000000001,846.76700000000005,854.64499999999998,806.755,740.35900000000004,772.73699999999997,772.73699999999997,772.73699999999997,772.73699999999997,772.73699999999997]
["SRMW eGRID subregion","SERC Midwest",1844.34,1844.34,1844.34,1844.34,1844.34,1830.51,1804.8899999999999,1779.27,1764.5115000000001,1749.7529999999999,1810.8269,1760.7870933362333,1710.7472866724663,1741.3761433362333,1772.0050000000001,1692.2975000000001,1612.59,1638.37,1664.15,1584.3910000000001,1480.6990000000001,1543.0340000000001,1543.0340000000001,1543.0340000000001,1543.0340000000001,1543.0340000000001]
["SRSO eGRID subregion","SERC South",1490.37,1490.37,1490.37,1490.37,1490.37,1489.54,1492.5050000000001,1495.47,1410.5771,1325.6841999999999,1354.0945999999999,1251.5710738009457,1149.0475476018912,1146.4342738009454,1143.8209999999999,1116.5974999999999,1089.374,1058.6510000000001,1027.9280000000001,969.16499999999996,860.17899999999997,891.90700000000004,891.90700000000004,891.90700000000004,891.90700000000004,891.90700000000004]
["SRTV eGRID subregion","SERC Tennessee Valley",1494.89,1494.89,1494.89,1494.89,1494.89,1510.44,1525.645,1540.85,1449.28035,1357.7107000000001,1389.2003,1363.175428193726,1337.1505563874521,1336.7152781937261,1336.28,1260.8564999999999,1185.433,1108.4850000000001,1031.537,949.69500000000005,834.18200000000002,931.58600000000001,931.58600000000001,931.58600000000001,931.58600000000001,931.58600000000001]
["SRVC eGRID subregion","SERC Virginia/Carolina",1146.3900000000001,1146.3900000000001,1146.3900000000001,1146.3900000000001,1146.3900000000001,1134.8800000000001,1126.645,1118.4100000000001,1077.1393,1035.8686,1073.6477,1003.2611289107363,932.87455782147242,894.7287789107362,856.58299999999997,830.93399999999997,805.28499999999997,774.30649999999991,743.32799999999997,675.41700000000003,623.11099999999999,639.66499999999996,639.66499999999996,639.66499999999996,639.66499999999996,639.66499999999996]
[]
[null,null,"lbs CH4/MWh",null,null,null,null,null,null,null,null,null,null,null,null,null,null,null,null,null,null,null,null,null,null,null,null,null,null,"lbs CH4/GWh"]
["eGRID Subregion","Subregion Name",2000,2001,2002,2003,2004,2005,2006,2007,2008,2009,2010,2011,2012,2013,2014,2015,2016,2017,2018,2019,2020,2021,2022,2023,2024,2025,null,2005,2007,2009,2010,2012,2014]
["AKGD eGRID subregion","ASCC Alaska Grid",{"$f":"D121","v":2.6599999999999999E-2},2.6599999999999999E-2,2.6599999999999999E-2,2.6599999999999999E-2,2.6599999999999999E-2,{"$f":"AD121/1000","v":2.5600000000000001E-2},{"$f":"(H121+J121)/2","v":2.6355E-2},{"$f":"AE121/1000","v":2.7109999999999999E-2},{"$f":"(J121+L121)/2","v":2.7423499999999996E-2},{"$f":"AF121/1000","v":2.7736999999999998E-2},{"$f":"AG121/1000","v":2.6075600000000001E-2},{"$f":"(M121+O121)/2","v":2.6205402220091798E-2},{"$f":"AH121/1000","v":2.6335204440183595E-2},{"$f":"(O121+Q121)/2","v":3.6482102220091794E-2},{"$f":"AI121/1000","v":4.6628999999999997E-2},6.1814499999999994E-2,7.6999999999999999E-2,{"$f":"(S121+U121)/2","v":7.9500000000000001E-2},8.2000000000000003E-2,9.8000000000000004E-2,0.1,9.0999999999999998E-2,{"$f":"X121","v":9.0999999999999998E-2},{"$f":"Y121","v":9.0999999999999998E-2},{"$f":"Z121","v":9.0999999999999998E-2},{"$f":"AA121","v":9.0999999999999998E-2},null,25.6,27.11,27.736999999999998,26.075600000000001,26.335204440183595,46.628999999999998]
["AKMS eGRID subregion","ASCC Miscellaneous",2.3900000000000001E-2,2.3900000000000001E-2,2.3900000000000001E-2,2.3900000000000001E-2,2.3900000000000001E-2,2.0750000000000001E-2,{"$f":"(H122+J122)/2","v":2.1700000000000001E-2},2.265E-2,{"$f":"(J122+L122)/2","v":2.22159E-2},2.17818E-2,1.8744900000000002E-2,{"$f":"(M122+O122)/2","v":1.869881038362186E-2},{"$f":"AH122/1000","v":1.8652720767243714E-2},2.7361360383621858E-2,{"$f":"AI122/1000","v":3.6069999999999998E-2},2.9534999999999999E-2,2.3E-2,{"$f":"(S122+U122)/2","v":2.35E-2},2.4E-2,2.5999999999999999E-2,2.7E-2,2.5000000000000001E-2,{"$f":"X122","v":2.5000000000000001E-2},2.5000000000000001E-2,2.5000000000000001E-2,2.5000000000000001E-2,null,20.75,22.65,21.7818,18.744900000000001,18.652720767243714,36.07]
["AZNM eGRID subregion","WECC Southwest",1.7999999999999999E-2,1.7999999999999999E-2,1.7999999999999999E-2,1.7999999999999999E-2,1.7999999999999999E-2,1.745E-2,1.8125000000000002E-2,1.8800000000000001E-2,1.8965849999999999E-2,1.9131699999999998E-2,1.92067E-2,1.8929811476859085E-2,1.8652922953718173E-2,4.2515461476859091E-2,6.6378000000000006E-2,7.2689000000000004E-2,7.9000000000000001E-2,7.8E-2,7.6999999999999999E-2,6.8000000000000005E-2,5.3999999999999999E-2,5.1999999999999998E-2,5.1999999999999998E-2,5.1999999999999998E-2,5.1999999999999998E-2,5.1999999999999998E-2,null,17.45,18.8,19.131699999999999,19.206700000000001,18.652922953718171,66.378]
["CAMX eGRID subregion","WECC California",3.024E-2,3.024E-2,3.024E-2,3.024E-2,{"$f":"H124","v":3.024E-2},3.024E-2,2.9264999999999999E-2,2.8289999999999999E-2,2.86152E-2,2.8940400000000002E-2,2.8490100000000001E-2,2.9803139523900589E-2,3.1116179047801177E-2,3.2110589523900585E-2,3.3104999999999996E-2,3.3052499999999999E-2,3.3000000000000002E-2,3.3500000000000002E-2,3.4000000000000002E-2,3.3000000000000002E-2,3.2000000000000001E-2,3.1E-2,3.1E-2,3.1E-2,3.1E-2,3.1E-2,null,30.24,28.29,28.9404,28.490100000000002,31.116179047801175,33.104999999999997]
["ERCT eGRID subregion","ERCOT All",2.1000000000000001E-2,2.1000000000000001E-2,2.1000000000000001E-2,2.1000000000000001E-2,2.1000000000000001E-2,1.865E-2,1.8204999999999999E-2,1.7760000000000001E-2,1.72315E-2,1.6702999999999999E-2,1.68512E-2,1.6775951814245776E-2,1.6700703628491551E-2,4.9267851814245769E-2,8.1834999999999991E-2,7.8917500000000002E-2,7.5999999999999998E-2,7.1000000000000008E-2,6.6000000000000003E-2,5.7000000000000002E-2,5.1999999999999998E-2,5.3999999999999999E-2,5.3999999999999999E-2,5.3999999999999999E-2,5.3999999999999999E-2,5.3999999999999999E-2,null,18.649999999999999,17.760000000000002,16.702999999999999,16.851199999999999,16.700703628491553,81.834999999999994]
["FRCC eGRID subregion","FRCC All",5.3999999999999999E-2,5.3999999999999999E-2,5.3999999999999999E-2,5.3999999999999999E-2,5.3999999999999999E-2,4.5920000000000002E-2,4.3554999999999996E-2,4.1189999999999997E-2,4.0214E-2,3.9238000000000002E-2,3.8909899999999997E-2,3.947759030070494E-2,4.004528060140989E-2,6.3911140300704952E-2,8.7777000000000008E-2,8.1388500000000003E-2,7.4999999999999997E-2,7.0500000000000007E-2,6.6000000000000003E-2,5.5E-2,4.9000000000000002E-2,5.2999999999999999E-2,5.2999999999999999E-2,5.2999999999999999E-2,5.2999999999999999E-2,5.2999999999999999E-2,null,45.92,41.19,39.238,38.9099,40.045280601409893,87.777000000000001]
["HIMS eGRID subregion","HICC Miscellaneous",0.10100000000000001,0.10100000000000001,0.10100000000000001,0.10100000000000001,0.10100000000000001,0.31468000000000002,0.224915,0.13514999999999999,0.1037743,7.2398600000000007E-2,7.3984800000000003E-2,7.1029911838664861E-2,6.8075023677329705E-2,8.1707511838664856E-2,9.5340000000000008E-2,9.5170000000000005E-2,9.5000000000000001E-2,0.1065,0.11799999999999999,0.14299999999999999,0.11,0.13500000000000001,0.13500000000000001,0.13500000000000001,0.13500000000000001,0.13500000000000001,null,314.68,135.15,72.398600000000002,73.984800000000007,68.07502367732971,95.34]
["HIOA eGRID subregion","HICC Oahu",9.11E-2,9.11E-2,9.11E-2,9.11E-2,9.11E-2,0.10947,0.10025999999999999,9.1049999999999992E-2,9.6397449999999996E-2,0.1017449,9.9298499999999998E-2,9.4852310338906787E-2,9.0406120677813562E-2,0.12490806033890678,0.15941,0.170205,0.18099999999999999,0.18049999999999999,0.18,0.185,0.17799999999999999,0.17599999999999999,0.17599999999999999,0.17599999999999999,0.17599999999999999,0.17599999999999999,null,109.47,91.05,101.7449,99.298500000000004,90.406120677813561,159.41]
["MROE eGRID subregion","MRO East",4.1000000000000002E-2,4.1000000000000002E-2,4.1000000000000002E-2,4.1000000000000002E-2,4.1000000000000002E-2,2.759E-2,2.819E-2,2.879E-2,2.6385449999999998E-2,2.3980899999999999E-2,2.4287599999999999E-2,2.4295486947879204E-2,2.4303373895758408E-2,0.1077316869478792,0.19116,0.17358000000000001,0.156,0.16250000000000001,0.16900000000000001,0.14699999999999999,0.13900000000000001,0.14799999999999999,0.14799999999999999,0.14799999999999999,0.14799999999999999,0.14799999999999999,null,27.59,28.79,23.980899999999998,24.287600000000001,24.303373895758408,191.16]
["MROW eGRID subregion","MRO West",2.8000000000000001E-2,2.8000000000000001E-2,2.8000000000000001E-2,2.8000000000000001E-2,2.8000000000000001E-2,2.8000000000000001E-2,2.8485E-2,2.8969999999999999E-2,2.8884150000000001E-2,2.8798300000000002E-2,2.8527799999999999E-2,2.806189955761185E-2,2.7595999115223702E-2,9.4482499557611857E-2,0.16136900000000001,0.13818450000000002,0.115,0.1265,0.13800000000000001,0.11899999999999999,0.104,0.107,0.107,0.107,0.107,0.107,null,28,28.97,28.798300000000001,28.527799999999999,27.595999115223702,161.369]
["NEWE eGRID subregion","NPCC New England",0.08,0.08,0.08,0.08,0.08,8.6489999999999997E-2,8.1735000000000002E-2,7.6980000000000007E-2,7.6332100000000014E-2,7.5684200000000007E-2,7.1757199999999993E-2,7.2297715307378468E-2,7.2838230614756957E-2,8.4420615307378488E-2,9.6003000000000005E-2,9.3001500000000001E-2,0.09,8.5999999999999993E-2,8.2000000000000003E-2,7.6999999999999999E-2,7.3999999999999996E-2,7.1999999999999995E-2,7.1999999999999995E-2,7.1999999999999995E-2,7.1999999999999995E-2,7.1999999999999995E-2,null,86.49,76.98,75.684200000000004,71.757199999999997,72.838230614756952,96.003]
["NWPP eGRID subregion","WECC Northwest",2.1999999999999999E-2,2.1999999999999999E-2,2.1999999999999999E-2,2.1999999999999999E-2,2.1999999999999999E-2,1.9130000000000001E-2,1.7735000000000001E-2,1.634E-2,1.5816549999999999E-2,1.52931E-2,1.6050100000000001E-2,1.4323734863836354E-2,1.2597369727672707E-2,5.5202184863836358E-2,9.7807000000000005E-2,7.9403500000000002E-2,6.0999999999999999E-2,6.25E-2,6.4000000000000001E-2,6.8000000000000005E-2,5.6000000000000001E-2,5.8000000000000003E-2,5.8000000000000003E-2,5.8000000000000003E-2,5.8000000000000003E-2,5.8000000000000003E-2,null,19.130000000000003,16.34,15.293100000000001,16.0501,12.597369727672707,97.807000000000002]
["NYCW eGRID subregion","NPCC NYC/Westchester",3.7999999999999999E-2,3.7999999999999999E-2,3.7999999999999999E-2,3.7999999999999999E-2,3.7999999999999999E-2,3.6020000000000003E-2,3.1120000000000002E-2,2.622E-2,2.4985449999999999E-2,2.3750900000000002E-2,2.3808299999999998E-2,2.4658533498742932E-2,2.5508766997485867E-2,2.4936883498742932E-2,2.4364999999999998E-2,2.3182499999999998E-2,2.1999999999999999E-2,2.1999999999999999E-2,2.1999999999999999E-2,2.1000000000000001E-2,2.1999999999999999E-2,1.9E-2,1.9E-2,1.9E-2,1.9E-2,1.9E-2,null,36.020000000000003,26.22,23.750900000000001,23.808299999999999,25.508766997485868,24.364999999999998]
["NYLI eGRID subregion","NPCC Long Island",0.10199999999999999,0.10199999999999999,0.10199999999999999,0.10199999999999999,0.10199999999999999,0.11541,0.10295499999999999,9.0499999999999997E-2,9.3682299999999996E-2,9.6864599999999995E-2,8.1485799999999997E-2,7.9843692081517259E-2,7.8201584163034535E-2,0.10530629208151726,0.132411,0.1292055,0.126,0.13250000000000001,0.13900000000000001,0.157,0.13800000000000001,0.126,0.126,0.126,0.126,0.126,null,115.41,90.5,96.864599999999996,81.485799999999998,78.201584163034539,132.411]
["NYUP eGRID subregion","NPCC Upstate NY",2.4E-2,2.4E-2,2.4E-2,2.4E-2,2.4E-2,2.4819999999999998E-2,2.1115000000000002E-2,1.7410000000000002E-2,1.667445E-2,1.5938899999999999E-2,1.62974E-2,1.5945712494778413E-2,1.5594024989556825E-2,2.3140012494778414E-2,3.0686000000000001E-2,2.5843000000000001E-2,2.1000000000000001E-2,1.95E-2,1.7999999999999999E-2,1.7000000000000001E-2,1.6E-2,1.4999999999999999E-2,1.4999999999999999E-2,1.4999999999999999E-2,1.4999999999999999E-2,1.4999999999999999E-2,null,24.819999999999997,17.41,15.9389,16.2974,15.594024989556825,30.686]
["RFCE eGRID subregion","RFC East",2.8000000000000001E-2,2.8000000000000001E-2,2.8000000000000001E-2,2.8000000000000001E-2,2.8000000000000001E-2,3.0269999999999998E-2,2.8835E-2,2.7399999999999997E-2,2.7119049999999999E-2,2.68381E-2,2.7071100000000001E-2,2.6757585583216597E-2,2.6444071166433193E-2,5.0188535583216606E-2,7.3933000000000013E-2,6.1966500000000008E-2,0.05,5.5500000000000001E-2,6.0999999999999999E-2,5.2999999999999999E-2,4.4999999999999998E-2,4.9000000000000002E-2,4.9000000000000002E-2,4.9000000000000002E-2,4.9000000000000002E-2,4.9000000000000002E-2,null,30.27,27.4,26.838100000000001,27.071100000000001,26.444071166433194,73.933000000000007]
["RFCM eGRID subregion","RFC Michigan",3.5000000000000003E-2,3.5000000000000003E-2,3.5000000000000003E-2,3.5000000000000003E-2,3.5000000000000003E-2,3.3930000000000002E-2,3.3239999999999999E-2,3.2549999999999996E-2,3.1979499999999994E-2,3.1408999999999999E-2,3.04642E-2,3.0412403034485423E-2,3.0360606068970845E-2,0.10022280303448543,0.17008500000000001,0.11854250000000001,6.7000000000000004E-2,9.8000000000000004E-2,0.129,0.114,0.10100000000000001,0.115,{"$f":"X137","v":0.115},0.115,0.115,0.115,null,33.93,32.549999999999997,31.408999999999999,30.464200000000002,30.360606068970846,170.08500000000001]
["RFCW eGRID subregion","RFC West",0.02,0.02,0.02,0.02,0.02,1.823E-2,1.83E-2,1.8370000000000001E-2,1.82445E-2,1.8119E-2,1.82042E-2,1.7656518292526555E-2,1.7108836585053109E-2,8.3653918292526552E-2,0.150199,0.12909950000000001,0.108,0.1125,0.11700000000000001,9.9000000000000005E-2,8.5999999999999993E-2,9.5000000000000001E-2,9.5000000000000001E-2,9.5000000000000001E-2,9.5000000000000001E-2,9.5000000000000001E-2,null,18.23,18.37,18.119,18.2042,17.108836585053108,150.19900000000001]
["RMPA eGRID subregion","WECC Rockies",2.4E-2,2.4E-2,2.4E-2,2.4E-2,2.4E-2,2.2880000000000001E-2,2.3254999999999998E-2,2.3629999999999998E-2,2.2939499999999998E-2,2.2248999999999998E-2,2.2659800000000001E-2,2.2158738622164512E-2,2.1657677244329022E-2,9.9907838622164499E-2,0.17815799999999998,0.157579,0.13700000000000001,0.13,0.123,0.11700000000000001,0.10100000000000001,0.109,0.109,0.109,0.109,0.109,null,22.880000000000003,23.63,22.248999999999999,22.659800000000001,21.657677244329022,178.15799999999999]
["SPNO eGRID subregion","SPP North",2.4E-2,2.4E-2,2.4E-2,2.4E-2,2.4E-2,2.3820000000000001E-2,2.2519999999999998E-2,2.1219999999999999E-2,2.1114300000000003E-2,2.1008600000000002E-2,2.0807200000000001E-2,2.0511419664915174E-2,2.0215639329830351E-2,9.7002319664915182E-2,0.173789,0.1613945,0.14899999999999999,0.13650000000000001,0.124,0.112,0.1,0.108,0.108,0.108,0.108,0.108,null,23.82,21.22,21.008600000000001,20.807200000000002,20.215639329830353,173.78899999999999]
["SPSO eGRID subregion","SPP South",0.03,0.03,0.03,0.03,0.03,2.4979999999999999E-2,2.4750000000000001E-2,2.452E-2,2.3884000000000002E-2,2.3248000000000001E-2,2.3199999999999998E-2,2.3475352482567553E-2,2.3750704965135112E-2,7.9595852482567564E-2,0.13544100000000001,0.1152205,9.5000000000000001E-2,9.2999999999999999E-2,9.0999999999999998E-2,7.0000000000000007E-2,0.06,0.08,0.08,0.08,0.08,0.08,null,24.98,24.52,23.248000000000001,23.2,23.75070496513511,135.441]
["SRMV eGRID subregion","SERC Mississippi Valley",4.2000000000000003E-2,4.2000000000000003E-2,4.2000000000000003E-2,4.2000000000000003E-2,4.2000000000000003E-2,2.4309999999999998E-2,2.3054999999999999E-2,2.18E-2,2.0623800000000001E-2,1.9447600000000002E-2,2.0663299999999999E-2,2.0808022604885061E-2,2.095274520977012E-2,4.9788872604885057E-2,7.8625E-2,6.4312499999999995E-2,0.05,5.2500000000000005E-2,5.5E-2,4.2999999999999997E-2,3.2000000000000001E-2,0.04,0.04,0.04,0.04,0.04,null,24.31,21.8,19.447600000000001,20.6633,20.952745209770121,78.625]
["SRMW eGRID subregion","SERC Midwest",2.1000000000000001E-2,2.1000000000000001E-2,2.1000000000000001E-2,2.1000000000000001E-2,2.1000000000000001E-2,2.1149999999999999E-2,2.086E-2,2.0570000000000001E-2,2.0070450000000004E-2,1.9570900000000002E-2,2.0483499999999998E-2,2.0032935680749209E-2,1.9582371361498423E-2,0.11421168568074921,0.208841,0.14542050000000001,8.2000000000000003E-2,0.13350000000000001,0.185,0.16900000000000001,0.156,0.17100000000000001,0.17100000000000001,0.17100000000000001,0.17100000000000001,0.17100000000000001,null,21.15,20.57,19.570900000000002,20.483499999999999,19.582371361498424,208.84100000000001]
["SRSO eGRID subregion","SERC South",0.04,0.04,0.04,0.04,0.04,2.6270000000000002E-2,2.4955000000000001E-2,2.3640000000000001E-2,2.295585E-2,2.2271699999999998E-2,2.2821500000000002E-2,2.2741426867134346E-2,2.2661353734268693E-2,6.3186676867134348E-2,0.103712,9.5355999999999996E-2,8.6999999999999994E-2,8.3999999999999991E-2,8.1000000000000003E-2,7.0999999999999994E-2,0.06,6.7000000000000004E-2,6.7000000000000004E-2,6.7000000000000004E-2,6.7000000000000004E-2,6.7000000000000004E-2,null,26.270000000000003,23.64,22.271699999999999,22.8215,22.661353734268694,103.712]
["SRTV eGRID subregion","SERC Tennessee Valley",2.3E-2,2.3E-2,2.3E-2,2.3E-2,2.3E-2,2.0049999999999998E-2,1.9959999999999999E-2,1.9870000000000002E-2,1.85735E-2,1.7277000000000001E-2,1.7696200000000002E-2,1.7540919368329411E-2,1.7385638736658819E-2,7.8012319368329419E-2,0.13863900000000001,0.11581950000000001,9.2999999999999999E-2,9.5000000000000001E-2,9.7000000000000003E-2,8.6999999999999994E-2,7.4999999999999997E-2,8.6999999999999994E-2,8.6999999999999994E-2,8.6999999999999994E-2,8.6999999999999994E-2,8.6999999999999994E-2,null,20.049999999999997,19.87,17.277000000000001,17.696200000000001,17.385638736658819,138.63900000000001]
["SRVC eGRID subregion","SERC Virginia/Carolina",2.9000000000000001E-2,2.9000000000000001E-2,2.9000000000000001E-2,2.9000000000000001E-2,2.9000000000000001E-2,2.3769999999999999E-2,2.3015000000000001E-2,2.2260000000000002E-2,2.1885800000000004E-2,2.1511600000000002E-2,2.1691600000000002E-2,2.2819709025933013E-2,2.3947818051866021E-2,5.9835409025933012E-2,9.5723000000000003E-2,8.1361500000000003E-2,6.7000000000000004E-2,6.7000000000000004E-2,6.7000000000000004E-2,5.8000000000000003E-2,0.05,5.1999999999999998E-2,5.1999999999999998E-2,5.1999999999999998E-2,5.1999999999999998E-2,5.1999999999999998E-2,null,23.77,22.26,21.511600000000001,21.691600000000001,23.947818051866022,95.722999999999999]
[]
[]
[null,null,"lbs N2O/MWh",null,null,null,null,null,null,null,null,null,null,null,null,null,null,null,null,null,null,null,null,null,null,null,null,null,null,"lbs N2O/GWh"]
["eGRID Subregion","Subregion Name",2000,2001,2002,2003,2004,2005,2006,2007,2008,2009,2010,2011,2012,2013,2014,2015,2016,2017,2018,2019,2020,2021,2022,2023,2024,2025,null,2005,2007,2009,2010,2012,2014]
["AKGD eGRID subregion","ASCC Alaska Grid",{"$f":"D151","v":6.4000000000000003E-3},6.4000000000000003E-3,6.4000000000000003E-3,6.4000000000000003E-3,6.4000000000000003E-3,{"$f":"AD151/1000","v":6.5100000000000002E-3},{"$f":"(H151+J151)/2","v":6.9750000000000003E-3},{"$f":"AE151/1000","v":7.4400000000000004E-3},{"$f":"(J151+L151)/2","v":7.5638500000000004E-3},{"$f":"AF151/1000","v":7.6877000000000004E-3},{"$f":"AG151/1000","v":7.1792000000000002E-3},{"$f":"(M151+O151)/2","v":7.3869822439804837E-3},{"$f":"AH151/1000","v":7.594764487960968E-3},{"$f":"(O151+Q151)/2","v":7.3778822439804839E-3},{"$f":"AI151/1000","v":7.1609999999999998E-3},9.0805E-3,1.0999999999999999E-2,{"$f":"(S151+U151)/2","v":1.0999999999999999E-2},1.0999999999999999E-2,1.2999999999999999E-2,1.4E-2,1.2E-2,{"$f":"X151","v":1.2E-2},{"$f":"Y151","v":1.2E-2},{"$f":"Z151","v":1.2E-2},{"$f":"AA151","v":1.2E-2},null,6.51,7.44,7.6877000000000004,7.1791999999999998,7.5947644879609681,7.1609999999999996]
["AKMS eGRID subregion","ASCC Miscellaneous",4.4000000000000003E-3,4.4000000000000003E-3,4.4000000000000003E-3,4.4000000000000003E-3,4.4000000000000003E-3,4.0800000000000003E-3,{"$f":"(H152+J152)/2","v":4.2800000000000008E-3},4.4800000000000005E-3,{"$f":"(J152+L152)/2","v":4.3806999999999995E-3},4.2813999999999994E-3,{"$f":"AG152/1000","v":3.6806E-3},{"$f":"(M152+O152)/2","v":3.6144130769321346E-3},{"$f":"AH152/1000","v":3.5482261538642692E-3},4.773113076932135E-3,5.9979999999999999E-3,4.999E-3,4.0000000000000001E-3,{"$f":"(S152+U152)/2","v":4.0000000000000001E-3},4.0000000000000001E-3,4.0000000000000001E-3,5.0000000000000001E-3,4.0000000000000001E-3,{"$f":"X152","v":4.0000000000000001E-3},4.0000000000000001E-3,4.0000000000000001E-3,4.0000000000000001E-3,null,4.08,4.4800000000000004,4.2813999999999997,3.6806000000000001,3.5482261538642694,5.9980000000000002]
["AZNM eGRID subregion","WECC Southwest",1.4999999999999999E-2,1.4999999999999999E-2,1.4999999999999999E-2,1.4999999999999999E-2,1.4999999999999999E-2,1.7940000000000001E-2,1.7255E-2,1.6570000000000001E-2,1.6075900000000001E-2,1.55818E-2,1.57231E-2,1.5414622605812261E-2,1.5106145211624523E-2,1.2209572605812262E-2,9.3130000000000001E-3,1.0656499999999999E-2,1.2E-2,1.15E-2,1.0999999999999999E-2,0.01,7.0000000000000001E-3,7.0000000000000001E-3,7.0000000000000001E-3,7.0000000000000001E-3,7.0000000000000001E-3,7.0000000000000001E-3,null,17.940000000000001,16.57,15.581799999999999,15.723100000000001,15.106145211624524,9.3130000000000006]
["CAMX eGRID subregion","WECC California",8.0800000000000004E-3,8.0800000000000004E-3,8.0800000000000004E-3,8.0800000000000004E-3,{"$f":"H154","v":8.0800000000000004E-3},8.0800000000000004E-3,7.1549999999999999E-3,6.2300000000000003E-3,6.1976500000000007E-3,6.1653000000000003E-3,6.0270999999999996E-3,5.8505476319126934E-3,5.6739952638253863E-3,4.854997631912693E-3,4.0359999999999997E-3,4.0179999999999999E-3,4.0000000000000001E-3,4.0000000000000001E-3,4.0000000000000001E-3,4.0000000000000001E-3,4.0000000000000001E-3,4.0000000000000001E-3,4.0000000000000001E-3,4.0000000000000001E-3,4.0000000000000001E-3,4.0000000000000001E-3,null,8.08,6.23,6.1653000000000002,6.0270999999999999,5.6739952638253861,4.0359999999999996]
["ERCT eGRID subregion","ERCOT All",1.4999999999999999E-2,1.4999999999999999E-2,1.4999999999999999E-2,1.4999999999999999E-2,1.4999999999999999E-2,1.511E-2,1.455E-2,1.3990000000000001E-2,1.354675E-2,1.3103500000000001E-2,1.4071E-2,1.3202864722870161E-2,1.2334729445740322E-2,1.195486472287016E-2,1.1574999999999998E-2,1.1287499999999999E-2,1.0999999999999999E-2,9.9999999999999985E-3,8.9999999999999993E-3,8.0000000000000002E-3,7.0000000000000001E-3,8.0000000000000002E-3,8.0000000000000002E-3,8.0000000000000002E-3,8.0000000000000002E-3,8.0000000000000002E-3,null,15.11,13.99,13.1035,14.071,12.334729445740322,11.574999999999999]
["FRCC eGRID subregion","FRCC All",1.6E-2,1.6E-2,1.6E-2,1.6E-2,1.6E-2,1.694E-2,1.6094999999999998E-2,1.525E-2,1.439145E-2,1.35329E-2,1.3746399999999999E-2,1.2799569095500313E-2,1.1852738191000627E-2,1.1951869095500313E-2,1.2051000000000001E-2,1.1025500000000001E-2,0.01,9.4999999999999998E-3,8.9999999999999993E-3,7.0000000000000001E-3,6.0000000000000001E-3,7.0000000000000001E-3,7.0000000000000001E-3,7.0000000000000001E-3,7.0000000000000001E-3,7.0000000000000001E-3,null,16.940000000000001,15.25,13.5329,13.7464,11.852738191000627,12.051]
["HIMS eGRID subregion","HICC Miscellaneous",1.7999999999999999E-2,1.7999999999999999E-2,1.7999999999999999E-2,1.7999999999999999E-2,1.7999999999999999E-2,4.6879999999999998E-2,3.4294999999999999E-2,2.171E-2,1.775705E-2,1.38041E-2,1.38818E-2,1.3282558658356177E-2,1.2683317316712354E-2,1.3951658658356177E-2,1.5220000000000001E-2,1.511E-2,1.4999999999999999E-2,1.6500000000000001E-2,1.7999999999999999E-2,2.1999999999999999E-2,1.7000000000000001E-2,2.1000000000000001E-2,2.1000000000000001E-2,2.1000000000000001E-2,2.1000000000000001E-2,2.1000000000000001E-2,null,46.879999999999995,21.71,13.8041,13.8818,12.683317316712353,15.22]
["HIOA eGRID subregion","HICC Oahu",2.12E-2,2.12E-2,2.12E-2,2.12E-2,2.12E-2,2.3619999999999999E-2,2.2254999999999997E-2,2.0889999999999999E-2,2.1435249999999999E-2,2.19805E-2,2.2411199999999999E-2,2.1980722652640623E-2,2.1550245305281247E-2,2.3005122652640625E-2,2.4460000000000003E-2,2.6230000000000003E-2,2.8000000000000001E-2,2.75E-2,2.7E-2,2.8000000000000001E-2,2.7E-2,2.7E-2,2.7E-2,2.7E-2,2.7E-2,2.7E-2,null,23.619999999999997,20.89,21.980499999999999,22.411200000000001,21.550245305281248,24.46]
["MROE eGRID subregion","MRO East",0.03,0.03,0.03,0.03,0.03,3.0360000000000002E-2,2.9705000000000002E-2,2.9049999999999999E-2,2.8045649999999998E-2,2.7041300000000001E-2,2.75216E-2,2.6538148479555185E-2,2.5554696959110369E-2,2.6866348479555185E-2,2.8178000000000002E-2,2.7089000000000002E-2,2.5999999999999999E-2,2.5500000000000002E-2,2.5000000000000001E-2,2.1999999999999999E-2,0.02,2.1999999999999999E-2,2.1999999999999999E-2,2.1999999999999999E-2,2.1999999999999999E-2,2.1999999999999999E-2,null,30.360000000000003,29.05,27.0413,27.521599999999999,25.55469695911037,28.178000000000001]
["MROW eGRID subregion","MRO West",2.9000000000000001E-2,2.9000000000000001E-2,2.9000000000000001E-2,2.9000000000000001E-2,2.9000000000000001E-2,3.0710000000000001E-2,2.9950000000000001E-2,2.9190000000000001E-2,2.8490099999999997E-2,2.7790199999999998E-2,2.6291100000000001E-2,2.5276079994984622E-2,2.4261059989969243E-2,2.380402999498462E-2,2.3347E-2,2.1673499999999998E-2,0.02,0.02,0.02,1.7000000000000001E-2,1.4999999999999999E-2,1.4999999999999999E-2,1.4999999999999999E-2,1.4999999999999999E-2,1.4999999999999999E-2,1.4999999999999999E-2,null,30.71,29.19,27.790199999999999,26.2911,24.261059989969244,23.347000000000001]
["NEWE eGRID subregion","NPCC New England",1.4999999999999999E-2,1.4999999999999999E-2,1.4999999999999999E-2,1.4999999999999999E-2,1.4999999999999999E-2,1.7010000000000001E-2,1.6105000000000001E-2,1.52E-2,1.45275E-2,1.3855000000000001E-2,1.2976100000000001E-2,1.1841893503815662E-2,1.0707687007631321E-2,1.177534350381566E-2,1.2843E-2,1.24215E-2,1.2E-2,1.15E-2,1.0999999999999999E-2,0.01,0.01,8.9999999999999993E-3,8.9999999999999993E-3,8.9999999999999993E-3,8.9999999999999993E-3,8.9999999999999993E-3,null,17.010000000000002,15.2,13.855,12.976100000000001,10.707687007631321,12.843]
["NWPP eGRID subregion","WECC Northwest",1.4E-2,1.4E-2,1.4E-2,1.4E-2,1.4E-2,1.49E-2,1.4270000000000001E-2,1.3640000000000001E-2,1.3070200000000001E-2,1.25004E-2,1.30724E-2,1.17237088458019E-2,1.0375017691603799E-2,1.22995088458019E-2,1.4224000000000001E-2,1.1612000000000001E-2,8.9999999999999993E-3,8.9999999999999993E-3,8.9999999999999993E-3,0.01,8.0000000000000002E-3,8.0000000000000002E-3,8.0000000000000002E-3,8.0000000000000002E-3,8.0000000000000002E-3,8.0000000000000002E-3,null,14.9,13.64,12.500400000000001,13.0724,10.375017691603798,14.224]
["NYCW eGRID subregion","NPCC NYC/Westchester",6.0000000000000001E-3,6.0000000000000001E-3,6.0000000000000001E-3,6.0000000000000001E-3,6.0000000000000001E-3,5.4599999999999996E-3,4.4050000000000001E-3,3.3500000000000001E-3,3.0782500000000003E-3,2.8065000000000004E-3,2.8003999999999998E-3,2.8663434387654835E-3,2.9322868775309668E-3,2.9516434387654835E-3,2.9710000000000001E-3,2.9855000000000003E-3,3.0000000000000001E-3,3.0000000000000001E-3,3.0000000000000001E-3,2E-3,3.0000000000000001E-3,2E-3,2E-3,2E-3,2E-3,2E-3,null,5.46,3.35,2.8065000000000002,2.8003999999999998,2.932286877530967,2.9710000000000001]
["NYLI eGRID subregion","NPCC Long Island",1.6E-2,1.6E-2,1.6E-2,1.6E-2,1.6E-2,1.8089999999999998E-2,1.5594999999999998E-2,1.3099999999999999E-2,1.2736649999999999E-2,1.23733E-2,1.0284700000000001E-2,1.007644798520228E-2,9.8681959704045568E-3,1.3531097985202276E-2,1.7193999999999997E-2,1.6597000000000001E-2,1.6E-2,1.7000000000000001E-2,1.7999999999999999E-2,0.02,1.7999999999999999E-2,1.6E-2,1.6E-2,1.6E-2,1.6E-2,1.6E-2,null,18.09,13.1,12.3733,10.284700000000001,9.8681959704045568,17.193999999999999]
["NYUP eGRID subregion","NPCC Upstate NY",1.0999999999999999E-2,1.0999999999999999E-2,1.0999999999999999E-2,1.0999999999999999E-2,1.0999999999999999E-2,1.119E-2,1.0545000000000001E-2,9.9000000000000008E-3,8.3327499999999999E-3,6.7655000000000007E-3,7.2418999999999999E-3,5.534399130768526E-3,3.8268982615370525E-3,3.9824491307685261E-3,4.1380000000000002E-3,3.5690000000000001E-3,3.0000000000000001E-3,2.5000000000000001E-3,2E-3,2E-3,2E-3,2E-3,2E-3,2E-3,2E-3,2E-3,null,11.19,9.9,6.7655000000000003,7.2419000000000002,3.8268982615370524,4.1379999999999999]
["RFCE eGRID subregion","RFC East",1.7000000000000001E-2,1.7000000000000001E-2,1.7000000000000001E-2,1.7000000000000001E-2,1.7000000000000001E-2,1.8710000000000001E-2,1.787E-2,1.703E-2,1.5996200000000002E-2,1.4962400000000001E-2,1.5329800000000001E-2,1.3408549029163618E-2,1.1487298058327234E-2,1.1356649029163618E-2,1.1226000000000002E-2,1.0113E-2,8.9999999999999993E-3,8.5000000000000006E-3,8.0000000000000002E-3,7.0000000000000001E-3,6.0000000000000001E-3,7.0000000000000001E-3,7.0000000000000001E-3,7.0000000000000001E-3,7.0000000000000001E-3,7.0000000000000001E-3,null,18.71,17.03,14.962400000000001,15.329800000000001,11.487298058327234,11.226000000000001]
["RFCM eGRID subregion","RFC Michigan",2.5000000000000001E-2,2.5000000000000001E-2,2.5000000000000001E-2,2.5000000000000001E-2,2.5000000000000001E-2,2.717E-2,2.7479999999999997E-2,2.7789999999999999E-2,2.7839200000000001E-2,2.7888400000000001E-2,2.6840800000000001E-2,2.5478167700607124E-2,2.4115535401214243E-2,2.4288267700607123E-2,2.4461E-2,2.1230499999999999E-2,1.7999999999999999E-2,1.7999999999999999E-2,1.7999999999999999E-2,1.6E-2,1.4E-2,1.6E-2,{"$f":"X167","v":1.6E-2},1.6E-2,1.6E-2,1.6E-2,null,27.169999999999998,27.79,27.888400000000001,26.840800000000002,24.115535401214242,24.460999999999999]
["RFCW eGRID subregion","RFC West",2.4E-2,2.4E-2,2.4E-2,2.4E-2,2.4E-2,2.571E-2,2.5819999999999999E-2,2.5929999999999998E-2,2.5531699999999997E-2,2.51334E-2,2.4746899999999999E-2,2.3206694340935557E-2,2.1666488681871116E-2,2.1850244340935555E-2,2.2033999999999998E-2,2.0517000000000001E-2,1.9E-2,1.8000000000000002E-2,1.7000000000000001E-2,1.4E-2,1.2E-2,1.4E-2,1.4E-2,1.4E-2,1.4E-2,1.4E-2,null,25.71,25.93,25.133400000000002,24.7469,21.666488681871115,22.033999999999999]
["RMPA eGRID subregion","WECC Rockies",0.03,0.03,0.03,0.03,0.03,2.8750000000000001E-2,2.8819999999999998E-2,2.8889999999999999E-2,2.804015E-2,2.7190300000000001E-2,2.9206600000000003E-2,2.8668048950247764E-2,2.8129497900495522E-2,2.6950248950247762E-2,2.5771000000000002E-2,2.2885500000000003E-2,0.02,1.9E-2,1.7999999999999999E-2,1.7000000000000001E-2,1.4E-2,1.6E-2,1.6E-2,1.6E-2,1.6E-2,1.6E-2,null,28.75,28.89,27.190300000000001,29.206600000000002,28.129497900495522,25.771000000000001]
["SPNO eGRID subregion","SPP North",0.03,0.03,0.03,0.03,0.03,3.209E-2,3.0644999999999999E-2,2.92E-2,2.9045499999999998E-2,2.8890999999999997E-2,2.86235E-2,2.7883756524214581E-2,2.7144013048429162E-2,2.6180506524214581E-2,2.5217E-2,2.3608499999999998E-2,2.1999999999999999E-2,1.9999999999999997E-2,1.7999999999999999E-2,1.6E-2,1.4E-2,1.6E-2,1.6E-2,1.6E-2,1.6E-2,1.6E-2,null,32.090000000000003,29.2,28.890999999999998,28.6235,27.144013048429162,25.216999999999999]
["SPSO eGRID subregion","SPP South",2.3E-2,2.3E-2,2.3E-2,2.3E-2,2.3E-2,2.2610000000000002E-2,2.2515E-2,2.2420000000000002E-2,2.2103750000000002E-2,2.1787500000000001E-2,2.0850999999999998E-2,2.0413003435335413E-2,1.9975006870670831E-2,1.9832503435335415E-2,1.9690000000000003E-2,1.7344999999999999E-2,1.4999999999999999E-2,1.3999999999999999E-2,1.2999999999999999E-2,0.01,8.9999999999999993E-3,1.2E-2,1.2E-2,1.2E-2,1.2E-2,1.2E-2,null,22.610000000000003,22.42,21.787500000000001,20.850999999999999,19.975006870670832,19.690000000000001]
["SRMV eGRID subregion","SERC Mississippi Valley",1.2999999999999999E-2,1.2999999999999999E-2,1.2999999999999999E-2,1.2999999999999999E-2,1.2999999999999999E-2,1.171E-2,1.1429999999999999E-2,1.115E-2,1.0902200000000001E-2,1.0654400000000001E-2,1.0755800000000001E-2,1.0681444183638693E-2,1.0607088367277383E-2,1.0927044183638691E-2,1.1247E-2,9.1234999999999997E-3,7.0000000000000001E-3,7.4999999999999997E-3,8.0000000000000002E-3,6.0000000000000001E-3,4.0000000000000001E-3,6.0000000000000001E-3,6.0000000000000001E-3,6.0000000000000001E-3,6.0000000000000001E-3,6.0000000000000001E-3,null,11.709999999999999,11.15,10.654400000000001,10.755800000000001,10.607088367277383,11.247]
["SRMW eGRID subregion","SERC Midwest",2.9000000000000001E-2,2.9000000000000001E-2,2.9000000000000001E-2,2.9000000000000001E-2,2.9000000000000001E-2,3.0499999999999999E-2,3.005E-2,2.9600000000000001E-2,2.9291250000000001E-2,2.8982500000000001E-2,2.9574300000000001E-2,2.8536707230141387E-2,2.7499114460282772E-2,2.8935057230141385E-2,3.0370999999999999E-2,2.8185499999999999E-2,2.5999999999999999E-2,2.6499999999999999E-2,2.7E-2,2.5000000000000001E-2,2.3E-2,2.5000000000000001E-2,2.5000000000000001E-2,2.5000000000000001E-2,2.5000000000000001E-2,2.5000000000000001E-2,null,30.5,29.6,28.982500000000002,29.574300000000001,27.499114460282772,30.370999999999999]
["SRSO eGRID subregion","SERC South",2.5000000000000001E-2,2.5000000000000001E-2,2.5000000000000001E-2,2.5000000000000001E-2,2.5000000000000001E-2,2.547E-2,2.5020000000000001E-2,2.4570000000000002E-2,2.2672750000000002E-2,2.0775500000000002E-2,2.0887899999999997E-2,1.8187855309150097E-2,1.5487810618300199E-2,1.5406405309150099E-2,1.5325E-2,1.41625E-2,1.2999999999999999E-2,1.2500000000000001E-2,1.2E-2,0.01,8.9999999999999993E-3,0.01,0.01,0.01,0.01,0.01,null,25.47,24.57,20.775500000000001,20.887899999999998,15.487810618300198,15.324999999999999]
["SRTV eGRID subregion","SERC Tennessee Valley",2.4E-2,2.4E-2,2.4E-2,2.4E-2,2.4E-2,2.564E-2,2.5559999999999999E-2,2.5479999999999999E-2,2.3783200000000001E-2,2.2086400000000003E-2,2.24122E-2,2.1598133054585439E-2,2.0784066109170881E-2,2.0489033054585441E-2,2.0194E-2,1.8597000000000002E-2,1.7000000000000001E-2,1.55E-2,1.4E-2,1.2999999999999999E-2,1.0999999999999999E-2,1.2999999999999999E-2,1.2999999999999999E-2,1.2999999999999999E-2,1.2999999999999999E-2,1.2999999999999999E-2,null,25.64,25.48,22.086400000000001,22.412199999999999,20.78406610917088,20.193999999999999]
["SRVC eGRID subregion","SERC Virginia/Carolina",1.9E-2,1.9E-2,1.9E-2,1.9E-2,1.9E-2,1.9789999999999999E-2,1.9435000000000001E-2,1.908E-2,1.8263399999999999E-2,1.7446799999999998E-2,1.7640400000000001E-2,1.6119917559908766E-2,1.4599435119817534E-2,1.4188217559908766E-2,1.3776999999999999E-2,1.23885E-2,1.0999999999999999E-2,9.9999999999999985E-3,8.9999999999999993E-3,8.0000000000000002E-3,7.0000000000000001E-3,7.0000000000000001E-3,7.0000000000000001E-3,7.0000000000000001E-3,7.0000000000000001E-3,7.0000000000000001E-3,null,19.79,19.079999999999998,17.4468,17.6404,14.599435119817533,13.776999999999999]
[]
["Sources:"]
["Emissions & Generation Resource Integrated Database (eGRID). https://www.epa.gov/energy/emissions-generation-resource-integrated-database-egrid"]
["CARB (California Air Resources Board). 2010. Local Government Operations Protocol, Version 1.1. California Air Resources Board, California Climate Action Registry, ICLEI, and The Climate Registry."]
[]
["Mobile Factors"]
[]
["Fuel CO2 Emission Factors"]
[]
[null,"kg CO2/gallon (GGE for CNG)"]
["Other Fuels","Total","Biogenic Portion","Fossil portion","MMBTU/unit"]
["Gasoline",{"$f":"C188+D188","v":8.7799999999999994},null,8.7799999999999994,{"$f":"5.25/42","v":0.125}]
["Diesel",{"$f":"C189+D189","v":10.210000000000001},null,10.210000000000001,{"$f":"5.8/42","v":0.1380952380952381}]
["Biodiesel (B5)",10.172000000000001,{"$f":"0.05*C192","v":0.47249999999999998},{"$f":"0.95*D189","v":9.6995000000000005},{"$f":"0.05*$E$192+0.95*$E$189","v":0.1375952380952381}]
["Biodiesel (B20)",10.058000000000002,{"$f":"0.2*C192","v":1.89},{"$f":"0.8*D189","v":8.168000000000001},{"$f":"0.2*$E$192+0.8*$E$189","v":0.1360952380952381}]
["B100",9.4499999999999993,9.4499999999999993,null,{"$f":"5.38/42","v":0.1280952380952381}]
["Ethanol (E85)",6.2045000000000003,{"$f":"0.85*C194","v":4.8875000000000002},{"$f":"0.15*D188","v":1.3169999999999999},{"$f":"0.85*$E$194+(1-0.85)*$E$188","v":9.0190476190476182E-2}]
["E100",5.75,5.75,null,{"$f":"3.53/42","v":8.4047619047619038E-2}]
["CNG",6.8401800000000001,null,6.8401800000000001,{"$f":"$E$188","v":0.125}]
["LNG",4.46,null,4.46,{"$f":"75000*10^-6","v":7.4999999999999997E-2}]
["LPG",5.79,null,5.79,{"$f":"3.86/42","v":9.1904761904761906E-2}]
["Methanol",4.0999999999999996,null,4.0999999999999996]
["Residual Fuel",11.8,null,11.8,{"$f":"6.29/42","v":0.14976190476190476}]
["Jet Fuel",9.57,null,9.57,{"$f":"5.67/42","v":0.13500000000000001}]
["Aviation Gasoline",8.31,null,8.31,{"$f":"5.04/42","v":0.12}]
[]
["Default CH4 and N2O Emission Factors for Highway Vehicles by Model Year"]
[]
[null,"Vehicle Type and Year","CH4 (g/mi)",null,null,null,null,null,null,"Vehicle Type and Year","N2O (g/mi)"]
[null,null,"Gasoline","Gasoline","Gasoline","Diesel","Diesel","Diesel",null,null,"Gasoline","Gasoline","Gasoline","Diesel","Diesel","Diesel"]
[null,null,"Passenger Car","Light Truck (Vans, Pickup Trucks, SUVs)","Heavy-Duty Vehicle","Passenger Car","Light Truck (Vans, Pickup Trucks, SUVs)","Heavy-Duty Vehicle",null,null,"Passenger Car","Light Truck (Vans, Pickup Trucks, SUVs)","Heavy-Duty Vehicle","Passenger Car","Light Truck (Vans, Pickup Trucks, SUVs)","Heavy-Duty Vehicle"]
[null,null,{"$f":"C206&C207","v":"GasolinePassenger Car"},"GasolineLight Truck (Vans, Pickup Trucks, SUVs)","GasolineHeavy-Duty Vehicle","DieselPassenger Car","DieselLight Truck (Vans, Pickup Trucks, SUVs)","DieselHeavy-Duty Vehicle",null,null,{"$f":"K206&K207","v":"GasolinePassenger Car"},"GasolineLight Truck (Vans, Pickup Trucks, SUVs)","GasolineHeavy-Duty Vehicle","DieselPassenger Car","DieselLight Truck (Vans, Pickup Trucks, SUVs)","DieselHeavy-Duty Vehicle"]
[null,1980,0.1696,0.15939999999999999,0.46039999999999998,5.9999999999999995E-4,1.1000000000000001E-3,5.1000000000000004E-3,null,1980,1.9699999999999999E-2,5.5500000000000001E-2,4.9700000000000001E-2,1.1999999999999999E-3,1.6999999999999999E-3,4.7999999999999996E-3]
[null,1981,0.14230000000000001,0.16339999999999999,0.44919999999999999,5.9999999999999995E-4,1.1000000000000001E-3,5.1000000000000004E-3,null,1981,4.4299999999999999E-2,5.1299999999999998E-2,5.3800000000000001E-2,1.1999999999999999E-3,1.6999999999999999E-3,4.7999999999999996E-3]
[null,1982,0.1406,0.15939999999999999,0.44919999999999999,5.9999999999999995E-4,1.1000000000000001E-3,5.1000000000000004E-3,null,1982,4.58E-2,5.5500000000000001E-2,5.3800000000000001E-2,1.1999999999999999E-3,1.6999999999999999E-3,4.7999999999999996E-3]
[null,1983,0.1389,0.16139999999999999,0.44919999999999999,5.0000000000000001E-4,8.9999999999999998E-4,5.1000000000000004E-3,null,1983,4.7300000000000002E-2,5.3400000000000003E-2,5.3800000000000001E-2,1E-3,1.4E-3,4.7999999999999996E-3]
[null,1984,7.0400000000000004E-2,0.15939999999999999,0.44919999999999999,5.0000000000000001E-4,8.9999999999999998E-4,5.1000000000000004E-3,null,1984,6.4699999999999994E-2,5.5500000000000001E-2,5.3800000000000001E-2,1E-3,1.4E-3,4.7999999999999996E-3]
[null,1985,7.0400000000000004E-2,0.1479,0.44919999999999999,5.0000000000000001E-4,8.9999999999999998E-4,5.1000000000000004E-3,null,1985,6.4699999999999994E-2,6.6000000000000003E-2,5.3800000000000001E-2,1E-3,1.4E-3,4.7999999999999996E-3]
[null,1986,7.0400000000000004E-2,0.14419999999999999,0.44919999999999999,5.0000000000000001E-4,8.9999999999999998E-4,5.1000000000000004E-3,null,1986,6.4699999999999994E-2,6.8099999999999994E-2,5.3800000000000001E-2,1E-3,1.4E-3,4.7999999999999996E-3]
[null,1987,7.0400000000000004E-2,8.1299999999999997E-2,0.36749999999999999,5.0000000000000001E-4,8.9999999999999998E-4,5.1000000000000004E-3,null,1987,6.4699999999999994E-2,0.10349999999999999,8.4900000000000003E-2,1E-3,1.4E-3,4.7999999999999996E-3]
[null,1988,7.0400000000000004E-2,8.1299999999999997E-2,0.34920000000000001,5.0000000000000001E-4,8.9999999999999998E-4,5.1000000000000004E-3,null,1988,6.4699999999999994E-2,0.10349999999999999,9.3299999999999994E-2,1E-3,1.4E-3,4.7999999999999996E-3]
[null,1989,7.0400000000000004E-2,8.1299999999999997E-2,0.34920000000000001,5.0000000000000001E-4,8.9999999999999998E-4,5.1000000000000004E-3,null,1989,6.4699999999999994E-2,0.10349999999999999,9.3299999999999994E-2,1E-3,1.4E-3,4.7999999999999996E-3]
[null,1990,7.0400000000000004E-2,8.1299999999999997E-2,0.3246,5.0000000000000001E-4,8.9999999999999998E-4,5.1000000000000004E-3,null,1990,6.4699999999999994E-2,0.10349999999999999,0.1142,1E-3,1.4E-3,4.7999999999999996E-3]
[null,1991,7.0400000000000004E-2,8.1299999999999997E-2,0.3246,5.0000000000000001E-4,8.9999999999999998E-4,5.1000000000000004E-3,null,1991,6.4699999999999994E-2,0.10349999999999999,0.1142,1E-3,1.4E-3,4.7999999999999996E-3]
[null,1992,7.0400000000000004E-2,8.1299999999999997E-2,0.3246,5.0000000000000001E-4,8.9999999999999998E-4,5.1000000000000004E-3,null,1992,6.4699999999999994E-2,0.10349999999999999,0.1142,1E-3,1.4E-3,4.7999999999999996E-3]
[null,1993,7.0400000000000004E-2,8.1299999999999997E-2,0.3246,5.0000000000000001E-4,8.9999999999999998E-4,5.1000000000000004E-3,null,1993,6.4699999999999994E-2,0.10349999999999999,0.1142,1E-3,1.4E-3,4.7999999999999996E-3]
[null,1994,8.0199999999999994E-2,0.12939999999999999,0.3246,5.0000000000000001E-4,8.9999999999999998E-4,5.1000000000000004E-3,null,1994,6.2600000000000003E-2,7.6399999999999996E-2,0.1142,1E-3,1.4E-3,4.7999999999999996E-3]
[null,1995,7.9500000000000001E-2,0.122,0.3246,5.0000000000000001E-4,8.9999999999999998E-4,5.1000000000000004E-3,null,1995,6.2700000000000006E-2,8.0600000000000005E-2,0.1142,1E-3,1.4E-3,4.7999999999999996E-3]
[null,1996,7.8200000000000006E-2,0.11459999999999999,0.40899999999999997,5.0000000000000001E-4,8.9999999999999998E-4,5.1000000000000004E-3,null,1996,6.3E-2,8.48E-2,5.1499999999999997E-2,1E-3,1.4E-3,4.7999999999999996E-3]
[null,1997,7.0400000000000004E-2,8.1299999999999997E-2,0.36749999999999999,5.0000000000000001E-4,8.9999999999999998E-4,5.1000000000000004E-3,null,1997,6.4699999999999994E-2,0.10349999999999999,8.4900000000000003E-2,1E-3,1.4E-3,4.7999999999999996E-3]
[null,1998,6.1699999999999998E-2,6.4600000000000005E-2,0.34920000000000001,5.0000000000000001E-4,8.9999999999999998E-4,5.1000000000000004E-3,null,1998,6.0299999999999999E-2,9.8199999999999996E-2,9.3299999999999994E-2,1E-3,1.4E-3,4.7999999999999996E-3]
[null,1999,5.3100000000000001E-2,5.1700000000000003E-2,0.3246,5.0000000000000001E-4,8.9999999999999998E-4,5.1000000000000004E-3,null,1999,5.6000000000000001E-2,9.0800000000000006E-2,0.1142,1E-3,1.4E-3,4.7999999999999996E-3]
[null,2000,4.3400000000000001E-2,4.5199999999999997E-2,0.1278,5.0000000000000001E-4,8.9999999999999998E-4,5.1000000000000004E-3,null,2000,5.0299999999999997E-2,8.7099999999999997E-2,0.16800000000000001,1E-3,1.4E-3,4.7999999999999996E-3]
[null,2001,3.3700000000000001E-2,4.5199999999999997E-2,9.2399999999999996E-2,5.0000000000000001E-4,8.9999999999999998E-4,5.1000000000000004E-3,null,2001,4.4600000000000001E-2,8.7099999999999997E-2,0.1726,1E-3,1.4E-3,4.7999999999999996E-3]
[null,2002,2.4E-2,4.1200000000000001E-2,6.5500000000000003E-2,5.0000000000000001E-4,8.9999999999999998E-4,5.1000000000000004E-3,null,2002,3.8899999999999997E-2,7.8700000000000006E-2,0.17499999999999999,1E-3,1.4E-3,4.7999999999999996E-3]
[null,2003,2.1499999999999998E-2,3.3300000000000003E-2,6.4799999999999996E-2,5.0000000000000001E-4,8.9999999999999998E-4,5.1000000000000004E-3,null,2003,3.5499999999999997E-2,6.1800000000000001E-2,0.1724,1E-3,1.4E-3,4.7999999999999996E-3]
[null,2004,1.7500000000000002E-2,3.4000000000000002E-2,6.3E-2,5.0000000000000001E-4,8.9999999999999998E-4,5.1000000000000004E-3,null,2004,3.04E-2,6.3100000000000003E-2,0.16600000000000001,1E-3,1.4E-3,4.7999999999999996E-3]
[null,2005,1.0500000000000001E-2,2.2100000000000002E-2,5.7700000000000001E-2,5.0000000000000001E-4,8.9999999999999998E-4,5.1000000000000004E-3,null,2005,2.12E-2,3.7900000000000003E-2,0.14680000000000001,1E-3,1.4E-3,4.7999999999999996E-3]
[null,2006,1.0200000000000001E-2,2.4199999999999999E-2,6.3399999999999998E-2,5.0000000000000001E-4,8.9999999999999998E-4,5.1000000000000004E-3,null,2006,2.07E-2,4.24E-2,0.1673,1E-3,1.4E-3,4.7999999999999996E-3]
[null,2007,9.4999999999999998E-3,2.2100000000000002E-2,6.0199999999999997E-2,3.0200000000000001E-2,8.9999999999999998E-4,9.4999999999999998E-3,null,2007,1.8100000000000002E-2,3.73E-2,0.15529999999999999,1.9199999999999998E-2,1.4E-3,4.3099999999999999E-2]
[null,2008,7.7999999999999996E-3,1.15E-2,2.98E-2,3.0200000000000001E-2,2.9000000000000001E-2,9.4999999999999998E-3,null,2008,8.5000000000000006E-3,8.8000000000000005E-3,1.6400000000000001E-2,1.9199999999999998E-2,2.1399999999999999E-2,4.3099999999999999E-2]
[null,2009,7.4999999999999997E-3,1.0500000000000001E-2,2.9700000000000001E-2,3.0200000000000001E-2,2.9000000000000001E-2,9.4999999999999998E-3,null,2009,6.7000000000000002E-3,6.4000000000000003E-3,8.3000000000000001E-3,1.9199999999999998E-2,2.1399999999999999E-2,4.3099999999999999E-2]
[null,2010,7.6E-3,1.0800000000000001E-2,2.9899999999999999E-2,3.0200000000000001E-2,2.9000000000000001E-2,9.4999999999999998E-3,null,2010,7.4999999999999997E-3,8.0000000000000002E-3,2.41E-2,1.9199999999999998E-2,2.1399999999999999E-2,4.3099999999999999E-2]
[null,2011,7.1999999999999998E-3,1.03E-2,3.2199999999999999E-2,3.0200000000000001E-2,2.9000000000000001E-2,9.4999999999999998E-3,null,2011,5.1999999999999998E-3,6.1000000000000004E-3,1.5E-3,1.9199999999999998E-2,2.1399999999999999E-2,4.3099999999999999E-2]
[null,2012,7.1999999999999998E-3,9.4999999999999998E-3,3.4000000000000002E-2,3.0200000000000001E-2,2.9000000000000001E-2,9.4999999999999998E-3,null,2012,4.8999999999999998E-3,3.5999999999999999E-3,1.5E-3,1.9199999999999998E-2,2.1399999999999999E-2,4.3099999999999999E-2]
[null,2013,7.1000000000000004E-3,9.4999999999999998E-3,3.39E-2,3.0200000000000001E-2,2.9000000000000001E-2,9.4999999999999998E-3,null,2013,4.5999999999999999E-3,3.5999999999999999E-3,1.5E-3,1.9199999999999998E-2,2.1399999999999999E-2,4.3099999999999999E-2]
[null,2014,7.1000000000000004E-3,9.4999999999999998E-3,3.2000000000000001E-2,3.0200000000000001E-2,2.9000000000000001E-2,9.4999999999999998E-3,null,2014,4.5999999999999999E-3,3.5000000000000001E-3,1.5E-3,1.9199999999999998E-2,2.1399999999999999E-2,4.3099999999999999E-2]
[null,2015,7.1000000000000004E-3,9.5999999999999992E-3,3.04E-2,3.0200000000000001E-2,2.9000000000000001E-2,9.4999999999999998E-3,null,2015,4.5999999999999999E-3,3.3999999999999998E-3,1.5E-3,1.9199999999999998E-2,2.1399999999999999E-2,4.3099999999999999E-2]
[null,2016,7.1000000000000004E-3,9.5999999999999992E-3,3.1300000000000001E-2,3.0200000000000001E-2,2.9000000000000001E-2,9.4999999999999998E-3,null,2016,4.5999999999999999E-3,3.3E-3,1.5E-3,1.9199999999999998E-2,2.1399999999999999E-2,4.3099999999999999E-2]
[null,2017,7.1000000000000004E-3,9.4999999999999998E-3,3.1300000000000001E-2,3.0200000000000001E-2,2.9000000000000001E-2,9.4999999999999998E-3,null,2017,4.5999999999999999E-3,3.5000000000000001E-3,1.5E-3,1.9199999999999998E-2,2.1399999999999999E-2,4.3099999999999999E-2]
[null,2018,7.1000000000000004E-3,9.4999999999999998E-3,3.15E-2,3.0200000000000001E-2,2.9000000000000001E-2,9.4999999999999998E-3,null,2018,4.5999999999999999E-3,3.3E-3,1.5E-3,1.9199999999999998E-2,2.1399999999999999E-2,4.3099999999999999E-2]
[null,2019,6.7999999999999996E-3,9.4000000000000004E-3,3.32E-2,3.0200000000000001E-2,2.9000000000000001E-2,9.4999999999999998E-3,null,2019,4.1999999999999997E-3,3.0999999999999999E-3,2.0999999999999999E-3,1.9199999999999998E-2,2.1399999999999999E-2,4.3099999999999999E-2]
[null,2020,6.4999999999999997E-3,9.1000000000000004E-3,3.2099999999999997E-2,3.0200000000000001E-2,2.9000000000000001E-2,9.4999999999999998E-3,null,2020,3.8E-3,2.8999999999999998E-3,6.1000000000000004E-3,1.9199999999999998E-2,2.1399999999999999E-2,4.3099999999999999E-2]
[]
[null,"Source: Emissions Factors for Greenhouse Gas Inventories, U.S EPA April 2023. Note that values are held constant by EPA for certain time series/vehicle types. See https://www.epa.gov/system/files/documents/2023-03/ghg_emission_factors_hub.pdf"]
[]
["Default CH4 and N2O Emission Factors for Alternative Fuel Vehicles"]
[]
[null,"CH4 (g/mi)","Passenger Car","Light Truck (Vans, Pickup Trucks, SUVs)","Heavy-Duty Vehicle",null,"N2O (g/mi)","Passenger Car","Light-Duty Vehicle","Heavy-Duty Vehicle"]
[null,"Methanol",1.4999999999999999E-2,"NA",7.4999999999999997E-2,null,"Methanol",4.0000000000000001E-3,"NA",2.8000000000000001E-2]
[null,"CNG",0.14599999999999999,0.158,0.92100000000000004,null,"CNG",4.0000000000000001E-3,5.0000000000000001E-3,"0 "]
[null,"LNG","NA",0.158,0.92100000000000004,null,"LNG","NA",5.0000000000000001E-3,"0 "]
[null,"LPG",1.4999999999999999E-2,1.6E-2,3.0000000000000001E-3,null,"LPG",4.0000000000000001E-3,5.0000000000000001E-3,7.0000000000000001E-3]
[null,"Ethanol (E85)",1.4999999999999999E-2,1.6E-2,7.4999999999999997E-2,null,"Ethanol (E85)",4.0000000000000001E-3,5.0000000000000001E-3,2.8000000000000001E-2]
[null,"Biodiesel (B5)",0.03,2.9000000000000001E-2,8.9999999999999993E-3,null,"Biodiesel (B5)",1.9E-2,2.1000000000000001E-2,4.2999999999999997E-2,"equal to B20?"]
[null,"Biodiesel (B20)",0.03,2.9000000000000001E-2,8.9999999999999993E-3,null,"Biodiesel (B20)",1.9E-2,2.1000000000000001E-2,4.2999999999999997E-2]
[null,"Source: Emissions Factors for Greenhouse Gas Inventories, U.S EPA April 2023. "]
[]
["Non-CO2 Emission Factors for Other Vehicles"]
[null,"CH4 (g/gallon fuel)",null,null,null,null,"N2O (g/gallon fuel)"]
["Vehicle Types","Gasoline","Diesel","Residual Fuel","Jet Fuel","Aviation Gasoline","Gasoline","Diesel","Residual Fuel","Jet Fuel","Aviation Gasoline"]
["Motorcycles (1996 +)",7.0000000000000001E-3,null,null,null,null,8.3000000000000001E-3,null,null,null,null,"VMT"]
["Motorcycles (- 1995)",7.0000000000000001E-3,null,null,null,null,8.3000000000000001E-3,null,null,null,null,"VMT"]
["Agricultural Equipment",1.93,1.27,null,null,null,1.2,1.07,null,null,null,"gal"]
["Construction Equipment",2.85,1.01,null,null,null,1.47,0.94,null,null,null,"gal"]
["Utility and Recreational Equipment",2.87,0.73,null,null,null,1.5,0.66,null,null,null,"gal"]
["Aircraft",null,null,null,"0 ",7.06,null,null,null,0.3,0.11,"gal"]
["Ships and Boats",4.6100000000000003,6.41,1.1100000000000001,null,null,0.08,0.17,0.32,null,null,"gal"]
["Locomotives",null,0.8,null,null,null,null,0.26,null,null,null,"gal"]
[null,"Source: Emissions Factors for Greenhouse Gas Inventories, U.S EPA April 2023. "]
[]
[]
[]
[]
[]
["Wastewater"]
[]
["Default Factors Used to Calculate Emissions from Wastewater Treatment"]
[]
["Variable Description","Shorthand","Value",null,null,"Used in Equation…"]
["Density of Methane","p(CH4)",662,null,null,10.1,10.199999999999999]
["CH4 Destruction Efficiency","DE",0.99,null,null,10.1,10.199999999999999]
["Default biogas production","Digester Gas",1]
["Fraction of CH4 in Biogas (default)","F CH4 default",0.65,null,null,null,10.199999999999999]
["Maximum CH4 Production Capacity","Bo",0.6,null,null,null,null,10.3,10.4,10.5,10.6]
["Anaerobic CH4 Correction Factor","MCF anaerobic",0.8,null,null,null,null,10.3,10.4]
["Industrial Discharge Factor","F ind",1.25,null,null,null,null,null,10.4,null,null,10.7,10.8,null,10.1]
["Default fraction BOD5 removed in primary treatment","F p",0.32500000000000001,null,null,null,null,null,10.4]
["Septic CH4 Correction Factor","MCF septic",0.5,null,null,null,null,null,null,10.5,10.6]
["Default BOD5 Load","BOD5 load",0.09,null,null,null,null,null,null,null,10.6,null,null,null,10.1]
["Emissions Factor, Nitrification/Denitrification","EF nit/denit",7,null,null,null,null,null,null,null,null,10.7]
["Emissions Factor, no Nitrification/Denitrification","EF no nit/denit",3.2,null,null,null,null,null,null,null,null,null,10.8]
["Emissions Factor, Effluent","EF effluent",5.0000000000000001E-3,null,null,null,null,null,null,null,null,null,null,10.9,10.1]
["Molecular Weight Ratio of N2O to N2","N2O/N2",{"$f":"44/28","v":1.5714285714285714},null,null,null,null,null,null,null,null,null,null,10.9,10.1]
["Total N Load","N Load",2.5999999999999999E-2,null,null,null,null,null,null,null,null,null,null,null,10.1]
["Nitrogen uptake in aerobic system","N uptake aerobic",0.05,null,null,null,null,null,null,null,null,null,null,null,10.1]
["Nitrogen uptake in anaerobic systems","N uptake anaerobic",5.0000000000000001E-3,null,null,null,null,null,null,null,null,null,null,null,10.1]
["Fraction of nitrogen removed with nitrification/denitrification","Nit/denit default",0.7,null,null,null,null,null,null,null,null,null,null,null,10.1]
["Fraction of nitrogen removed without nit/denit","No Nit/denit default",0,null,null,null,null,null,null,null,null,null,null,null,10.1]
[]
["Source: CARB (California Air Resources Board). 2010. Local Government Operations Protocol, Version 1.1. California Air Resources Board, California Climate Action Registry, ICLEI – Local Governments for Sustainability, and The Climate Registry."]
[]
["Employee Commute"]
[]
["Employee Commute Factors - For simplicity, assumes all modes use gasoline, and all alternative transportation options have effective emissions of zero."]
[null,null,null,null,null,null,"Old Table Rows"]
["Mode","Average mpg","people/mode","kg CO2/gal",null,null,"Mode","Average mpg","people/mode","kg CO2/gal"]
["Single Occupancy Vehicle",21.6,1,8.7799999999999994,null,null,"Single Occupancy Vehicle",20.5,1,8.7799999999999994]
["Carpool",21.6,{"$f":"K318","v":2.4160314135984864},8.7799999999999994,null,null,"Carpool",20.5,2.4980000000000002,8.7799999999999994]
["Motorcycle",43.4,1,8.7799999999999994,null,null,"Motorcycle",56.5,1,8.7799999999999994]
["Transit",null,null,0,null,null,"carpool calculation",null,null,null,"Weighted Average"]
["Bike",null,null,0,null,null,"      In 2-person carpool",null,null,10382478,{"$f":"((2*J318)+(3*J319)+(4*J320)+(5.5*J321)+(7*J322))/J323","v":2.4160314135984864}]
["Walk",null,null,0,null,null,"      In 3-person carpool",null,null,1759044]
["Work at home",null,null,0,null,null,"      In 4-person carpool",null,null,641090]
["Other",null,null,0,null,null,"      In 5- or 6-person carpool",null,null,330934]
[null,null,null,null,null,null,"      In 7-or-more-person carpool",null,null,274032]
["Sources:",null,null,null,null,null,"Total",null,null,{"$f":"SUM(J318:J322)","v":13387578}]
["Average Fuel Efficiency of each Mode: FHWA (Federal Highway Administration). 2012. Highway Statistics 2010. Federal Highway Administration, U.S. Department of Transportation. "]
["Average Number of Carpoolers: U.S. Census Bureau. 2008. American Community Survey: Table S0801 – Commuting Characteristics by Sex, San Bernardino County, California. U.S. Census Bureau. "]
["CO2 per Gallon of Gasoline: CARB (California Air Resources Board). 2010. Local Government Operations Protocol, Version 1.1. California Air Resources Board, California Climate Action Registry, ICLEI, and The Climate Registry."]
[]
["Water"]
[]
["Electricity Use in Southern California Water Systems- Average used to develop calculations in the Water worksheet"]
["Table C‐4: Potential Adjustments to WER Table 1‐3, Electricity Use in Typical Urban Water Systems (CEC 2006)"]
["Southern California (kWh/MG) ",null,"kWh/MG"]
[null,"Adjusted","w/ Losses"]
["SWP west branch",7900,9231.5353195579046]
["SWP east branch",9900,11568.632868813071]
["MWD west branch",906,1013.4051898125902]
["MWD east branch",540,604.01633829889477]
[]
["Source: CEC (California Energy Commission). 2006. Refining Estimates of Water-Related Energy Use in California. California Energy Commission. CEC-500-2006-118."]
[]
["eGRID Electricity Emission Factors"]
[{"$f":"'Control Sheet'!D44","v":"AKGD eGRID subregion"},"(lb/MWh)"]
["Gas",2000,2001,2002,2003,2004,2005,2006,2007,2008,2009,2010,2011,2012,2013,2014,2015,2016,2017,2018,2019,2020,2021,2022,2023,2024,2025]
["CO2",{"$f":"IFERROR(VLOOKUP('Control Sheet'!$D$44, elec_factors_CO2, B$343-1997, FALSE),\"\")","v":1257.19},{"$f":"IFERROR(VLOOKUP('Control Sheet'!$D$44, elec_factors_CO2, C$343-1997, FALSE),\"\")","v":1257.19},{"$f":"IFERROR(VLOOKUP('Control Sheet'!$D$44, elec_factors_CO2, D$343-1997, FALSE),\"\")","v":1257.19},{"$f":"IFERROR(VLOOKUP('Control Sheet'!$D$44, elec_factors_CO2, E$343-1997, FALSE),\"\")","v":1257.19},{"$f":"IFERROR(VLOOKUP('Control Sheet'!$D$44, elec_factors_CO2, F$343-1997, FALSE),\"\")","v":1257.19},{"$f":"IFERROR(VLOOKUP('Control Sheet'!$D$44, elec_factors_CO2, G$343-1997, FALSE),\"\")","v":1232.3599999999999},{"$f":"IFERROR(VLOOKUP('Control Sheet'!$D$44, elec_factors_CO2, H$343-1997, FALSE),\"\")","v":1258.54},{"$f":"IFERROR(VLOOKUP('Control Sheet'!$D$44, elec_factors_CO2, I$343-1997, FALSE),\"\")","v":1284.72},{"$f":"IFERROR(VLOOKUP('Control Sheet'!$D$44, elec_factors_CO2, J$343-1997, FALSE),\"\")","v":1282.7891},{"$f":"IFERROR(VLOOKUP('Control Sheet'!$D$44, elec_factors_CO2, K$343-1997, FALSE),\"\")","v":1280.8581999999999},{"$f":"IFERROR(VLOOKUP('Control Sheet'!$D$44, elec_factors_CO2, L$343-1997, FALSE),\"\")","v":1256.8658},{"$f":"IFERROR(VLOOKUP('Control Sheet'!$D$44, elec_factors_CO2, M$343-1997, FALSE),\"\")","v":1262.7985973501968},{"$f":"IFERROR(VLOOKUP('Control Sheet'!$D$44, elec_factors_CO2, N$343-1997, FALSE),\"\")","v":1268.7313947003938},{"$f":"IFERROR(VLOOKUP('Control Sheet'!$D$44, elec_factors_CO2, O$343-1997, FALSE),\"\")","v":1097.6341973501969},{"$f":"IFERROR(VLOOKUP('Control Sheet'!$D$44, elec_factors_CO2, P$343-1997, FALSE),\"\")","v":926.53700000000003},{"$f":"IFERROR(VLOOKUP('Control Sheet'!$D$44, elec_factors_CO2, Q$343-1997, FALSE),\"\")","v":999.4085},{"$f":"IFERROR(VLOOKUP('Control Sheet'!$D$44, elec_factors_CO2, R$343-1997, FALSE),\"\")","v":1072.28},{"$f":"IFERROR(VLOOKUP('Control Sheet'!$D$44, elec_factors_CO2, S$343-1997, FALSE),\"\")","v":1055.9575},{"$f":"IFERROR(VLOOKUP('Control Sheet'!$D$44, elec_factors_CO2, T$343-1997, FALSE),\"\")","v":1039.635},{"$f":"IFERROR(VLOOKUP('Control Sheet'!$D$44, elec_factors_CO2, U$343-1997, FALSE),\"\")","v":1114.4000000000001},{"$f":"IFERROR(VLOOKUP('Control Sheet'!$D$44, elec_factors_CO2, V$343-1997, FALSE),\"\")","v":1097.6300000000001},{"$f":"IFERROR(VLOOKUP('Control Sheet'!$D$44, elec_factors_CO2, W$343-1997, FALSE),\"\")","v":1067.68},{"$f":"IFERROR(VLOOKUP('Control Sheet'!$D$44, elec_factors_CO2, X$343-1997, FALSE),\"\")","v":1067.68},{"$f":"IFERROR(VLOOKUP('Control Sheet'!$D$44, elec_factors_CO2, Y$343-1997, FALSE),\"\")","v":1067.68},{"$f":"IFERROR(VLOOKUP('Control Sheet'!$D$44, elec_factors_CO2, Z$343-1997, FALSE),\"\")","v":1067.68},{"$f":"IFERROR(VLOOKUP('Control Sheet'!$D$44, elec_factors_CO2, AA$343-1997, FALSE),\"\")","v":1067.68}]
["CH4",{"$f":"IFERROR(VLOOKUP('Control Sheet'!$D$44, elec_factors_CH4, B$343-1997, FALSE),\"\")","v":2.6599999999999999E-2},{"$f":"IFERROR(VLOOKUP('Control Sheet'!$D$44, elec_factors_CH4, C$343-1997, FALSE),\"\")","v":2.6599999999999999E-2},{"$f":"IFERROR(VLOOKUP('Control Sheet'!$D$44, elec_factors_CH4, D$343-1997, FALSE),\"\")","v":2.6599999999999999E-2},{"$f":"IFERROR(VLOOKUP('Control Sheet'!$D$44, elec_factors_CH4, E$343-1997, FALSE),\"\")","v":2.6599999999999999E-2},{"$f":"IFERROR(VLOOKUP('Control Sheet'!$D$44, elec_factors_CH4, F$343-1997, FALSE),\"\")","v":2.6599999999999999E-2},{"$f":"IFERROR(VLOOKUP('Control Sheet'!$D$44, elec_factors_CH4, G$343-1997, FALSE),\"\")","v":2.5600000000000001E-2},{"$f":"IFERROR(VLOOKUP('Control Sheet'!$D$44, elec_factors_CH4, H$343-1997, FALSE),\"\")","v":2.6355E-2},{"$f":"IFERROR(VLOOKUP('Control Sheet'!$D$44, elec_factors_CH4, I$343-1997, FALSE),\"\")","v":2.7109999999999999E-2},{"$f":"IFERROR(VLOOKUP('Control Sheet'!$D$44, elec_factors_CH4, J$343-1997, FALSE),\"\")","v":2.7423499999999996E-2},{"$f":"IFERROR(VLOOKUP('Control Sheet'!$D$44, elec_factors_CH4, K$343-1997, FALSE),\"\")","v":2.7736999999999998E-2},{"$f":"IFERROR(VLOOKUP('Control Sheet'!$D$44, elec_factors_CH4, L$343-1997, FALSE),\"\")","v":2.6075600000000001E-2},{"$f":"IFERROR(VLOOKUP('Control Sheet'!$D$44, elec_factors_CH4, M$343-1997, FALSE),\"\")","v":2.6205402220091798E-2},{"$f":"IFERROR(VLOOKUP('Control Sheet'!$D$44, elec_factors_CH4, N$343-1997, FALSE),\"\")","v":2.6335204440183595E-2},{"$f":"IFERROR(VLOOKUP('Control Sheet'!$D$44, elec_factors_CH4, O$343-1997, FALSE),\"\")","v":3.6482102220091794E-2},{"$f":"IFERROR(VLOOKUP('Control Sheet'!$D$44, elec_factors_CH4, P$343-1997, FALSE),\"\")","v":4.6628999999999997E-2},{"$f":"IFERROR(VLOOKUP('Control Sheet'!$D$44, elec_factors_CH4, Q$343-1997, FALSE),\"\")","v":6.1814499999999994E-2},{"$f":"IFERROR(VLOOKUP('Control Sheet'!$D$44, elec_factors_CH4, R$343-1997, FALSE),\"\")","v":7.6999999999999999E-2},{"$f":"IFERROR(VLOOKUP('Control Sheet'!$D$44, elec_factors_CH4, S$343-1997, FALSE),\"\")","v":7.9500000000000001E-2},{"$f":"IFERROR(VLOOKUP('Control Sheet'!$D$44, elec_factors_CH4, T$343-1997, FALSE),\"\")","v":8.2000000000000003E-2},{"$f":"IFERROR(VLOOKUP('Control Sheet'!$D$44, elec_factors_CH4, U$343-1997, FALSE),\"\")","v":9.8000000000000004E-2},{"$f":"IFERROR(VLOOKUP('Control Sheet'!$D$44, elec_factors_CH4, V$343-1997, FALSE),\"\")","v":0.1},{"$f":"IFERROR(VLOOKUP('Control Sheet'!$D$44, elec_factors_CH4, W$343-1997, FALSE),\"\")","v":9.0999999999999998E-2},{"$f":"IFERROR(VLOOKUP('Control Sheet'!$D$44, elec_factors_CH4, X$343-1997, FALSE),\"\")","v":9.0999999999999998E-2},{"$f":"IFERROR(VLOOKUP('Control Sheet'!$D$44, elec_factors_CH4, Y$343-1997, FALSE),\"\")","v":9.0999999999999998E-2},{"$f":"IFERROR(VLOOKUP('Control Sheet'!$D$44, elec_factors_CH4, Z$343-1997, FALSE),\"\")","v":9.0999999999999998E-2},{"$f":"IFERROR(VLOOKUP('Control Sheet'!$D$44, elec_factors_CH4, AA$343-1997, FALSE),\"\")","v":9.0999999999999998E-2}]
["N2O",{"$f":"IFERROR(VLOOKUP('Control Sheet'!$D$44, elec_factors_N2O, B$343-1997, FALSE),\"\")","v":6.4000000000000003E-3},{"$f":"IFERROR(VLOOKUP('Control Sheet'!$D$44, elec_factors_N2O, C$343-1997, FALSE),\"\")","v":6.4000000000000003E-3},{"$f":"IFERROR(VLOOKUP('Control Sheet'!$D$44, elec_factors_N2O, D$343-1997, FALSE),\"\")","v":6.4000000000000003E-3},{"$f":"IFERROR(VLOOKUP('Control Sheet'!$D$44, elec_factors_N2O, E$343-1997, FALSE),\"\")","v":6.4000000000000003E-3},{"$f":"IFERROR(VLOOKUP('Control Sheet'!$D$44, elec_factors_N2O, F$343-1997, FALSE),\"\")","v":6.4000000000000003E-3},{"$f":"IFERROR(VLOOKUP('Control Sheet'!$D$44, elec_factors_N2O, G$343-1997, FALSE),\"\")","v":6.5100000000000002E-3},{"$f":"IFERROR(VLOOKUP('Control Sheet'!$D$44, elec_factors_N2O, H$343-1997, FALSE),\"\")","v":6.9750000000000003E-3},{"$f":"IFERROR(VLOOKUP('Control Sheet'!$D$44, elec_factors_N2O, I$343-1997, FALSE),\"\")","v":7.4400000000000004E-3},{"$f":"IFERROR(VLOOKUP('Control Sheet'!$D$44, elec_factors_N2O, J$343-1997, FALSE),\"\")","v":7.5638500000000004E-3},{"$f":"IFERROR(VLOOKUP('Control Sheet'!$D$44, elec_factors_N2O, K$343-1997, FALSE),\"\")","v":7.6877000000000004E-3},{"$f":"IFERROR(VLOOKUP('Control Sheet'!$D$44, elec_factors_N2O, L$343-1997, FALSE),\"\")","v":7.1792000000000002E-3},{"$f":"IFERROR(VLOOKUP('Control Sheet'!$D$44, elec_factors_N2O, M$343-1997, FALSE),\"\")","v":7.3869822439804837E-3},{"$f":"IFERROR(VLOOKUP('Control Sheet'!$D$44, elec_factors_N2O, N$343-1997, FALSE),\"\")","v":7.594764487960968E-3},{"$f":"IFERROR(VLOOKUP('Control Sheet'!$D$44, elec_factors_N2O, O$343-1997, FALSE),\"\")","v":7.3778822439804839E-3},{"$f":"IFERROR(VLOOKUP('Control Sheet'!$D$44, elec_factors_N2O, P$343-1997, FALSE),\"\")","v":7.1609999999999998E-3},{"$f":"IFERROR(VLOOKUP('Control Sheet'!$D$44, elec_factors_N2O, Q$343-1997, FALSE),\"\")","v":9.0805E-3},{"$f":"IFERROR(VLOOKUP('Control Sheet'!$D$44, elec_factors_N2O, R$343-1997, FALSE),\"\")","v":1.0999999999999999E-2},{"$f":"IFERROR(VLOOKUP('Control Sheet'!$D$44, elec_factors_N2O, S$343-1997, FALSE),\"\")","v":1.0999999999999999E-2},{"$f":"IFERROR(VLOOKUP('Control Sheet'!$D$44, elec_factors_N2O, T$343-1997, FALSE),\"\")","v":1.0999999999999999E-2},{"$f":"IFERROR(VLOOKUP('Control Sheet'!$D$44, elec_factors_N2O, U$343-1997, FALSE),\"\")","v":1.2999999999999999E-2},{"$f":"IFERROR(VLOOKUP('Control Sheet'!$D$44, elec_factors_N2O, V$343-1997, FALSE),\"\")","v":1.4E-2},{"$f":"IFERROR(VLOOKUP('Control Sheet'!$D$44, elec_factors_N2O, W$343-1997, FALSE),\"\")","v":1.2E-2},{"$f":"IFERROR(VLOOKUP('Control Sheet'!$D$44, elec_factors_N2O, X$343-1997, FALSE),\"\")","v":1.2E-2},{"$f":"IFERROR(VLOOKUP('Control Sheet'!$D$44, elec_factors_N2O, Y$343-1997, FALSE),\"\")","v":1.2E-2},{"$f":"IFERROR(VLOOKUP('Control Sheet'!$D$44, elec_factors_N2O, Z$343-1997, FALSE),\"\")","v":1.2E-2},{"$f":"IFERROR(VLOOKUP('Control Sheet'!$D$44, elec_factors_N2O, AA$343-1997, FALSE),\"\")","v":1.2E-2}]
[]
["Source: Emissions & Generation Resource Integrated Database (eGRID). https://www.epa.gov/energy/emissions-generation-resource-integrated-database-egrid. "]
[]
["Land Use Factors"]
[]
["Emission Factors For N2O"]
["Fertilizer Type","Percent N Content","Percent N lost to Volatilization","Percent N Leach and Runoff","Percent from Applied N","Percent from Volatized N","Percent from Leached and Runoff N"]
[]
["Synthetic",1,0.1,0.3,1.2500000000000001E-2,0.01,2.5000000000000001E-2]
["Organic",3.6999999999999998E-2,0.2,0.3,1.2500000000000001E-2,0.01,2.5000000000000001E-2]
["Manure",5.0000000000000001E-3,0.2,0.3,1.2500000000000001E-2,0.01,2.5000000000000001E-2]
["Sources: Unless otherwise noted, all fertilizer emission factors are IPCC default values from the Revised 1996 Guidelines for National GHG Inventories."]
["Fertilizer Emissions = ","((Fertilizer Consumption in the Park)*(Percent N Content)*(1-Percent N lost to Volatilization)*(Percent from Applied N)+(Fertilizer Consumption in the Park)*(Percent N Content)*(Percent N lost to Volatilization)*(Percent from Volatized N)+(Fertilizer Consumption in the Park)*(Percent N content)*(1-Percent N lost to Volatilization)*(Percent N Leach and Runoff)*(Percent from Leached and Runoff))"]
[]
[null,"N2O/N2O-N",{"$f":"44/28","v":1.5714285714285714}]
[]
["Carbon Sequestration Factor",2.23,"(metric ton C/hectare/year)"]
["Source: EPA State Inventory Tools, Land-Use Land Use Change and Forestry module."]

{"sheet":"Background Controls","index":33,"n_rows":78,"n_cols":21,"rows_kept":78,"cut":false,"hidden":false,"merged":[]}
["Background Controls"]
[null,null,null,null,null,null,null,null,"Lists"]
[null,null,null,null,null,null,null,null,4]
["Tool Name","Community Greenhouse Gas Inventory Tool",null,null,null,null,null,null,"Sector","Landfills",null,null,null,"Stationary Fuels","Facility Types","Water Importers","Comprehensive/Partial","Yes/No","Scope",null,"Emission Factors Choice"]
[null,null,null,null,null,null,null,null,{"$f":"'Control Sheet'!D16","v":"Residential"},{"$f":"'Solid Waste-Control'!C28","v":"Saipan"},null,null,null,"Natural Gas","Residential: Single Family Units","SWP west branch","Comprehensive","Yes",1,null,true]
[null,null,null,null,null,null,null,null,{"$f":"'Control Sheet'!D17","v":"Commercial/Institutional"},{"$f":"'Solid Waste-Control'!C29","v":"Tinian"},null,null,null,"Digester Gas","Residential: Apartment Buildings","SWP east branch","Partial","No",2,null,true]
[null,null,null,null,null,null,null,null,{"$f":"'Control Sheet'!D18","v":"Industrial"},{"$f":"'Solid Waste-Control'!C30","v":"Rota"},null,null,null,"Diesel","Residential: Mobile Homes","MWD west branch","N/A",null,3,null,true]
[null,null,null,null,null,null,null,null,{"$f":"'Control Sheet'!D19","v":"Energy Generation"},{"$f":"'Solid Waste-Control'!C31","v":0},null,null,null,"LPG","Commercial/Institutional: Education","MWD east branch",null,null,null,null,true]
[null,null,null,null,null,null,null,null,{"$f":"'Control Sheet'!D20","v":0},{"$f":"'Solid Waste-Control'!C32","v":0},null,null,null,"Gasoline","Commercial/Institutional: Food Sales",null,null,null,null,null,true]
[null,null,null,null,null,null,null,null,{"$f":"'Control Sheet'!D21","v":0},{"$f":"'Solid Waste-Control'!C33","v":0},null,null,null,"Residual Fuel Oil No. 5","Commercial/Institutional: Food Service"]
["Mobile Entry Row",{"$f":"ROW(MobCurrentID)+2+COUNTIF('Mobile-Data'!A9:A65531,\">0\")","v":31},null,null,null,null,null,null,{"$f":"'Control Sheet'!D22","v":0},{"$f":"'Solid Waste-Control'!C34","v":0},null,null,null,"Residual Fuel Oil No. 6","Commercial/Institutional: Health Care"]
["Mobile Min Vehicle",{"$f":"IF(OFFSET(MobCurrentID,2,0)=0,0,ROW(OFFSET(MobCurrentID,2,0)))","v":9},null,null,null,null,null,null,{"$f":"'Control Sheet'!D23","v":0},{"$f":"'Solid Waste-Control'!C35","v":0},null,null,null,"Propane","Commercial/Institutional: Lodging"]
["Mobile Max Vehicle",{"$f":"mob_EntryRow-1","v":30},null,null,null,null,null,null,{"$f":"'Control Sheet'!D24","v":0},{"$f":"'Solid Waste-Control'!C36","v":0},null,null,null,"Butane","Commercial/Institutional: Mercantile"]
[null,null,null,null,null,null,null,null,{"$f":"'Control Sheet'!D25","v":0},{"$f":"'Solid Waste-Control'!C37","v":0},null,null,null,"Jet Fuel","Commercial/Institutional: Office"]
["Electricity Entry Row",{"$f":"ROW(elec_CurrentID)+2+COUNTIF('Electricity-Data'!A9:A65520,\">0\")","v":9},null,null,null,null,null,null,{"$f":"'Control Sheet'!D26","v":0},null,null,null,null,"Residential Coal","Commercial/Institutional: Public Assembly"]
["Electricity Min Unit",{"$f":"IF(OFFSET(elec_CurrentID,2,0)=0,0,ROW(OFFSET(elec_CurrentID,2,0)))","v":0},null,null,null,null,null,null,{"$f":"'Control Sheet'!D27","v":0},null,null,null,null,"Commercial Coal","Commercial/Institutional: Public Order and Safety"]
["Electricity Max Unit",{"$f":"elec_EntryRow-1","v":8},null,null,null,null,null,null,{"$f":"'Control Sheet'!D28","v":0},null,null,null,null,"Industrial Coal","Commercial/Institutional: Religious Worship",null,null,null,null,null,{"$f":"COUNTIF(U5:U16,TRUE)","v":5}]
["Electricity Lookup Column",{"$f":"MyYear-1998","v":24},null,null,null,null,null,null,{"$f":"'Control Sheet'!D29","v":0},null,null,null,null,"Electric Power Coal","Commercial/Institutional: Service"]
[null,null,null,null,null,null,null,null,{"$f":"'Control Sheet'!D30","v":0},null,null,null,null,"Distillate Fuel Oil","Commercial/Institutional: Warehouse and Storage"]
["Stationary Entry Row",{"$f":"ROW(stat_CurrentID)+2+COUNTIF('Stationary-Data'!A9:A65519,\">0\")","v":16},null,null,null,null,null,null,{"$f":"'Control Sheet'!D31","v":0},null,null,null,null,"Kerosene","Commercial/Institutional: Other"]
["Stationary Min Unit",{"$f":"IF(OFFSET(stat_CurrentID,2,0)=0,0,ROW(OFFSET(stat_CurrentID,2,0)))","v":9},null,null,null,null,null,null,{"$f":"'Control Sheet'!D32","v":0},null,null,null,null,null,"Commercial/Institutional: Vacant"]
["Stationary Max Unit",{"$f":"stat_EntryRow-1","v":15},null,null,null,null,null,null,{"$f":"'Control Sheet'!D33","v":0},null,null,null,null,null,"Industrial: Food"]
[null,null,null,null,null,null,null,null,{"$f":"'Control Sheet'!D34","v":0},null,null,null,null,null,"Industrial: Beverage and Tobacco Products"]
[null,null,null,null,null,null,null,null,{"$f":"'Control Sheet'!D35","v":0},null,null,null,null,null,"Industrial: Textile Mills"]
[null,"Fuels",null,null,null,null,null,null,null,null,null,null,null,null,"Industrial: Textile Product Mills"]
["Vehicle Types","Gasoline","Diesel","Biodiesel (B5)","Biodiesel (B20)","Ethanol (E85)","CNG","LNG","LPG","Residual Fuel","Jet Fuel","Aviation Gasoline",null,null,"Industrial: Apparel"]
["Units","Gallons","Gallons","Gallons","Gallons","Gallons","G.G.E.","Gallons","Gallons","Gallons","Gallons","Gallons",null,null,"Industrial: Leather and Allied Products"]
[{"$f":"mob_entry_vehtype","v":"Ship or Boat"},{"$f":"VLOOKUP($A$28,$A$29:$L$38,MATCH(B$26,$A$26:$L$26,0),FALSE)","v":1},{"$f":"VLOOKUP($A$28,$A$29:$L$38,MATCH(C$26,$A$26:$L$26,0),FALSE)","v":1},0,0,0,0,0,0,1,0,0,null,null,"Industrial: Wood Products"]
["Passenger Car",1,1,1,1,1,1,null,1,null,null,null,null,null,"Industrial: Paper"]
["Light Truck (Vans, Pickup Trucks, SUVs)",1,1,1,1,1,1,null,1,null,null,null,null,null,"Industrial: Printing and Related Support"]
["Heavy-Duty Vehicle",1,1,1,1,1,1,1,1,null,null,null,null,null,"Industrial: Petroleum and Coal Products"]
["Motorcycle",1,null,null,null,null,null,null,null,null,null,null,null,null,"Industrial: Chemicals"]
["Agricultural Equipment",1,1,null,null,null,null,null,null,null,null,null,null,null,"Industrial: Plastics and Rubber Products"]
["Construction Equipment",1,1,null,null,null,null,null,null,null,null,null,null,null,"Industrial: Nonmetallic Mineral Products"]
["Utility and Recreational Equipment",1,1,null,null,null,null,null,null,null,null,null,null,null,"Industrial: Primary Metals"]
["Aircraft",null,null,null,null,null,null,null,null,null,1,1,null,null,"Industrial: Fabricated Metal Products"]
["Ship or Boat",1,1,null,null,null,null,null,null,1,null,null,null,null,"Industrial: Machinery"]
["Locomotive",null,1,null,null,null,null,null,null,null,null,null,null,null,"Industrial: Computer and Electronic Products"]
[null,null,null,null,null,null,null,null,null,null,null,null,null,null,"Industrial: Electrical Equip., Appliances, and Components"]
[null,null,null,null,null,null,null,null,null,null,null,null,null,null,"Industrial: Transportation Equipment"]
[null,null,null,null,null,null,null,null,null,null,null,null,null,null,"Industrial: Furniture and Related Products"]
[null,"Available Fuels",{"$f":"SUM(B28:L28)","v":3},null,null,null,null,null,null,null,null,null,null,null,"Industrial: Miscellaneous"]
[1,{"$f":"EligibleItem($C$42,A43,$B$28:$L$28,$B$26:$L$26)","v":"Gasoline"},null,null,null,null,null,null,null,null,null,null,null,null,"Energy Generation: Electricity Generators"]
[2,{"$f":"EligibleItem($C$42,A44,$B$28:$L$28,$B$26:$L$26)","v":"Diesel"}]
[3,"Residual Fuel"]
[4,0]
[5,0]
[6,0]
[7,0]
[8,0]
[9,0]
[10,0]
[11,0]
[]
[]
[]
[]
["List of Utilities",{"$f":"'Control Sheet'!D46","v":0},{"$f":"'Control Sheet'!D47","v":0},{"$f":"'Control Sheet'!D48","v":0},{"$f":"'Control Sheet'!D49","v":0},{"$f":"'Control Sheet'!D50","v":0}]
[null,{"$f":"IF('Control Sheet'!B46=TRUE,1,0)","v":1},{"$f":"IF('Control Sheet'!B47=TRUE,1,0)","v":0},{"$f":"IF('Control Sheet'!B48=TRUE,1,0)","v":0},{"$f":"IF('Control Sheet'!B49=TRUE,1,0)","v":0},{"$f":"IF('Control Sheet'!B50=TRUE,1,0)","v":0}]
[]
[null,"Selected Utilities",{"$f":"SUM(B59:F59)","v":1}]
[null,{"$f":"'Control Sheet'!D44","v":"AKGD eGRID subregion"}]
[1,{"$f":"EligibleItem($C$61,A63,$B$59:$F$59,$B$58:$F$58)","v":0}]
[2,0]
[3,0]
[4,0]
[5,0]
[6,0]
[]
[]
["List of Contractual Instruments",null,"Contract Entry Row",73]
[null,"Contractual Instrument Descriptions"]
[1,{"$f":"IFERROR(IF(ISBLANK(D73),\"\",D73),\"\")","v":""},null,{"$f":"_xlfn.UNIQUE(_xlfn._xlws.FILTER(contractual_instrument_entries,contractual_instrument_entries<>0))","v":{"$error":"#VALUE!"}}]
[2,""]
[3,""]
[4,""]
[5,""]
[6,""]

{"sheet":"Help","index":34,"n_rows":1,"n_cols":1,"rows_kept":1,"cut":false,"hidden":true,"merged":[]}
["Help"]

{"sheet":"Commercial End Use Study","index":35,"n_rows":176,"n_cols":12,"rows_kept":176,"cut":false,"hidden":true,"merged":[[136,1,136,9]]}
[]
["M1"]
["RPS",0.33,"RE by 2030"]
["Lighting EE",0.25,"reduction in lighting by 2018 (indoor and outdoor)"]
["Title 24",7.0000000000000007E-2,"increase in standards every 3 years (2008, 2011, 2014, 2017, 2020)"]
["M2"]
["LEED Silver",0.14000000000000001,"decrease in energy use"]
["Retrocommissioning",0.15,"decrease in energy use"]
["CHP",0.3,"emission reductions in 20% of buildings"]
["Office Equipment Procurement Standard",0.5,"electricity savings from office equipment"]
[]
[]
["Electricity Summary - All Commercial Buildings"]
[null,"End Use","End Use Floor Stock (kSqFt)","Energy Use Indicse (kWh/EUFS/yr)","End-use Floor Stock Distribution (%)","Energy Intensity (kWh/Segment FS/yr)","End-use energy distribution","Non-coincident peak load (watts/SF)","Connected load (watts/SF)","Annual Energy Usage (GWh)"]
[null,null,null,"(a)","(b)","(a*b)"]
[null,"Heating",2037405,0.53,41.4,0.22,1.6,0.15,"417.06 SF/kB",1087]
[null,"Cooling",3374531,2.97,68.599999999999994,2.04,14.9,1.18,"519.44 SF/ton",10017]
[null,"Ventilation",3697217,2.16,75.099999999999994,1.63,11.9,0.32,0.57999999999999996,8000]
[null,"Water Heating",2247021,0.27,45.7,0.12,0.9,0.03,0.21,611]
[null,"Cooking",4501298,0.62,91.5,0.56999999999999995,4.2,0.12,0.8,2805]
[null,"Refrigeration",4643497,1.94,94.4,1.83,13.4,0.26,2.4900000000000002,9014]
[null,"Exterior Lighing",4407150,0.89,89.6,0.8,5.8,0.2,0.26,3916]
[null,"Interior Lighting",4915027,3.92,99.9,3.92,28.7,0.78,1.06,19265]
[null,"Office Equipment",4839543,0.99,98.4,0.97,7.1,0.19,0.79,4782]
[null,"Miscellaneous",4491364,0.87,91.3,0.8,5.8,0.15,1.45,3924]
[null,"Process",106818,1.91,2.2000000000000002,0.04,0.3,0.01,0.03,204]
[null,"Motors",2839736,0.99,57.7,0.56999999999999995,4.2,0.12,0.67,2811]
[null,"Air Compressor",1801858,0.36,36.6,0.13,1,0.03,0.14000000000000001,642]
[null,"Segment Total",4920114,"--","--",13.63,100,3.06,"--",67077]
[]
["Electricity Summary - All Office Buildings"]
[null,"End Use","End Use Floor Stock (kSqFt)","Energy Use Indicse (kWh/EUFS/yr)","End-use Floor Stock Distribution (%)","Energy Intensity (kWh/Segment FS/yr)","End-use energy distribution","Non-coincident peak load (watts/SF)","Connected load (watts/SF)","Annual Energy Usage (GWh)"]
[null,"Heating",673586,0.57999999999999996,65.900000000000006,0.38,2.4E-2,0.26,"306.39 SF/kB",393,null,{"$f":"G33/100","v":2.4000000000000001E-4}]
[null,"Cooling",934468,3.53,91.4,3.23,0.20100000000000001,1.88,"353.84 SF/ton",3301,null,{"$f":"G34/100","v":2.0100000000000001E-3}]
[null,"Ventilation",954018,2.61,93.3,2.4300000000000002,0.151,0.51,0.91,2485,null,1.5100000000000001E-3]
[null,"Water Heating",557554,0.31,54.6,0.17,0.01,0.03,0.28999999999999998,170,null,1E-4]
[null,"Cooking",984018,0.12,96.3,0.11,6.9999999999999993E-3,0.04,0.48,115,null,6.9999999999999994E-5]
[null,"Refrigeration",988050,0.48,96.7,0.47,2.8999999999999998E-2,0.06,0.3,476,null,2.9E-4]
[null,"Exterior Lighing",900749,0.74,88.1,0.65,4.0999999999999995E-2,0.15,0.16,666,null,4.0999999999999994E-4]
[null,"Interior Lighting",1022012,4.24,100,4.24,0.26400000000000001,0.95,1.1299999999999999,4331,null,2.64E-3]
[null,"Office Equipment",1019878,3.1,99.8,3.09,0.192,0.56999999999999995,1.9,3157,null,1.92E-3]
[null,"Miscellaneous",879031,0.76,86,0.65,4.0999999999999995E-2,0.14000000000000001,0.85,666,null,4.0999999999999994E-4]
[null,"Process",12789,1.5,1.3,0.02,1E-3,0,0.01,19,null,1.0000000000000001E-5]
[null,"Motors",671022,0.82,65.7,0.54,3.4000000000000002E-2,0.14000000000000001,0.59,553,null,3.4000000000000002E-4]
[null,"Air Compressor",463945,0.21,45.4,0.09,6.0000000000000001E-3,0.02,0.08,95,null,6.0000000000000002E-5]
[null,"Segment Total",1022012,"--","--",16.079999999999998,100,4.2300000000000004,"--",16430]
[]
["Electricity Summary - Large Office Buildings"]
[null,"End Use","End Use Floor Stock (kSqFt)","Energy Use Indicse (kWh/EUFS/yr)","End-use Floor Stock Distribution (%)","Energy Intensity (kWh/Segment FS/yr)","End-use energy distribution","Non-coincident peak load (watts/SF)","Connected load (watts/SF)","Annual Energy Usage (GWh)"]
[null,"Heating",509049,0.63,77.099999999999994,0.49,2.8,0.18,"618.46 SF/kB",322]
[null,"Cooling",608796,3.87,92.2,3.57,20.2,1.67,"360.25 SF/ton",2358]
[null,"Ventilation",623559,3.24,94.4,3.06,17.3,0.59,1.1000000000000001,2019]
[null,"Water Heating",339024,0.24,51.3,0.12,0.7,0.02,0.17,80]
[null,"Cooking",647306,0.12,98,0.12,0.7,0.04,0.37,77]
[null,"Refrigeration",648945,0.41,98.3,0.41,2.2999999999999998,0.05,0.24,268]
[null,"Exterior Lighing",634106,0.51,96,0.49,2.8,0.11,0.11,324]
[null,"Interior Lighting",660429,4.46,100,4.46,25.2,0.87,0.99,2945]
[null,"Office Equipment",660429,3.58,100,3.58,20.2,0.6,1.73,2365]
[null,"Miscellaneous",593264,0.65,89.8,0.57999999999999996,3.3,0.1,0.47,383]
[null,"Process",11292,1.6,1.7,0.03,0.2,0,0.01,18]
[null,"Motors",591579,0.8,89.6,0.72,4.0999999999999996,0.18,0.8,474]
[null,"Air Compressor",402211,0.15,60.9,0.09,0.5,0.02,0.05,60]
[null,"Segment Total",660429,"--","--",17.7,100,4.09,"--",11691]
[]
["Electricity Summary - Small Office Buildings"]
[null,"End Use","End Use Floor Stock (kSqFt)","Energy Use Indicse (kWh/EUFS/yr)","End-use Floor Stock Distribution (%)","Energy Intensity (kWh/Segment FS/yr)","End-use energy distribution","Non-coincident peak load (watts/SF)","Connected load (watts/SF)","Annual Energy Usage (GWh)"]
[null,"Heating",164537,0.44,45.5,0.2,1.5,0.42,"159.44 SF/kB",72]
[null,"Cooling",325672,2.9,90.1,2.61,19.899999999999999,2.2599999999999998,"342.69 SF/ton",943]
[null,"Ventilation",330459,1.41,91.4,1.29,9.8000000000000007,0.37,0.56999999999999995,467]
[null,"Water Heating",218530,0.41,60.4,0.25,1.9,0.05,0.49,90]
[null,"Cooking",336712,0.11,93.1,0.1,0.8,0.04,0.69,38]
[null,"Refrigeration",339105,0.61,93.8,0.57999999999999996,4.4000000000000004,7.0000000000000007E-2,0.4,208]
[null,"Exterior Lighing",266643,1.28,73.7,0.95,7.2,0.23,0.26,343]
[null,"Interior Lighting",361584,3.83,100,3.83,29.3,1.0900000000000001,1.39,1386]
[null,"Office Equipment",359449,2.21,99.4,2.19,16.7,0.52,2.21,793]
[null,"Miscellaneous",285767,0.99,79,0.78,6,0.2,1.55,283]
[null,"Process",1497,0.76,0.4,0,0,0,0,1]
[null,"Motors",79443,0.99,22,0.22,1.7,0.05,0.23,79]
[null,"Air Compressor",61734,0.57999999999999996,17.100000000000001,0.1,0.8,0.03,0.13,36]
[null,"Segment Total",361584,"--","--",13.1,100,4.51,"--",4738]
[]
["Electricity Summary - All Warehouses"]
[null,"End Use","End Use Floor Stock (kSqFt)","Energy Use Indicse (kWh/EUFS/yr)","End-use Floor Stock Distribution (%)","Energy Intensity (kWh/Segment FS/yr)","End-use energy distribution","Non-coincident peak load (watts/SF)","Connected load (watts/SF)","Annual Energy Usage (GWh)"]
[null,"Heating",60265,0.36,9.3000000000000007,0.03,0.5,0.08,"747.27 SF/kB",22]
[null,"Cooling",135490,1.58,20.9,0.33,4.9000000000000004,0.33,"2295.07 SF/ton",214]
[null,"Ventilation",164407,1.0900000000000001,25.3,0.28000000000000003,4.0999999999999996,7.0000000000000007E-2,0.12,179]
[null,"Water Heating",445409,0.06,68.599999999999994,0.04,0.6,0.01,0.08,28]
[null,"Cooking",585310,0.03,90.1,0.02,0.3,0.01,0.09,15]
[null,"Refrigeration",605115,2.38,93.1,2.21,32.799999999999997,0.38,5.72,1438]
[null,"Exterior Lighing",605590,0.28999999999999998,93.2,0.27,4.0999999999999996,0.06,7.0000000000000007E-2,178]
[null,"Interior Lighting",649706,2.29,100,2.29,33.9,0.48,0.66,1485]
[null,"Office Equipment",643157,0.23,99,0.23,3.4,0.05,0.26,147]
[null,"Miscellaneous",616623,0.44,94.9,0.42,6.2,0.08,0.73,270]
[null,"Process",13716,0.97,2.1,0.02,0.3,0,0.05,13]
[null,"Motors",352197,0.95,54.2,0.52,7.7,0.1,0.42,336]
[null,"Air Compressor",267557,0.2,41.2,0.08,1.2,0.02,0.08,54]
[null,"Segment Total",649706,"--","--",6.74,100,1.5,"--",4380]
[]
["Electricity Summary - Health Facilities"]
[null,"End Use","End Use Floor Stock (kSqFt)","Energy Use Indicse (kWh/EUFS/yr)","End-use Floor Stock Distribution (%)","Energy Intensity (kWh/Segment FS/yr)","End-use energy distribution","Non-coincident peak load (watts/SF)","Connected load (watts/SF)","Annual Energy Usage (GWh)"]
[null,"Heating",169347,0.98,72.8,0.71,3.6,0.2,"572.92 SF/kB",166]
[null,"Cooling",209977,4.29,90.3,3.87,19.8,1.62,"372.90 SF/ton",901]
[null,"Ventilation",222221,4.2300000000000004,95.5,4.04,20.6,0.54,0.83,940]
[null,"Water Heating",49940,0.36,21.5,0.08,0.4,0.02,0.09,18]
[null,"Cooking",230408,0.44,99.1,0.43,2.2000000000000002,0.09,0.95,101]
[null,"Refrigeration",232083,0.71,99.8,0.71,3.6,0.09,0.54,166]
[null,"Exterior Lighing",226738,0.57999999999999996,97.5,0.56999999999999995,2.9,0.13,0.13,132]
[null,"Interior Lighting",232606,4.8099999999999996,100,4.8099999999999996,24.5,0.74,0.93,1119]
[null,"Office Equipment",232420,0.86,99.9,0.86,4.4000000000000004,0.15,0.56999999999999995,200]
[null,"Miscellaneous",230603,2.54,99.1,2.52,12.8,0.43,2.19,586]
[null,"Process",4716,0.26,2,0.01,0,0,0,1]
[null,"Motors",172371,1.05,74.099999999999994,0.78,4,0.12,0.61,181]
[null,"Air Compressor",119943,0.42,51.6,0.22,1.1000000000000001,0.04,0.1,50]
[null,"Segment Total",232606,"--","--",19.61,100,3.78,"--",4561]
[]
[]
["Natural Gas Summary - All Commercial Buildings"]
[null,"End Use","End-use Floor Stock (kSqFt)","Energy-use Indices (kBtu/EUFS/Year)","End-use Floor Stock Distribution (%)","Energy Intensity (kBtu/Segment FS/Year)","End-useEnergy Distribution (%)","Non-coincident Peak Load (Btu/SF)","Connected Load (Btu/SF)","Annual Energy Usage (10,000 therms)"]
[null,null,null,"(a)","(b)","(a*b)"]
[null,"Heating",2752620,16.91,55.9,9.4600000000000009,36.4,5.81,"39.68 SF/kB",46555]
[null,"Cooling",74417,25.68,1.5,0.39,1.5,0.19,"0.00 SF/ton",1911]
[null,"Water Heating",2810997,14.47,57.1,8.27,31.8,1.7,7.78,40668]
[null,"Cooking",1399091,20.66,28.4,5.88,22.6,1.25,4.5199999999999996,28906]
[null,"Miscellaneous",526933,4.3600000000000003,10.7,0.47,1.8,0.1,0.54,2297]
[null,"Process",160271,46.92,3.3,1.53,5.9,0.33,0.88,7521]
[null,"Segment Total",4920114,"--","--",25.99,100,8.49,"--",127857]
[]
["Natural Gas Summary - All Office Buildings"]
[null,"End Use","End-use Floor Stock (kSqFt)","Energy-use Indices (kBtu/EUFS/Year)","End-use Floor Stock Distribution (%)","Energy Intensity (kBtu/Segment FS/Year)","End-useEnergy Distribution (%)","Non-coincident Peak Load (Btu/SF)","Connected Load (Btu/SF)","Annual Energy Usage (10,000 therms)"]
[null,"Heating",666179,21.75,65.2,14.18,79.2,7.98,"36.42 SF/kB",14490]
[null,"Cooling",12877,27.92,1.3,0.35,2,0.15,"0.00 SF/ton",359]
[null,"Water Heating",502391,4.6100000000000003,49.2,2.27,12.7,0.43,2.42,2315]
[null,"Cooking",126268,1.58,12.4,0.2,1.1000000000000001,7.0000000000000007E-2,0.45,200]
[null,"Miscellaneous",47781,1.74,4.7,0.08,0.5,0.02,0.08,83]
[null,"Process",12955,65.19,1.3,0.83,4.5999999999999996,0.13,0.28999999999999998,844]
[null,"Segment Total",1022012,"--","--",17.899999999999999,100,8.6199999999999992,"--",18292]
[]
["Natural Gas Summary - Large Office Buildings"]
[null,"End Use","End-use Floor Stock (kSqFt)","Energy-use Indices (kBtu/EUFS/Year)","End-use Floor Stock Distribution (%)","Energy Intensity (kBtu/Segment FS/Year)","End-useEnergy Distribution (%)","Non-coincident Peak Load (Btu/SF)","Connected Load (Btu/SF)","Annual Energy Usage (10,000 therms)"]
[null,"Heating",487124,23.35,73.8,17.22,78.5,8.6999999999999993,"38.89 SF/kB",11374]
[null,"Cooling",12877,27.92,1.9,0.54,2.5,0.24,"0.00 SF/ton",359]
[null,"Water Heating",387891,4.43,58.7,2.6,11.9,0.49,2.08,1716]
[null,"Cooking",114586,1.35,17.399999999999999,0.23,1.1000000000000001,7.0000000000000007E-2,0.3,154]
[null,"Miscellaneous",37225,1.84,5.6,0.1,0.5,0.02,7.0000000000000007E-2,68]
[null,"Process",12428,65.11,1.9,1.23,5.6,0.19,0.43,809]
[null,"Segment Total",660429,"--","--",21.93,100,9.4,"--",14482]
[]
["Natural Gas Summary - Small Office Buildings"]
[null,"End Use","End-use Floor Stock (kSqFt)","Energy-use Indices (kBtu/EUFS/Year)","End-use Floor Stock Distribution (%)","Energy Intensity (kBtu/Segment FS/Year)","End-useEnergy Distribution (%)","Non-coincident Peak Load (Btu/SF)","Connected Load (Btu/SF)","Annual Energy Usage (10,000 therms)"]
[null,"Heating",179055,17.399999999999999,49.5,8.6199999999999992,81.8,7.97,"32.64 SF/kB",3116]
[null,"Cooling",0,0,0,0,0,0,"0.00 SF/ton",0]
[null,"Water Heating",114500,5.23,31.7,1.66,15.7,0.33,3.03,599]
[null,"Cooking",11682,3.86,3.2,0.12,1.2,0.06,0.73,45]
[null,"Miscellaneous",10556,1.37,2.9,0.04,0.4,0.01,0.11,14]
[null,"Process",527,67.08,0.1,0.1,0.9,0.02,0.03,35]
[null,"Segment Total",361584,"--","--",10.54,100,8.3000000000000007,"--",3810]
[]
["Natural Gas Summary - All Warehouses"]
[null,"End Use","End-use Floor Stock (kSqFt)","Energy-use Indices (kBtu/EUFS/Year)","End-use Floor Stock Distribution (%)","Energy Intensity (kBtu/Segment FS/Year)","End-useEnergy Distribution (%)","Non-coincident Peak Load (Btu/SF)","Connected Load (Btu/SF)","Annual Energy Usage (10,000 therms)"]
[null,"Heating",128379,12.15,19.8,2.4,69.7,2.4500000000000002,"143.30 SF/kB",1560]
[null,"Cooling",0,0,0,0,0,0,"0.00 SF/ton",0]
[null,"Water Heating",231687,1.1000000000000001,35.700000000000003,0.39,11.4,0.09,0.77,256]
[null,"Cooking",18761,6.6,2.9,0.19,5.5,0.03,0.06,124]
[null,"Miscellaneous",27247,0.77,4.2,0.03,0.9,0.01,0.14000000000000001,21]
[null,"Process",14916,18.53,2.2999999999999998,0.43,12.4,0.11,0.61,276]
[null,"Segment Total",649706,"--","--",3.44,100,2.68,"--",2237]
[]
["Natural Gas Summary - Health Facilities"]
[null,"End Use","End-use Floor Stock (kSqFt)","Energy-use Indices (kBtu/EUFS/Year)","End-use Floor Stock Distribution (%)","Energy Intensity (kBtu/Segment FS/Year)","End-useEnergy Distribution (%)","Non-coincident Peak Load (Btu/SF)","Connected Load (Btu/SF)","Annual Energy Usage (10,000 therms)"]
[null,"Heating",199273,38.18,85.7,32.700000000000003,43.3,9.61,"29.21 SF/kB",7607]
[null,"Cooling",5193,69.62,2.2000000000000002,1.55,2.1,0.63,"0.00 SF/ton",362]
[null,"Water Heating",205366,35.53,88.3,31.37,41.5,5.63,17.690000000000001,7297]
[null,"Cooking",175022,4.4800000000000004,75.2,3.37,4.5,0.65,6.61,783]
[null,"Miscellaneous",80125,4.2,34.4,1.45,1.9,0.23,1.29,336]
[null,"Process",53046,22.31,22.8,5.09,6.7,0.83,2.7,1183]
[null,"Segment Total",232606,"--","--",75.53,100,16.68,"--",17569]

{"sheet":"Detail Type Data","index":36,"n_rows":157,"n_cols":36,"rows_kept":157,"cut":false,"hidden":true,"merged":[[91,3,91,5],[92,9,92,12]]}
[]
[null,"Stationary Fuel Combustion Energy Use (MMBtu)"]
[null,null,"Natural Gas","Diesel","Gasoline","LPG","Propane","Butane","Residual Fuel Oil No. 5","Residual Fuel Oil No. 6","Jet Fuel","Bituminous Coal","Digester Gas","Total"]
[null,null,{"$f":"VLOOKUP(C3, stat_factors, 5, FALSE)","v":1.0369999999999999},0.1380952380952381,0.12023809523809523,9.1999999999999998E-2,9.0999999999999998E-2,0.10299999999999999,0.14000000000000001,0.15,0.13500000000000001,{"$error":"#N/A"},0.65500000000000003]
[null,{"$f":"'Background Controls'!O5","v":"Residential: Single Family Units"},{"$f":"SUMIFS(stat_data_consump, stat_data_bldgtype, $B5, stat_data_FuelType, C$3)*C$4","v":0},0,0,0,0,0,0,0,0,{"$error":"#N/A"},0,{"$f":"SUM(C5:M5)","v":{"$error":"#N/A"}}]
[null,{"$f":"'Background Controls'!O6","v":"Residential: Apartment Buildings"},0,0,0,0,0,0,0,0,0,{"$error":"#N/A"},0,{"$f":"SUM(C6:M6)","v":{"$error":"#N/A"}}]
[null,{"$f":"'Background Controls'!O7","v":"Residential: Mobile Homes"},0,0,0,0,0,0,0,0,0,{"$error":"#N/A"},0,{"$f":"SUM(C7:M7)","v":{"$error":"#N/A"}}]
[null,{"$f":"'Background Controls'!O8","v":"Commercial/Institutional: Education"},0,0,0,0,0,0,0,0,0,{"$error":"#N/A"},0,{"$f":"SUM(C8:M8)","v":{"$error":"#N/A"}}]
[null,{"$f":"'Background Controls'!O9","v":"Commercial/Institutional: Food Sales"},0,0,0,0,0,0,0,0,0,{"$error":"#N/A"},0,{"$f":"SUM(C9:M9)","v":{"$error":"#N/A"}}]
[null,{"$f":"'Background Controls'!O10","v":"Commercial/Institutional: Food Service"},0,0,0,0,0,0,0,0,0,{"$error":"#N/A"},0,{"$error":"#N/A"}]
[null,{"$f":"'Background Controls'!O11","v":"Commercial/Institutional: Health Care"},0,0,0,0,0,0,0,0,0,{"$error":"#N/A"},0,{"$error":"#N/A"}]
[null,{"$f":"'Background Controls'!O12","v":"Commercial/Institutional: Lodging"},0,162400,0,0,0,0,0,0,0,{"$error":"#N/A"},0,{"$error":"#N/A"}]
[null,{"$f":"'Background Controls'!O13","v":"Commercial/Institutional: Mercantile"},null,0,0,0,0,0,0,0,0,{"$error":"#N/A"},0,{"$error":"#N/A"}]
[null,{"$f":"'Background Controls'!O14","v":"Commercial/Institutional: Office"},null,0,0,0,0,0,0,0,0,{"$error":"#N/A"},0,{"$error":"#N/A"}]
[null,{"$f":"'Background Controls'!O15","v":"Commercial/Institutional: Public Assembly"},null,0,0,0,0,0,0,0,0,{"$error":"#N/A"},0,{"$error":"#N/A"}]
[null,{"$f":"'Background Controls'!O16","v":"Commercial/Institutional: Public Order and Safety"},null,0,0,0,0,0,0,0,0,{"$error":"#N/A"},0,{"$error":"#N/A"}]
[null,{"$f":"'Background Controls'!O17","v":"Commercial/Institutional: Religious Worship"},null,0,0,0,0,0,0,0,0,{"$error":"#N/A"},0,{"$error":"#N/A"}]
[null,{"$f":"'Background Controls'!O18","v":"Commercial/Institutional: Service"},null,0,0,0,0,0,0,0,0,{"$error":"#N/A"},0,{"$error":"#N/A"}]
[null,{"$f":"'Background Controls'!O19","v":"Commercial/Institutional: Warehouse and Storage"},null,0,0,0,0,0,0,0,0,{"$error":"#N/A"},0,{"$error":"#N/A"}]
[null,{"$f":"'Background Controls'!O20","v":"Commercial/Institutional: Other"},null,0,0,0,0,0,0,0,0,{"$error":"#N/A"},0,{"$error":"#N/A"}]
[null,{"$f":"'Background Controls'!O21","v":"Commercial/Institutional: Vacant"},null,{"$f":"SUMIFS(stat_data_consump, stat_data_bldgtype, $B21, stat_data_FuelType, D$3)*D$4","v":0},0,0,0,0,0,0,0,{"$error":"#N/A"},0,{"$error":"#N/A"}]
[null,{"$f":"'Background Controls'!O22","v":"Industrial: Food"},null,0,0,0,0,0,0,0,0,{"$error":"#N/A"},0,{"$error":"#N/A"}]
[null,{"$f":"'Background Controls'!O23","v":"Industrial: Beverage and Tobacco Products"},null,0,0,0,0,0,0,0,0,{"$error":"#N/A"},0,{"$error":"#N/A"}]
[null,{"$f":"'Background Controls'!O24","v":"Industrial: Textile Mills"},null,0,0,0,0,0,0,0,0,{"$error":"#N/A"},0,{"$error":"#N/A"}]
[null,{"$f":"'Background Controls'!O25","v":"Industrial: Textile Product Mills"},null,0,0,0,0,0,0,0,0,{"$error":"#N/A"},0,{"$error":"#N/A"}]
[null,{"$f":"'Background Controls'!O26","v":"Industrial: Apparel"},null,0,0,0,0,0,0,0,0,{"$error":"#N/A"},0,{"$error":"#N/A"}]
[null,{"$f":"'Background Controls'!O27","v":"Industrial: Leather and Allied Products"},null,0,0,0,0,0,0,0,0,{"$error":"#N/A"},0,{"$error":"#N/A"}]
[null,{"$f":"'Background Controls'!O28","v":"Industrial: Wood Products"},null,0,0,0,0,0,0,0,0,{"$error":"#N/A"},0,{"$error":"#N/A"}]
[null,{"$f":"'Background Controls'!O29","v":"Industrial: Paper"},null,0,0,0,0,0,0,0,0,{"$error":"#N/A"},0,{"$error":"#N/A"}]
[null,{"$f":"'Background Controls'!O30","v":"Industrial: Printing and Related Support"},null,0,0,0,0,0,0,0,0,{"$error":"#N/A"},0,{"$error":"#N/A"}]
[null,{"$f":"'Background Controls'!O31","v":"Industrial: Petroleum and Coal Products"},null,0,0,0,0,0,0,0,0,{"$error":"#N/A"},0,{"$error":"#N/A"}]
[null,{"$f":"'Background Controls'!O32","v":"Industrial: Chemicals"},null,0,0,0,0,0,0,0,0,{"$error":"#N/A"},0,{"$error":"#N/A"}]
[null,{"$f":"'Background Controls'!O33","v":"Industrial: Plastics and Rubber Products"},null,0,0,0,0,0,0,0,0,{"$error":"#N/A"},0,{"$error":"#N/A"}]
[null,{"$f":"'Background Controls'!O34","v":"Industrial: Nonmetallic Mineral Products"},null,0,0,0,0,0,0,0,0,{"$error":"#N/A"},0,{"$error":"#N/A"}]
[null,{"$f":"'Background Controls'!O35","v":"Industrial: Primary Metals"},null,0,0,0,0,0,0,0,0,{"$error":"#N/A"},0,{"$error":"#N/A"}]
[null,{"$f":"'Background Controls'!O36","v":"Industrial: Fabricated Metal Products"},null,0,0,0,0,0,0,0,0,{"$error":"#N/A"},0,{"$error":"#N/A"}]
[null,{"$f":"'Background Controls'!O37","v":"Industrial: Machinery"},null,0,0,0,0,0,0,0,0,{"$error":"#N/A"},0,{"$error":"#N/A"}]
[null,{"$f":"'Background Controls'!O38","v":"Industrial: Computer and Electronic Products"},null,0,0,0,0,0,0,0,0,{"$error":"#N/A"},0,{"$error":"#N/A"}]
[null,{"$f":"'Background Controls'!O39","v":"Industrial: Electrical Equip., Appliances, and Components"},null,0,0,0,0,0,0,0,0,{"$error":"#N/A"},0,{"$error":"#N/A"}]
[null,{"$f":"'Background Controls'!O40","v":"Industrial: Transportation Equipment"},null,0,0,0,0,0,0,0,0,{"$error":"#N/A"},0,{"$error":"#N/A"}]
[null,{"$f":"'Background Controls'!O41","v":"Industrial: Furniture and Related Products"},null,0,0,0,0,0,0,0,0,{"$error":"#N/A"},0,{"$error":"#N/A"}]
[null,{"$f":"'Background Controls'!O42","v":"Industrial: Miscellaneous"},null,1242.8571428571429,0,0,0,0,0,0,0,{"$error":"#N/A"},0,{"$error":"#N/A"}]
[null,null,null,0,0,0,0,0,0,0,0,{"$error":"#N/A"},0,{"$error":"#N/A"}]
[null,null,null,0,0,0,0,0,0,0,0,{"$error":"#N/A"},0,{"$error":"#N/A"}]
[null,null,null,0,0,0,0,0,0,0,0,{"$error":"#N/A"},0,{"$error":"#N/A"}]
[null,null,null,0,0,0,0,0,{"$f":"SUMIFS(stat_data_consump, stat_data_bldgtype, $B46, stat_data_FuelType, I$3)*I$4","v":0},0,0,{"$error":"#N/A"},0,{"$error":"#N/A"}]
[null,"Electricity Use (kWh) by Building Type",null,0,0,0,0,0,0,0,0,{"$error":"#N/A"},0,{"$error":"#N/A"}]
[null,null,"kWh",0,0,0,0,0,0,0,0,{"$error":"#N/A"},0,{"$error":"#N/A"}]
[null,{"$f":"'Background Controls'!O5","v":"Residential: Single Family Units"},{"$f":"SUMIF(elec_data_bldgtype, B49, elec_data_consump)","v":0},0,0,0,0,0,0,0,0,{"$error":"#N/A"},0,{"$error":"#N/A"}]
[null,{"$f":"'Background Controls'!O6","v":"Residential: Apartment Buildings"},0,0,0,0,0,0,0,0,0,{"$error":"#N/A"},0,{"$error":"#N/A"}]
[null,{"$f":"'Background Controls'!O7","v":"Residential: Mobile Homes"},0,0,0,0,0,0,0,0,0,{"$error":"#N/A"},0,{"$error":"#N/A"}]
[null,{"$f":"'Background Controls'!O8","v":"Commercial/Institutional: Education"},0,0,0,0,0,0,0,0,0,{"$error":"#N/A"},0,{"$error":"#N/A"}]
[null,{"$f":"'Background Controls'!O9","v":"Commercial/Institutional: Food Sales"},0,0,0,0,0,0,0,0,0,{"$error":"#N/A"},0,{"$error":"#N/A"}]
[null,{"$f":"'Background Controls'!O10","v":"Commercial/Institutional: Food Service"},0,0,0,0,0,0,0,0,0,{"$error":"#N/A"},0,{"$error":"#N/A"}]
[null,{"$f":"'Background Controls'!O11","v":"Commercial/Institutional: Health Care"},0,0,0,0,0,0,0,0,0,{"$error":"#N/A"},0,{"$error":"#N/A"}]
[null,{"$f":"'Background Controls'!O12","v":"Commercial/Institutional: Lodging"},0,162400,0,0,0,0,0,0,0,{"$error":"#N/A"},0,{"$error":"#N/A"}]
[null,{"$f":"'Background Controls'!O13","v":"Commercial/Institutional: Mercantile"},0,0,0,0,0,0,0,0,0,{"$error":"#N/A"},0,{"$error":"#N/A"}]
[null,{"$f":"'Background Controls'!O14","v":"Commercial/Institutional: Office"},0,0,0,0,0,0,0,0,0,{"$error":"#N/A"},0,{"$error":"#N/A"}]
[null,{"$f":"'Background Controls'!O15","v":"Commercial/Institutional: Public Assembly"},0,0,0,0,0,0,0,0,0,{"$error":"#N/A"},0,{"$error":"#N/A"}]
[null,{"$f":"'Background Controls'!O16","v":"Commercial/Institutional: Public Order and Safety"},0,0,0,0,0,0,0,0,0,{"$error":"#N/A"},0,{"$error":"#N/A"}]
[null,{"$f":"'Background Controls'!O17","v":"Commercial/Institutional: Religious Worship"},0,0,0,0,0,0,0,0,0,{"$error":"#N/A"},0,{"$error":"#N/A"}]
[null,{"$f":"'Background Controls'!O18","v":"Commercial/Institutional: Service"},0,0,0,0,0,0,0,0,0,{"$error":"#N/A"},0,{"$error":"#N/A"}]
[null,{"$f":"'Background Controls'!O19","v":"Commercial/Institutional: Warehouse and Storage"},0,0,0,0,0,0,0,0,0,{"$error":"#N/A"},0,{"$error":"#N/A"}]
[null,{"$f":"'Background Controls'!O20","v":"Commercial/Institutional: Other"},0,0,0,0,0,0,0,0,0,{"$error":"#N/A"},0,{"$error":"#N/A"}]
[null,{"$f":"'Background Controls'!O21","v":"Commercial/Institutional: Vacant"},0,0,0,0,0,0,0,0,0,{"$error":"#N/A"},0,{"$error":"#N/A"}]
[null,{"$f":"'Background Controls'!O22","v":"Industrial: Food"},0,0,0,0,0,0,0,0,0,{"$error":"#N/A"},0,{"$error":"#N/A"}]
[null,{"$f":"'Background Controls'!O23","v":"Industrial: Beverage and Tobacco Products"},0,0,0,0,0,0,0,0,0,{"$error":"#N/A"},0,{"$error":"#N/A"}]
[null,{"$f":"'Background Controls'!O24","v":"Industrial: Textile Mills"},0,0,0,0,0,0,0,0,0,{"$error":"#N/A"},0,{"$error":"#N/A"}]
[null,{"$f":"'Background Controls'!O25","v":"Industrial: Textile Product Mills"},0,0,0,0,0,0,0,0,0,{"$error":"#N/A"},0,{"$error":"#N/A"}]
[null,{"$f":"'Background Controls'!O26","v":"Industrial: Apparel"},0,0,0,0,0,0,0,0,0,{"$error":"#N/A"},0,{"$error":"#N/A"}]
[null,{"$f":"'Background Controls'!O27","v":"Industrial: Leather and Allied Products"},0,0,0,0,0,0,0,0,0,{"$error":"#N/A"},0,{"$error":"#N/A"}]
[null,{"$f":"'Background Controls'!O28","v":"Industrial: Wood Products"},0,{"$f":"SUMIFS(stat_data_consump, stat_data_bldgtype, $B72, stat_data_FuelType, D$3)*D$4","v":0},0,0,0,0,0,0,0,{"$error":"#N/A"},0,{"$error":"#N/A"}]
[null,{"$f":"'Background Controls'!O29","v":"Industrial: Paper"},0,0,0,0,0,0,0,0,0,{"$error":"#N/A"},0,{"$f":"SUM(C73:M73)","v":{"$error":"#N/A"}}]
[null,{"$f":"'Background Controls'!O30","v":"Industrial: Printing and Related Support"},0,0,0,0,0,0,0,0,0,{"$error":"#N/A"},0,{"$error":"#N/A"}]
[null,{"$f":"'Background Controls'!O31","v":"Industrial: Petroleum and Coal Products"},0,0,0,0,0,0,0,0,0,{"$error":"#N/A"},0,{"$error":"#N/A"}]
[null,{"$f":"'Background Controls'!O32","v":"Industrial: Chemicals"},0,0,0,0,0,0,0,0,0,{"$error":"#N/A"},0,{"$error":"#N/A"}]
[null,{"$f":"'Background Controls'!O33","v":"Industrial: Plastics and Rubber Products"},0,0,0,0,0,0,0,0,0,{"$error":"#N/A"},0,{"$error":"#N/A"}]
[null,{"$f":"'Background Controls'!O34","v":"Industrial: Nonmetallic Mineral Products"},0,0,0,0,0,0,0,0,0,{"$error":"#N/A"},0,{"$error":"#N/A"}]
[null,{"$f":"'Background Controls'!O35","v":"Industrial: Primary Metals"},0,0,0,0,0,0,0,0,0,{"$error":"#N/A"},0,{"$error":"#N/A"}]
[null,{"$f":"'Background Controls'!O36","v":"Industrial: Fabricated Metal Products"},0,0,0,0,0,0,0,0,0,{"$error":"#N/A"},0,{"$error":"#N/A"}]
[null,{"$f":"'Background Controls'!O37","v":"Industrial: Machinery"},0,0,0,0,0,0,0,0,0,{"$error":"#N/A"},0,{"$error":"#N/A"}]
[null,{"$f":"'Background Controls'!O38","v":"Industrial: Computer and Electronic Products"},0,0,0,0,0,0,0,0,0,{"$error":"#N/A"},0,{"$error":"#N/A"}]
[null,{"$f":"'Background Controls'!O39","v":"Industrial: Electrical Equip., Appliances, and Components"},0,0,0,0,0,0,0,0,0,{"$error":"#N/A"},0,{"$error":"#N/A"}]
[null,{"$f":"'Background Controls'!O40","v":"Industrial: Transportation Equipment"},0,0,0,0,0,0,0,0,0,{"$error":"#N/A"},0,{"$error":"#N/A"}]
[null,{"$f":"'Background Controls'!O41","v":"Industrial: Furniture and Related Products"},0,0,0,0,0,0,0,0,0,{"$error":"#N/A"},0,{"$error":"#N/A"}]
[null,{"$f":"'Background Controls'!O42","v":"Industrial: Miscellaneous"},0,1242.8571428571429,0,0,0,0,0,0,0,{"$error":"#N/A"},0,{"$error":"#N/A"}]
[null,null,{"$f":"SUM(C49:C86)","v":0}]
[]
[]
[]
[null,"Mobile Emissions by Vehicle Type",null,null,null,null,null,null,null,{"$f":"\"Temporary Values - Current Department \"&mob_nonCO2_current_dept","v":"Temporary Values - Current Department Energy Generation"}]
[null,"Type","Fuel","CO2",null,null,"Non-CO2","Total",null,"Type","Fuel","CH4","N2O","Total",null,"Total Non-CO2"]
[null,null,null,"% fuel type use by vehicle type","Total Fuel Type Emissions","CO2 emissions",null,null,null,"*Note: formulas are not drag-able*",null,null,null,null,null,{"$f":"'Background Controls'!$I$5","v":"Residential"},{"$f":"'Background Controls'!$I$6","v":"Commercial/Institutional"},{"$f":"'Background Controls'!$I$7","v":"Industrial"},{"$f":"'Background Controls'!$I$8","v":"Energy Generation"},{"$f":"'Background Controls'!$I$9","v":0},{"$f":"'Background Controls'!$I$10","v":0},{"$f":"'Background Controls'!$I$11","v":0},{"$f":"'Background Controls'!$I$12","v":0},{"$f":"'Background Controls'!$I$13","v":0},{"$f":"'Background Controls'!$I$14","v":0},{"$f":"'Background Controls'!$I$15","v":0},{"$f":"'Background Controls'!$I$16","v":0},{"$f":"'Background Controls'!$I$17","v":0},{"$f":"'Background Controls'!$I$18","v":0},{"$f":"'Background Controls'!$I$19","v":0},{"$f":"'Background Controls'!$I$20","v":0},{"$f":"'Background Controls'!$I$21","v":0},{"$f":"'Background Controls'!$I$22","v":0},{"$f":"'Background Controls'!$I$23","v":0},{"$f":"'Background Controls'!$I$24","v":0},"SUM"]
[null,"Passenger Car","Gasoline",{"$f":"IF(SUMIF('Mobile-Data'!$G$9:$G$1048576,C94, 'Mobile-Data'!$H$9:$H$1048576)=0,0,SUMIFS('Mobile-Data'!$H$9:$H$1048576, 'Mobile-Data'!$E$9:$E$1048576,B94, 'Mobile-Data'!$G$9:$G$1048576,C94)/SUMIF('Mobile-Data'!$G$9:$G$1048576,C94, 'Mobile-Data'!$H$9:$H$1048576))","v":0.33766684087498799},{"$f":"'Mobile-Detail Calcs'!$C$149","v":101689.24881999999},{"$f":"D94*E94","v":34337.087399999997},{"$f":"AJ94","v":939.61652420790006},{"$f":"SUM(F94:G94)","v":35276.703924207897},null,"Passenger Car","Gasoline",{"$f":"'Mobile-Detail Calcs'!L210","v":0},{"$f":"'Mobile-Detail Calcs'!$U$210","v":0},{"$f":"SUM(L94:M94)","v":0},null,0,939.61652420790006,0,0,0,0,0,0,0,0,0,0,0,0,0,0,0,0,0,0,{"$f":"SUM(P94:AI94)","v":939.61652420790006}]
[null,"Light Truck (Vans, Pickup Trucks, SUVs)","Gasoline",{"$f":"IF(SUMIF('Mobile-Data'!$G$9:$G$1048576,C95, 'Mobile-Data'!$H$9:$H$1048576)=0,0,SUMIFS('Mobile-Data'!$H$9:$H$1048576, 'Mobile-Data'!$E$9:$E$1048576,B95, 'Mobile-Data'!$G$9:$G$1048576,C95)/SUMIF('Mobile-Data'!$G$9:$G$1048576,C95, 'Mobile-Data'!$H$9:$H$1048576))","v":0.63389754323096204},{"$f":"'Mobile-Detail Calcs'!$C$149","v":101689.24881999999},64460.565000000002,{"$f":"AJ95","v":2603.8100044125003},{"$f":"SUM(F95:G95)","v":67064.375004412504},null,"Light Truck (Vans, Pickup Trucks, SUVs)","Gasoline",{"$f":"'Mobile-Detail Calcs'!M210","v":0},{"$f":"'Mobile-Detail Calcs'!$V$210","v":0},{"$f":"SUM(L95:M95)","v":0},null,0,2603.8100044125003,0,0,0,0,0,0,0,0,0,0,0,0,0,0,0,0,0,0,{"$f":"SUM(P95:AI95)","v":2603.8100044125003}]
[null,"Heavy-Duty Vehicle","Gasoline",{"$f":"IF(SUMIF('Mobile-Data'!$G$9:$G$1048576,C96, 'Mobile-Data'!$H$9:$H$1048576)=0,0,SUMIFS('Mobile-Data'!$H$9:$H$1048576, 'Mobile-Data'!$E$9:$E$1048576,B96, 'Mobile-Data'!$G$9:$G$1048576,C96)/SUMIF('Mobile-Data'!$G$9:$G$1048576,C96, 'Mobile-Data'!$H$9:$H$1048576))","v":4.3242402230580269E-3},{"$f":"'Mobile-Detail Calcs'!$C$149","v":101689.24881999999},439.72873999999996,13.222163466743002,452.95090346674294,null,"Heavy-Duty Vehicle","Gasoline",{"$f":"'Mobile-Detail Calcs'!N210","v":0},{"$f":"'Mobile-Detail Calcs'!$W$210","v":0},0,null,0,13.222163466743002,0,0,0,0,0,0,0,0,0,0,0,0,0,0,0,0,0,0,13.222163466743002]
[null,"Passenger Car","Diesel",{"$f":"IF(SUMIF('Mobile-Data'!$G$9:$G$1048576,C97, 'Mobile-Data'!$H$9:$H$1048576)=0,0,SUMIFS('Mobile-Data'!$H$9:$H$1048576, 'Mobile-Data'!$E$9:$E$1048576,B97, 'Mobile-Data'!$G$9:$G$1048576,C97)/SUMIF('Mobile-Data'!$G$9:$G$1048576,C97, 'Mobile-Data'!$H$9:$H$1048576))","v":0},{"$f":"'Mobile-Detail Calcs'!$D$149","v":71743.801570000011},0,0,0,null,"Passenger Car","Diesel",{"$f":"'Mobile-Detail Calcs'!O210","v":0},{"$f":"'Mobile-Detail Calcs'!$X$210","v":0},0,null,0,0,0,0,0,0,0,0,0,0,0,0,0,0,0,0,0,0,0,0,0]
[null,"Light Truck (Vans, Pickup Trucks, SUVs)","Diesel",{"$f":"IF(SUMIF('Mobile-Data'!$G$9:$G$1048576,C98, 'Mobile-Data'!$H$9:$H$1048576)=0,0,SUMIFS('Mobile-Data'!$H$9:$H$1048576, 'Mobile-Data'!$E$9:$E$1048576,B98, 'Mobile-Data'!$G$9:$G$1048576,C98)/SUMIF('Mobile-Data'!$G$9:$G$1048576,C98, 'Mobile-Data'!$H$9:$H$1048576))","v":0.12822334778321393},{"$f":"'Mobile-Detail Calcs'!$D$149","v":71743.801570000011},9199.2304199999999,9.5837150034599983,9208.8141350034603,null,"Light Truck (Vans, Pickup Trucks, SUVs)","Diesel",{"$f":"'Mobile-Detail Calcs'!P210","v":0},{"$f":"'Mobile-Detail Calcs'!$Y$210","v":0},0,null,0,9.5837150034599983,0,0,0,0,0,0,0,0,0,0,0,0,0,0,0,0,0,0,9.5837150034599983]
[null,"Heavy-Duty Vehicle","Diesel",{"$f":"IF(SUMIF('Mobile-Data'!$G$9:$G$1048576,C99, 'Mobile-Data'!$H$9:$H$1048576)=0,0,SUMIFS('Mobile-Data'!$H$9:$H$1048576, 'Mobile-Data'!$E$9:$E$1048576,B99, 'Mobile-Data'!$G$9:$G$1048576,C99)/SUMIF('Mobile-Data'!$G$9:$G$1048576,C99, 'Mobile-Data'!$H$9:$H$1048576))","v":0.4050703184670954},{"$f":"'Mobile-Detail Calcs'!$D$149","v":71743.801570000011},29061.284550000004,52.190218779840002,29113.474768779844,null,"Heavy-Duty Vehicle","Diesel",{"$f":"'Mobile-Detail Calcs'!Q210","v":0},{"$f":"'Mobile-Detail Calcs'!$Z$210","v":0},0,null,0,52.190218779840002,0,0,0,0,0,0,0,0,0,0,0,0,0,0,0,0,0,0,52.190218779840002]
[null,"Passenger Car","Biodiesel (B5)",{"$f":"IF(SUMIF('Mobile-Data'!$G$9:$G$1048576,C100, 'Mobile-Data'!$H$9:$H$1048576)=0,0,SUMIFS('Mobile-Data'!$H$9:$H$1048576, 'Mobile-Data'!$E$9:$E$1048576,B100, 'Mobile-Data'!$G$9:$G$1048576,C100)/SUMIF('Mobile-Data'!$G$9:$G$1048576,C100, 'Mobile-Data'!$H$9:$H$1048576))","v":0},{"$f":"'Mobile-Detail Calcs'!$E$149","v":0},0,0,0,null,"Passenger Car","Biodiesel (B5)",{"$f":"'Mobile-Detail Calcs'!L220","v":0},{"$f":"'Mobile-Detail Calcs'!U220","v":0},0,null,0,0,0,0,0,0,0,0,0,0,0,0,0,0,0,0,0,0,0,0,0]
[null,"Light Truck (Vans, Pickup Trucks, SUVs)","Biodiesel (B5)",{"$f":"IF(SUMIF('Mobile-Data'!$G$9:$G$1048576,C101, 'Mobile-Data'!$H$9:$H$1048576)=0,0,SUMIFS('Mobile-Data'!$H$9:$H$1048576, 'Mobile-Data'!$E$9:$E$1048576,B101, 'Mobile-Data'!$G$9:$G$1048576,C101)/SUMIF('Mobile-Data'!$G$9:$G$1048576,C101, 'Mobile-Data'!$H$9:$H$1048576))","v":0},{"$f":"'Mobile-Detail Calcs'!$E$149","v":0},0,0,0,null,"Light Truck (Vans, Pickup Trucks, SUVs)","Biodiesel (B5)",{"$f":"'Mobile-Detail Calcs'!M220","v":0},{"$f":"'Mobile-Detail Calcs'!V220","v":0},0,null,0,0,0,0,0,0,0,0,0,0,0,0,0,0,0,0,0,0,0,0,0]
[null,"Heavy-Duty Vehicle","Biodiesel (B5)",{"$f":"IF(SUMIF('Mobile-Data'!$G$9:$G$1048576,C102, 'Mobile-Data'!$H$9:$H$1048576)=0,0,SUMIFS('Mobile-Data'!$H$9:$H$1048576, 'Mobile-Data'!$E$9:$E$1048576,B102, 'Mobile-Data'!$G$9:$G$1048576,C102)/SUMIF('Mobile-Data'!$G$9:$G$1048576,C102, 'Mobile-Data'!$H$9:$H$1048576))","v":0},{"$f":"'Mobile-Detail Calcs'!$E$149","v":0},0,0,0,null,"Heavy-Duty Vehicle","Biodiesel (B5)",{"$f":"'Mobile-Detail Calcs'!N220","v":0},{"$f":"'Mobile-Detail Calcs'!W220","v":0},0,null,0,0,0,0,0,0,0,0,0,0,0,0,0,0,0,0,0,0,0,0,0]
[null,"Passenger Car","Biodiesel (B20)",{"$f":"IF(SUMIF('Mobile-Data'!$G$9:$G$1048576,C103, 'Mobile-Data'!$H$9:$H$1048576)=0,0,SUMIFS('Mobile-Data'!$H$9:$H$1048576, 'Mobile-Data'!$E$9:$E$1048576,B103, 'Mobile-Data'!$G$9:$G$1048576,C103)/SUMIF('Mobile-Data'!$G$9:$G$1048576,C103, 'Mobile-Data'!$H$9:$H$1048576))","v":0},{"$f":"'Mobile-Detail Calcs'!$F$149","v":0},0,0,0,null,"Passenger Car","Biodiesel (B20)",{"$f":"'Mobile-Detail Calcs'!L221","v":0},{"$f":"'Mobile-Detail Calcs'!U221","v":0},0,null,0,0,0,0,0,0,0,0,0,0,0,0,0,0,0,0,0,0,0,0,0]
[null,"Light Truck (Vans, Pickup Trucks, SUVs)","Biodiesel (B20)",{"$f":"IF(SUMIF('Mobile-Data'!$G$9:$G$1048576,C104, 'Mobile-Data'!$H$9:$H$1048576)=0,0,SUMIFS('Mobile-Data'!$H$9:$H$1048576, 'Mobile-Data'!$E$9:$E$1048576,B104, 'Mobile-Data'!$G$9:$G$1048576,C104)/SUMIF('Mobile-Data'!$G$9:$G$1048576,C104, 'Mobile-Data'!$H$9:$H$1048576))","v":0},{"$f":"'Mobile-Detail Calcs'!$F$149","v":0},0,0,0,null,"Light Truck (Vans, Pickup Trucks, SUVs)","Biodiesel (B20)",{"$f":"'Mobile-Detail Calcs'!M221","v":0},{"$f":"'Mobile-Detail Calcs'!V221","v":0},0,null,0,0,0,0,0,0,0,0,0,0,0,0,0,0,0,0,0,0,0,0,0]
[null,"Heavy-Duty Vehicle","Biodiesel (B20)",{"$f":"IF(SUMIF('Mobile-Data'!$G$9:$G$1048576,C105, 'Mobile-Data'!$H$9:$H$1048576)=0,0,SUMIFS('Mobile-Data'!$H$9:$H$1048576, 'Mobile-Data'!$E$9:$E$1048576,B105, 'Mobile-Data'!$G$9:$G$1048576,C105)/SUMIF('Mobile-Data'!$G$9:$G$1048576,C105, 'Mobile-Data'!$H$9:$H$1048576))","v":0},{"$f":"'Mobile-Detail Calcs'!$F$149","v":0},0,0,0,null,"Heavy-Duty Vehicle","Biodiesel (B20)",{"$f":"'Mobile-Detail Calcs'!N221","v":0},{"$f":"'Mobile-Detail Calcs'!W221","v":0},0,null,0,0,0,0,0,0,0,0,0,0,0,0,0,0,0,0,0,0,0,0,0]
[null,"Passenger Car","Ethanol (E85)",{"$f":"IF(SUMIF('Mobile-Data'!$G$9:$G$1048576,C106, 'Mobile-Data'!$H$9:$H$1048576)=0,0,SUMIFS('Mobile-Data'!$H$9:$H$1048576, 'Mobile-Data'!$E$9:$E$1048576,B106, 'Mobile-Data'!$G$9:$G$1048576,C106)/SUMIF('Mobile-Data'!$G$9:$G$1048576,C106, 'Mobile-Data'!$H$9:$H$1048576))","v":0},{"$f":"'Mobile-Detail Calcs'!$G$149","v":0},0,0,0,null,"Passenger Car","Ethanol (E85)",{"$f":"'Mobile-Detail Calcs'!L219","v":0},{"$f":"'Mobile-Detail Calcs'!U219","v":0},0,null,0,0,0,0,0,0,0,0,0,0,0,0,0,0,0,0,0,0,0,0,0]
[null,"Light Truck (Vans, Pickup Trucks, SUVs)","Ethanol (E85)",{"$f":"IF(SUMIF('Mobile-Data'!$G$9:$G$1048576,C107, 'Mobile-Data'!$H$9:$H$1048576)=0,0,SUMIFS('Mobile-Data'!$H$9:$H$1048576, 'Mobile-Data'!$E$9:$E$1048576,B107, 'Mobile-Data'!$G$9:$G$1048576,C107)/SUMIF('Mobile-Data'!$G$9:$G$1048576,C107, 'Mobile-Data'!$H$9:$H$1048576))","v":0},{"$f":"'Mobile-Detail Calcs'!$G$149","v":0},{"$f":"D107*E107","v":0},0,0,null,"Light Truck (Vans, Pickup Trucks, SUVs)","Ethanol (E85)",{"$f":"'Mobile-Detail Calcs'!M219","v":0},{"$f":"'Mobile-Detail Calcs'!V219","v":0},0,null,0,0,0,0,0,0,0,0,0,0,0,0,0,0,0,0,0,0,0,0,0]
[null,"Heavy-Duty Vehicle","Ethanol (E85)",{"$f":"IF(SUMIF('Mobile-Data'!$G$9:$G$1048576,C108, 'Mobile-Data'!$H$9:$H$1048576)=0,0,SUMIFS('Mobile-Data'!$H$9:$H$1048576, 'Mobile-Data'!$E$9:$E$1048576,B108, 'Mobile-Data'!$G$9:$G$1048576,C108)/SUMIF('Mobile-Data'!$G$9:$G$1048576,C108, 'Mobile-Data'!$H$9:$H$1048576))","v":0},{"$f":"'Mobile-Detail Calcs'!$G$149","v":0},0,0,0,null,"Heavy-Duty Vehicle","Ethanol (E85)",{"$f":"'Mobile-Detail Calcs'!N219","v":0},{"$f":"'Mobile-Detail Calcs'!W219","v":0},0,null,0,0,0,0,0,0,0,0,0,0,0,0,0,0,0,0,0,0,0,0,0]
[null,"Passenger Car","CNG",{"$f":"IF(SUMIF('Mobile-Data'!$G$9:$G$1048576,C109, 'Mobile-Data'!$H$9:$H$1048576)=0,0,SUMIFS('Mobile-Data'!$H$9:$H$1048576, 'Mobile-Data'!$E$9:$E$1048576,B109, 'Mobile-Data'!$G$9:$G$1048576,C109)/SUMIF('Mobile-Data'!$G$9:$G$1048576,C109, 'Mobile-Data'!$H$9:$H$1048576))","v":0},{"$f":"'Mobile-Detail Calcs'!$H$149","v":0},0,0,0,null,"Passenger Car","CNG",{"$f":"'Mobile-Detail Calcs'!L216","v":0},{"$f":"'Mobile-Detail Calcs'!U216","v":0},0,null,0,0,0,0,0,0,0,0,0,0,0,0,0,0,0,0,0,0,0,0,0]
[null,"Light Truck (Vans, Pickup Trucks, SUVs)","CNG",{"$f":"IF(SUMIF('Mobile-Data'!$G$9:$G$1048576,C110, 'Mobile-Data'!$H$9:$H$1048576)=0,0,SUMIFS('Mobile-Data'!$H$9:$H$1048576, 'Mobile-Data'!$E$9:$E$1048576,B110, 'Mobile-Data'!$G$9:$G$1048576,C110)/SUMIF('Mobile-Data'!$G$9:$G$1048576,C110, 'Mobile-Data'!$H$9:$H$1048576))","v":0},{"$f":"'Mobile-Detail Calcs'!$H$149","v":0},0,0,0,null,"Light Truck (Vans, Pickup Trucks, SUVs)","CNG",{"$f":"'Mobile-Detail Calcs'!M216","v":0},{"$f":"'Mobile-Detail Calcs'!V216","v":0},0,null,0,0,0,0,0,0,0,0,0,0,0,0,0,0,0,0,0,0,0,0,0]
[null,"Heavy-Duty Vehicle","CNG",{"$f":"IF(SUMIF('Mobile-Data'!$G$9:$G$1048576,C111, 'Mobile-Data'!$H$9:$H$1048576)=0,0,SUMIFS('Mobile-Data'!$H$9:$H$1048576, 'Mobile-Data'!$E$9:$E$1048576,B111, 'Mobile-Data'!$G$9:$G$1048576,C111)/SUMIF('Mobile-Data'!$G$9:$G$1048576,C111, 'Mobile-Data'!$H$9:$H$1048576))","v":0},{"$f":"'Mobile-Detail Calcs'!$H$149","v":0},0,0,0,null,"Heavy-Duty Vehicle","CNG",{"$f":"'Mobile-Detail Calcs'!N216","v":0},{"$f":"'Mobile-Detail Calcs'!W216","v":0},0,null,0,0,0,0,0,0,0,0,0,0,0,0,0,0,0,0,0,0,0,0,0]
[null,"Passenger Car","LNG",{"$f":"IF(SUMIF('Mobile-Data'!$G$9:$G$1048576,C112, 'Mobile-Data'!$H$9:$H$1048576)=0,0,SUMIFS('Mobile-Data'!$H$9:$H$1048576, 'Mobile-Data'!$E$9:$E$1048576,B112, 'Mobile-Data'!$G$9:$G$1048576,C112)/SUMIF('Mobile-Data'!$G$9:$G$1048576,C112, 'Mobile-Data'!$H$9:$H$1048576))","v":0},{"$f":"'Mobile-Detail Calcs'!$I$149","v":0},0,0,0,null,"Passenger Car","LNG","-","-",0,null,0,0,0,0,0,0,0,0,0,0,0,0,0,0,0,0,0,0,0,0,0]
[null,"Light Truck (Vans, Pickup Trucks, SUVs)","LNG",{"$f":"IF(SUMIF('Mobile-Data'!$G$9:$G$1048576,C113, 'Mobile-Data'!$H$9:$H$1048576)=0,0,SUMIFS('Mobile-Data'!$H$9:$H$1048576, 'Mobile-Data'!$E$9:$E$1048576,B113, 'Mobile-Data'!$G$9:$G$1048576,C113)/SUMIF('Mobile-Data'!$G$9:$G$1048576,C113, 'Mobile-Data'!$H$9:$H$1048576))","v":0},{"$f":"'Mobile-Detail Calcs'!$I$149","v":0},0,0,0,null,"Light Truck (Vans, Pickup Trucks, SUVs)","LNG","-","-",0,null,0,0,0,0,0,0,0,0,0,0,0,0,0,0,0,0,0,0,0,0,0]
[null,"Heavy-Duty Vehicle","LNG",{"$f":"IF(SUMIF('Mobile-Data'!$G$9:$G$1048576,C114, 'Mobile-Data'!$H$9:$H$1048576)=0,0,SUMIFS('Mobile-Data'!$H$9:$H$1048576, 'Mobile-Data'!$E$9:$E$1048576,B114, 'Mobile-Data'!$G$9:$G$1048576,C114)/SUMIF('Mobile-Data'!$G$9:$G$1048576,C114, 'Mobile-Data'!$H$9:$H$1048576))","v":0},{"$f":"'Mobile-Detail Calcs'!$I$149","v":0},0,0,0,null,"Heavy-Duty Vehicle","LNG",{"$f":"'Mobile-Detail Calcs'!N217","v":0},{"$f":"'Mobile-Detail Calcs'!W217","v":0},0,null,0,0,0,0,0,0,0,0,0,0,0,0,0,0,0,0,0,0,0,0,0]
[null,"Passenger Car","LPG",{"$f":"IF(SUMIF('Mobile-Data'!$G$9:$G$1048576,C115, 'Mobile-Data'!$H$9:$H$1048576)=0,0,SUMIFS('Mobile-Data'!$H$9:$H$1048576, 'Mobile-Data'!$E$9:$E$1048576,B115, 'Mobile-Data'!$G$9:$G$1048576,C115)/SUMIF('Mobile-Data'!$G$9:$G$1048576,C115, 'Mobile-Data'!$H$9:$H$1048576))","v":0},{"$f":"'Mobile-Detail Calcs'!$J$149","v":0},0,0,0,null,"Passenger Car","LPG",{"$f":"'Mobile-Detail Calcs'!L218","v":0},{"$f":"'Mobile-Detail Calcs'!U218","v":0},0,null,0,0,0,0,0,0,0,0,0,0,0,0,0,0,0,0,0,0,0,0,0]
[null,"Light Truck (Vans, Pickup Trucks, SUVs)","LPG",{"$f":"IF(SUMIF('Mobile-Data'!$G$9:$G$1048576,C116, 'Mobile-Data'!$H$9:$H$1048576)=0,0,SUMIFS('Mobile-Data'!$H$9:$H$1048576, 'Mobile-Data'!$E$9:$E$1048576,B116, 'Mobile-Data'!$G$9:$G$1048576,C116)/SUMIF('Mobile-Data'!$G$9:$G$1048576,C116, 'Mobile-Data'!$H$9:$H$1048576))","v":0},{"$f":"'Mobile-Detail Calcs'!$J$149","v":0},0,0,0,null,"Light Truck (Vans, Pickup Trucks, SUVs)","LPG",{"$f":"'Mobile-Detail Calcs'!M218","v":0},{"$f":"'Mobile-Detail Calcs'!V218","v":0},0,null,0,0,0,0,0,0,0,0,0,0,0,0,0,0,0,0,0,0,0,0,0]
[null,"Heavy-Duty Vehicle","LPG",{"$f":"IF(SUMIF('Mobile-Data'!$G$9:$G$1048576,C117, 'Mobile-Data'!$H$9:$H$1048576)=0,0,SUMIFS('Mobile-Data'!$H$9:$H$1048576, 'Mobile-Data'!$E$9:$E$1048576,B117, 'Mobile-Data'!$G$9:$G$1048576,C117)/SUMIF('Mobile-Data'!$G$9:$G$1048576,C117, 'Mobile-Data'!$H$9:$H$1048576))","v":0},{"$f":"'Mobile-Detail Calcs'!$J$149","v":0},0,0,0,null,"Heavy-Duty Vehicle","LPG",{"$f":"'Mobile-Detail Calcs'!N218","v":0},{"$f":"'Mobile-Detail Calcs'!W218","v":0},0,null,0,0,0,0,0,0,0,0,0,0,0,0,0,0,0,0,0,0,0,0,0]
[]
[]
[null,"Vehicle Type","MT CO2e"]
[null,"Passenger Car",{"$f":"SUM(H94,H97,H100,H103,H106,H109,H112,H115)","v":35276.703924207897}]
[null,"Light Truck (Vans, Pickup Trucks, SUVs)",{"$f":"SUM(H95,H98,H101,H104,H107,H110,H113,H116)","v":76273.189139415961}]
[null,"Heavy-Duty Vehicle",{"$f":"SUM(H96,H99,H102,H105,H108,H111,H114,H117)","v":29566.425672246587}]
[]
[null,"Off-Road CO2 emissions",null,"% fuel use","Fuel Type Emissions","CO2",null,null,"Off-Road Inventory Year Emissions:"]
[null,"(all)","Residual Fuel",null,null,{"$f":"'Mobile-Detail Calcs'!K149","v":0},null,null,{"$f":"IF(F132+C157>0,F132+C157,0)","v":3995.2336204650001},"MT CO2e"]
[null,"(all)","Jet Fuel",null,null,{"$f":"'Mobile-Detail Calcs'!L149","v":0}]
[null,"(all)","Aviation Gasoline",null,null,{"$f":"'Mobile-Detail Calcs'!M149","v":0},null,null,"Therefore, On-Road Inventory Year Emissions ="]
[null,"Ship or Boat","Gasoline",{"$f":"SUMIFS('Mobile-Data'!$H$9:$H$1048576, 'Mobile-Data'!$E$9:$E$1048576,B129, 'Mobile-Data'!$G$9:$G$1048576,C129)/SUMIF('Mobile-Data'!$G$9:$G$1048576,C129, 'Mobile-Data'!$H$9:$H$1048576)","v":1.8294204958608326E-2},{"$f":"'Mobile-Detail Calcs'!$C$149","v":101689.24881999999},{"$f":"D129*E129","v":1860.3239599999997},null,null,{"$f":"'Mobile-Summary'!F27-mob_nonHwy_emissionsIY","v":173915.62396587041},"MT CO2e"]
[null,"Ship or Boat","Diesel",{"$f":"IFERROR(SUMIFS('Mobile-Data'!$H$9:$H$1048576, 'Mobile-Data'!$E$9:$E$1048576,B130, 'Mobile-Data'!$G$9:$G$1048576,C130)/SUMIF('Mobile-Data'!$G$9:$G$1048576,C130, 'Mobile-Data'!$H$9:$H$1048576),0)","v":1.7778889075950037E-2},{"$f":"'Mobile-Detail Calcs'!$D$149","v":71743.801570000011},{"$f":"D130*E130","v":1275.5250900000003}]
[null,"Locomotive","Diesel",{"$f":"IFERROR(SUMIFS('Mobile-Data'!$H$9:$H$1048576, 'Mobile-Data'!$E$9:$E$1048576,B131, 'Mobile-Data'!$G$9:$G$1048576,C131)/SUMIF('Mobile-Data'!$G$9:$G$1048576,C131, 'Mobile-Data'!$H$9:$H$1048576),0)","v":0},{"$f":"'Mobile-Detail Calcs'!$D$149","v":71743.801570000011},{"$f":"D131*E131","v":0}]
[null,"Non-Highway CO2 Emissions",null,null,null,{"$f":"SUM(F126:F131)","v":3135.8490499999998}]
[]
[null,"Off-Road Non-CO2 Emissions"]
[null,"Non-Highway Non-CO2 Emissions"]
[null,null,"Non-CO2"]
[null,{"$f":"'Background Controls'!I5","v":"Residential"},0]
[null,{"$f":"'Background Controls'!I6","v":"Commercial/Institutional"},859.38457046500002]
[null,{"$f":"'Background Controls'!I7","v":"Industrial"},0]
[null,{"$f":"'Background Controls'!I8","v":"Energy Generation"},0]
[null,{"$f":"'Background Controls'!I9","v":0},0]
[null,{"$f":"'Background Controls'!I10","v":0},0]
[null,{"$f":"'Background Controls'!I11","v":0},0]
[null,{"$f":"'Background Controls'!I12","v":0},0]
[null,{"$f":"'Background Controls'!I13","v":0},0]
[null,{"$f":"'Background Controls'!I14","v":0},0]
[null,{"$f":"'Background Controls'!I15","v":0},0]
[null,{"$f":"'Background Controls'!I16","v":0},0]
[null,{"$f":"'Background Controls'!I17","v":0},0]
[null,{"$f":"'Background Controls'!I18","v":0},0]
[null,{"$f":"'Background Controls'!I19","v":0},0]
[null,{"$f":"'Background Controls'!I20","v":0},0]
[null,{"$f":"'Background Controls'!I21","v":0},0]
[null,{"$f":"'Background Controls'!I22","v":0},0]
[null,{"$f":"'Background Controls'!I23","v":0},0]
[null,{"$f":"'Background Controls'!I24","v":0},0]
[null,"Total",{"$f":"SUM(mob_nonCO2_nonhwy)","v":859.38457046500002}]

{"sheet":"Notes","index":37,"n_rows":1,"n_cols":1,"rows_kept":1,"cut":false,"hidden":false,"merged":[]}
["Notes"]