{"text_format":"1","workbook":"xlsx","n_sheets":38,"sheets":["Introduction","Read Me","TOC","Definitions","Control Sheet","CompletionTracker","Stationary-Entry","StatTemplateReadMe","Stationary-Data","Stationary-Calcs","ElecTemplateReadMe","Mobile-Entry","MobTemplateReadMe","Mobile-Data","Mobile-Detail Calcs","Mobile-Summary","Solid Waste-Control","Solid Waste-Entry","Wastewater-Control","Wastewater-Entry","Wastewater- Calcs","Electricity-Entry","Electricity-Data","Electricity LocationBased-Calcs","Employee Commute","Electricity MarketBased-Calcs","Water","Agriculture & Land Management","Urban Forestry","Waste Production","Additional Emission Sources","Summary-Emissions","Factors","Background Controls","Help","Commercial End Use Study","Detail Type Data","Notes"],"not_rendered":{"charts":27,"images":34,"macros":1,"external_links":0,"defined_names":341,"comments":1,"pivot_tables":0},"unopened":[],"bounds":{"document_bytes":16777216,"sheet_cells":100000,"rows_first":2000,"rows_last":500,"rows_between":2000,"halvings":0,"cell_chars":16384,"cell_head_chars":4096},"cells_cut":0,"cells_raw":0,"read":"whole","date_system":"1900"}

{"sheet":"Introduction","index":0,"n_rows":36,"n_cols":1,"rows_kept":36,"cut":false,"hidden":false,"merged":[[35,0,35,12]]}
["Introduction"]
[]
[]
[]
[]
[]
{"$rows_left_out":31}
{"sheet":"Read Me","index":1,"n_rows":69,"n_cols":1,"rows_kept":69,"cut":false,"hidden":false,"merged":[[68,0,68,19]]}
["Read Me"]
[]
[]
[]
[]
[]
{"$rows_left_out":64}
{"sheet":"TOC","index":2,"n_rows":42,"n_cols":1,"rows_kept":42,"cut":false,"hidden":false,"merged":[[41,0,41,21]]}
["Table of Contents"]
[]
[]
[]
[]
[]
{"$rows_left_out":37}
{"sheet":"Definitions","index":3,"n_rows":52,"n_cols":3,"rows_kept":52,"cut":false,"hidden":false,"merged":[[51,0,51,8]]}
["Definitions"]
[]
[null,"Please refer to this list for an explanation of any terms you may find within this tool."]
[]
[null,"Term","Definition"]
[null,"Base Year","A measurement, calculation, or time used as a basis for comparison. According to LGOP, it is good practice to aim for a base year that is likely to be representative of the general level of emissions over the surrounding period."]
{"$rows_left_out":47}
{"sheet":"Control Sheet","index":4,"n_rows":92,"n_cols":8,"rows_kept":92,"cut":false,"hidden":false,"merged":[[41,4,41,6],[39,1,39,12],[91,0,91,13],[43,1,43,2],[37,0,37,7],[38,1,38,7]]}
["Inventory Control Sheet"]
["Complete the 4 steps below to set up the tool for your community."]
["1) Please enter the name of your city, the inventory year, and population below."]
[]
[null,"City",null,"Commonwealth of the Northern Mariana Islands"]
[null,"Year",null,2022]
{"$rows_left_out":87}
{"sheet":"CompletionTracker","index":5,"n_rows":24,"n_cols":2,"rows_kept":24,"cut":false,"hidden":true,"merged":[]}
["CompletionTracker"]
[]
[]
["Control Sheet",false]
["Stationary-Entry",false]
["Stationary-Data",false]
{"$rows_left_out":19}
{"sheet":"Stationary-Entry","index":6,"n_rows":25,"n_cols":6,"rows_kept":25,"cut":false,"hidden":false,"merged":[[24,0,24,5]]}
["Stationary Units - Entry"]
["Data Entry & Calculations"]
[]
[]
[]
[]
{"$rows_left_out":20}
{"sheet":"StatTemplateReadMe","index":7,"n_rows":49,"n_cols":4,"rows_kept":49,"cut":false,"hidden":true,"merged":[[25,1,25,2],[0,1,0,2],[1,1,1,2],[2,1,2,2],[3,1,3,2],[23,1,23,2],[24,1,24,2],[4,1,4,2],[5,1,5,2],[6,1,6,2],[7,1,7,2],[8,1,8,2],[9,1,9,2]]}
["Stationary Data Template Instructions","This sheet describes the file layout and data parameters needed for batch import."]
[null,"This will allow you to bypass the data entry form and upload multiple lines of data."]
[null,"Please enter your activity data on the following worksheet (DataSheet) according to the parameters below."]
[null,"Copy and paste the data from that sheet onto the \"Stationary-Data\" worksheet in the inventory tool."]
["ID#","This value is automatically supplied when adding data via the input form. You will need to update this manually when using the batch import feature. Please assign a unique value to each line of data you add."]
[null,"Values must be integers in ascending order. Gaps between numbers are permitted. For example, three lines with IDs in order of 11, 12, and 15 are ok; IDs of 11, 15, and 12 is not. The calculations will not be accurate if the ID numbers do not meet this condition."]
{"$rows_left_out":44}
{"sheet":"Stationary-Data","index":8,"n_rows":15,"n_cols":7,"rows_kept":15,"cut":false,"hidden":false,"merged":[]}
["Stationary Units - Data"]
[]
[]
[]
["Linker Row"]
["ID#","Unit Description","Sector","Fuel Type","Amount of Fuel Used","Unit","Facility Type"]
{"$rows_left_out":10}
{"sheet":"Stationary-Calcs","index":9,"n_rows":301,"n_cols":27,"rows_kept":301,"cut":false,"hidden":false,"merged":[[300,0,300,21],[20,1,20,5],[72,1,72,5],[72,8,72,11],[90,8,90,10],[20,8,20,12]]}
["Stationary Units - Calculation & Summary "]
["Jump to…"]
["Sector Summary"]
["Emissions by Sector"]
["Fuel and Energy Use by Sector"]
["Fuel Summary"]
{"$rows_left_out":296}
{"sheet":"ElecTemplateReadMe","index":10,"n_rows":49,"n_cols":4,"rows_kept":49,"cut":false,"hidden":true,"merged":[[5,1,5,2],[0,1,0,2],[1,1,1,2],[2,1,2,2],[3,1,3,2],[4,1,4,2],[33,1,33,2],[8,1,8,2],[6,1,6,2],[7,1,7,2],[31,1,31,2],[32,1,32,2]]}
["Electricity Data Template Instructions","This sheet describes the file layout and data parameters needed for batch import."]
[null,"This will allow you to bypass the data entry form and upload multiple lines of data."]
[null,"Please enter your activity data on the following worksheet (DataSheet) according to the parameters below."]
[null,"Copy and paste the data from that sheet onto the \"Electricity-Data\" worksheet in the inventory tool."]
["ID#","This value is automatically supplied when adding data via the input form. You will need to update this manually when using the batch import feature. Please assign a unique value to each line of data you add."]
[null,"Values must be integers in ascending order. Gaps between numbers are permitted. For example, three lines with IDs in order of 11, 12, and 15 are ok; IDs of 11, 15, and 12 is not. The calculations will not be accurate if the ID numbers do not meet this condition."]
{"$rows_left_out":44}
{"sheet":"Mobile-Entry","index":11,"n_rows":42,"n_cols":8,"rows_kept":42,"cut":false,"hidden":false,"merged":[[27,3,28,6],[29,4,29,5],[29,3,30,3],[41,0,41,6],[33,1,34,2]]}
["Mobile Units - Entry"]
["Data Entry & Calculations"]
[]
[]
[]
[]
{"$rows_left_out":37}
{"sheet":"MobTemplateReadMe","index":12,"n_rows":66,"n_cols":3,"rows_kept":66,"cut":false,"hidden":true,"merged":[[5,1,5,2],[9,1,9,2],[10,1,10,2],[24,1,24,2],[26,1,26,2],[0,1,0,2],[1,1,1,2],[2,1,2,2],[3,1,3,2],[4,1,4,2],[65,1,65,2],[6,1,6,2],[7,1,7,2],[8,1,8,2],[25,1,25,2],[64,1,64,2]]}
["Mobile Data Template Instructions","This sheet describes the file layout and data parameters needed for batch import."]
[null,"This will allow you to bypass the data entry form and upload multiple lines of data."]
[null,"Please enter your activity data on the following worksheet (DataSheet) according to the parameters below."]
[null,"Copy and paste the data from that sheet onto the \"Mobile-Data\" worksheet in the inventory tool."]
["ID#","This value is automatically supplied when adding data via the input form. You will need to update this manually when using the batch import feature. Please assign a unique value to each line of data you add."]
[null,"Values must be integers in ascending order. Gaps between numbers are permitted. For example, three lines with IDs in order of 11, 12, and 15 are ok; IDs of 11, 15, and 12 is not. The calculations will not be accurate if the ID numbers do not meet this condition."]
{"$rows_left_out":61}
{"sheet":"Mobile-Data","index":13,"n_rows":30,"n_cols":9,"rows_kept":30,"cut":false,"hidden":false,"merged":[]}
["Mobile Units - Data"]
[]
[]
[]
["Linker Row- DO NOT MODIFY"]
["ID#","Vehicle or vehicle group description","Sector","Vehicle Year","Vehicle Type","Vehicle Model (optional)","Fuel type","Fuel consumption","VMT"]
{"$rows_left_out":25}
{"sheet":"Mobile-Detail Calcs","index":14,"n_rows":275,"n_cols":27,"rows_kept":275,"cut":false,"hidden":false,"merged":[[161,2,161,4],[274,0,274,15]]}
["Mobile Combustion - Calculation"]
["Jump to…"]
["Activity Data"]
["Fuel use by sector and fuel type"]
["Energy use by sector and fuel type"]
["CO2 Calculations"]
{"$rows_left_out":270}
{"sheet":"Mobile-Summary","index":15,"n_rows":81,"n_cols":19,"rows_kept":81,"cut":false,"hidden":false,"merged":[[4,1,4,5],[4,8,4,10],[31,1,31,13],[80,0,80,15]]}
["Mobile Combustion - Summary"]
[]
["GHG Summary"]
[]
[null,"Net Emissions by Sector (CO2e)",null,null,null,null,null,null,"CO2 Detail Emissions"]
[null,null,"CO2","CH4","N2O","TOTAL",null,null,"Gross CO2","- Biogenic =","Net CO2"]
{"$rows_left_out":76}
{"sheet":"Solid Waste-Control","index":16,"n_rows":42,"n_cols":14,"rows_kept":42,"cut":false,"hidden":false,"merged":[[14,2,14,5],[16,2,16,10],[41,0,41,11]]}
["Solid Waste - Control"]
[]
[]
[]
[]
[]
{"$rows_left_out":37}
{"sheet":"Solid Waste-Entry","index":17,"n_rows":107,"n_cols":17,"rows_kept":107,"cut":false,"hidden":false,"merged":[[74,1,74,2],[106,0,106,13]]}
["Solid Waste - Entry, Calculation & Summary"]
[]
[]
[]
[]
[]
{"$rows_left_out":102}
{"sheet":"Wastewater-Control","index":18,"n_rows":64,"n_cols":19,"rows_kept":64,"cut":false,"hidden":false,"merged":[[9,16,9,18],[63,0,63,14]]}
["Wastewater - Control"]
[]
[]
[null,"Please answer the following questions about your community's wastewater treatment system."]
[null,"Emissions resulting from wastewater treated within the community's boundaries are Scope 1."]
[null,"1) It is assumed that wastewater services belong to the commercial/institutional sector as they are either municipally or privately owned."]
{"$rows_left_out":59}
{"sheet":"Wastewater-Entry","index":19,"n_rows":48,"n_cols":3,"rows_kept":48,"cut":false,"hidden":false,"merged":[[47,0,47,10]]}
["Wastewater - Entry"]
[]
[]
[]
[]
[]
{"$rows_left_out":43}
{"sheet":"Wastewater- Calcs","index":20,"n_rows":90,"n_cols":14,"rows_kept":90,"cut":false,"hidden":false,"merged":[[11,1,11,3],[13,1,13,2],[14,1,14,2],[15,1,15,2],[16,1,16,2],[89,0,89,14],[20,1,20,10],[25,1,25,11],[30,1,30,9],[35,1,35,11],[40,1,40,9],[73,1,73,7],[45,1,45,7],[50,1,50,7],[55,1,55,8],[60,1,60,13],[62,1,62,13],[64,1,64,13],[66,1,66,13],[68,1,68,13],[70,1,70,13]]}
["Wastewater - Calculation & Sumary"]
[]
[]
[]
[]
[]
{"$rows_left_out":85}
{"sheet":"Electricity-Entry","index":21,"n_rows":24,"n_cols":8,"rows_kept":24,"cut":false,"hidden":false,"merged":[[23,0,23,7]]}
["Electricity Use - Entry"]
["Data Entry & Calculations"]
[]
[]
[]
[]
{"$rows_left_out":19}
{"sheet":"Electricity-Data","index":22,"n_rows":8,"n_cols":11,"rows_kept":8,"cut":false,"hidden":false,"merged":[]}
["Electricity Use - Data"]
[]
[]
[]
["Linker Row"]
["ID#","Unit Description","Sector","Utility","Electricity Consumed (kWh)","Facility Type","Contractual Instrument Description","Supplier-Specific CO2 Emissions Rate","Supplier-Specific CH4 Emissions Rate","Supplier-Specific N2O Emissions Rate","contract?"]
{"$rows_left_out":3}
{"sheet":"Electricity LocationBased-Calcs","index":23,"n_rows":240,"n_cols":9,"rows_kept":240,"cut":false,"hidden":false,"merged":[[17,1,17,5],[61,1,61,2],[239,0,239,12]]}
["Electricity Use - Calculation & Summary "]
["Jump to…"]
["GHG Summary"]
["Emissions by Sector"]
["Electricity Summary"]
["Electricity Use by Sector"]
{"$rows_left_out":235}
{"sheet":"Employee Commute","index":24,"n_rows":188,"n_cols":11,"rows_kept":188,"cut":false,"hidden":true,"merged":[[187,0,187,13],[52,4,52,12],[60,1,60,2],[37,0,38,12],[54,0,55,12],[133,0,133,13],[50,0,50,13]]}
["Employee Commute"]
["Jump to…"]
["Step 1. Enter employee data by department"]
["Step 2. Enter mode of transportation proportions"]
["Employee Commute Emissions Summary"]
["Chart: Employee Commute Emissions"]
{"$rows_left_out":183}
{"sheet":"Electricity MarketBased-Calcs","index":25,"n_rows":342,"n_cols":9,"rows_kept":342,"cut":false,"hidden":false,"merged":[[17,1,17,5],[61,1,61,4],[341,0,341,12]]}
["Market-based Electricity Use - Calculation & Summary "]
["Jump to…"]
["GHG Summary"]
["Emissions by Sector"]
["Electricity Summary"]
["Electricity Use by Sector"]
{"$rows_left_out":337}
{"sheet":"Water","index":26,"n_rows":243,"n_cols":18,"rows_kept":243,"cut":false,"hidden":false,"merged":[[242,0,242,11],[50,1,50,5],[129,1,129,3],[155,1,155,3],[182,1,182,3],[209,1,209,3]]}
["Water"]
["Data Entry and Calculations"]
[]
[]
[]
[]
{"$rows_left_out":238}
{"sheet":"Agriculture & Land Management","index":27,"n_rows":69,"n_cols":6,"rows_kept":69,"cut":false,"hidden":false,"merged":[[68,0,68,21],[33,1,33,5]]}
["Agriculture & Land Management"]
["Data Entry & Calculations"]
[]
[]
[]
[]
{"$rows_left_out":64}
{"sheet":"Urban Forestry","index":28,"n_rows":69,"n_cols":4,"rows_kept":69,"cut":false,"hidden":false,"merged":[[68,0,68,21],[34,1,34,3]]}
["Urban Forestry"]
[]
[]
[]
[]
[]
{"$rows_left_out":64}
{"sheet":"Waste Production","index":29,"n_rows":41,"n_cols":4,"rows_kept":41,"cut":false,"hidden":false,"merged":[[8,1,8,3],[40,0,40,13]]}
["Waste Production"]
[]
[]
[null,"To calculate Scope 3 emissions from waste, please visit  EPA's WAste Reduction Model (WARM). WARM is available both as a web-based calculator and in an Excel spreadsheet."]
[null,"https://www.epa.gov/warm"]
[]
{"$rows_left_out":36}
{"sheet":"Additional Emission Sources","index":30,"n_rows":29,"n_cols":17,"rows_kept":29,"cut":false,"hidden":false,"merged":[[13,4,13,10],[28,0,28,14]]}
["Additional Emission Sources"]
[]
[]
[]
[]
[]
{"$rows_left_out":24}
{"sheet":"Summary-Emissions","index":31,"n_rows":149,"n_cols":31,"rows_kept":149,"cut":false,"hidden":false,"merged":[[114,0,114,20],[88,1,88,12],[2,1,2,9],[2,22,2,30],[10,22,10,30],[11,1,11,9],[41,1,41,3]]}
["Inventory Emissions Summary"]
[null,null,null,null,null,{"$f":"IF(SUM('Additional Emission Sources'!H16:H25)>0, \"Show\", \"Hide\")","v":"Hide"},{"$f":"IF(SUM('Additional Emission Sources'!I16:I25)>0, \"Show\", \"Hide\")","v":"Hide"},{"$f":"IF(SUM('Additional Emission Sources'!J16:J25)>0, \"Show\", \"Hide\")","v":"Hide"},null,null,null,"Scope 2 Emissions Selection:","Location Based"]
[null,{"$f":" \"Total \" &MyCity &\" Emissions  (MT CO2e)\"","v":"Total Commonwealth of the Northern Mariana Islands Emissions  (MT CO2e)"},null,null,null,null,null,null,null,null,null,null,{"$f":"IF(ISERROR(I25/MyPopulation),0,I25/MyPopulation)","v":9.3635355266475209},{"$f":"\"Per capita Emissions for \"&MyCity &\"  (MT CO2e/person) \"","v":"Per capita Emissions for Commonwealth of the Northern Mariana Islands  (MT CO2e/person) "},null,null,null,null,null,null,null,null,{"$f":" \"Total \" &MyCity &\" Emissions  (MT CO2e)\"","v":"Total Commonwealth of the Northern Mariana Islands Emissions  (MT CO2e)"}]
[null,null,"CO2","CH4","N2O","HFCs","PFCs","SF6","Total MT CO2e","Percent of Total",null,null,null,null,null,null,null,null,null,null,null,null,null,"CO2","CH4","N2O","HFCs","PFCs","SF6","Total MT CO2e","Percent of Total"]
[null,"Scope 1",{"$f":"SUMIF($A$14:$A$24, RIGHT($B5, 1), C$14:C$24)+SUMIF('Additional Emission Sources'!$D$16:$D$25,  RIGHT($B5,1), 'Additional Emission Sources'!E$16:E$25)","v":397273.13640879397},{"$f":"SUMIF($A$14:$A$24, RIGHT($B5, 1), D$14:D$24)+SUMIF('Additional Emission Sources'!$D$16:$D$25,  RIGHT($B5,1), 'Additional Emission Sources'!F$16:F$25)","v":6568.1347987671061},{"$f":"SUMIF($A$14:$A$24, RIGHT($B5, 1), E$14:E$24)+SUMIF('Additional Emission Sources'!$D$16:$D$25,  RIGHT($B5,1), 'Additional Emission Sources'!G$16:G$25)","v":4448.386282389466},{"$f":"SUMIF('Additional Emission Sources'!$D$16:$D$25,  RIGHT($B5,1), 'Additional Emission Sources'!H$16:H$25)","v":0},{"$f":"SUMIF('Additional Emission Sources'!$D$16:$D$25,  RIGHT($B5,1), 'Additional Emission Sources'!I$16:I$25)","v":0},{"$f":"SUMIF('Additional Emission Sources'!$D$16:$D$25,  RIGHT($B5,1), 'Additional Emission Sources'!J$16:J$25)","v":0},{"$f":"SUM(C5:H5)","v":408289.65748995054},{"$f":"IF($I$9=0,0,I5/$I$9)","v":0.92130024726511517},null,null,null,null,null,null,null,null,null,null,null,null,"Scope 1",{"$f":"C5","v":397273.13640879397},{"$f":"D5","v":6568.1347987671061},4448.386282389466,0,0,0,408289.65748995054,0.92130024726511517]
[null,"Scope 2 - Location Based",{"$f":"SUMIF($A$14:$A$24, RIGHT(LEFT($B6, 11),5), C$14:C$24)+SUMIF('Additional Emission Sources'!$D$16:$D$25,  RIGHT(LEFT($B6, 7),1), 'Additional Emission Sources'!E$16:E$25)","v":0},{"$f":"SUMIF($A$14:$A$24, RIGHT(LEFT($B6, 11),5), D$14:D$24)+SUMIF('Additional Emission Sources'!$D$16:$D$25,  RIGHT(LEFT($B6, 7),1), 'Additional Emission Sources'!F$16:F$25)","v":0},{"$f":"SUMIF($A$14:$A$24, RIGHT(LEFT($B6, 11),5), E$14:E$24)+SUMIF('Additional Emission Sources'!$D$16:$D$25,  RIGHT(LEFT($B6, 7),1), 'Additional Emission Sources'!G$16:G$25)","v":0},{"$f":"SUMIF('Additional Emission Sources'!$D$16:$D$25,  RIGHT($B6,1), 'Additional Emission Sources'!H$16:H$25)","v":0},{"$f":"SUMIF('Additional Emission Sources'!$D$16:$D$25,  RIGHT($B6,1), 'Additional Emission Sources'!I$16:I$25)","v":0},{"$f":"SUMIF('Additional Emission Sources'!$D$16:$D$25,  RIGHT($B6,1), 'Additional Emission Sources'!J$16:J$25)","v":0},0,{"$f":"IF(OR($I$9=0,$M$2=\"Market Based\"),\"\",I6/$I$9)","v":0},null,null,null,null,null,null,null,null,null,null,null,null,"Scope 2 - Location Based",{"$f":"IF($M$2=\"Market Based\",C7,C6)","v":0},{"$f":"IF($M$2=\"Market Based\",D7,D6)","v":0},0,0,0,0,0,0]
{"$rows_left_out":144}
{"sheet":"Factors","index":32,"n_rows":364,"n_cols":37,"rows_kept":364,"cut":false,"hidden":false,"merged":[[28,9,28,11],[29,9,29,11],[52,6,52,7],[53,6,53,7],[54,6,54,7],[18,3,20,5],[347,0,347,15],[48,6,48,7],[306,0,306,13],[178,0,178,15],[331,0,331,1],[49,6,49,7],[50,6,50,7],[51,6,51,7],[317,6,317,8],[318,6,318,8],[319,6,319,8],[320,6,320,8],[321,6,321,8],[322,6,322,8],[55,6,55,7]]}
["Factors"]
[]
["Unit Conversion Factors"]
[null,null,"Multiply by"]
[null,"kWh to MWh",{"$f":"1/1000","v":1E-3},null,null,null,"Legend:"]
[null,"lbs to metric tons",4.5359236999999999E-4,null,null,null,"Hard-wired factor"]
{"$rows_left_out":359}
{"sheet":"Background Controls","index":33,"n_rows":78,"n_cols":21,"rows_kept":78,"cut":false,"hidden":false,"merged":[]}
["Background Controls"]
[null,null,null,null,null,null,null,null,"Lists"]
[null,null,null,null,null,null,null,null,4]
["Tool Name","Community Greenhouse Gas Inventory Tool",null,null,null,null,null,null,"Sector","Landfills",null,null,null,"Stationary Fuels","Facility Types","Water Importers","Comprehensive/Partial","Yes/No","Scope",null,"Emission Factors Choice"]
[null,null,null,null,null,null,null,null,{"$f":"'Control Sheet'!D16","v":"Residential"},{"$f":"'Solid Waste-Control'!C28","v":"Saipan"},null,null,null,"Natural Gas","Residential: Single Family Units","SWP west branch","Comprehensive","Yes",1,null,true]
[null,null,null,null,null,null,null,null,{"$f":"'Control Sheet'!D17","v":"Commercial/Institutional"},{"$f":"'Solid Waste-Control'!C29","v":"Tinian"},null,null,null,"Digester Gas","Residential: Apartment Buildings","SWP east branch","Partial","No",2,null,true]
{"$rows_left_out":73}
{"sheet":"Help","index":34,"n_rows":1,"n_cols":1,"rows_kept":1,"cut":false,"hidden":true,"merged":[]}
["Help"]

{"sheet":"Commercial End Use Study","index":35,"n_rows":176,"n_cols":12,"rows_kept":176,"cut":false,"hidden":true,"merged":[[136,1,136,9]]}
[]
["M1"]
["RPS",0.33,"RE by 2030"]
["Lighting EE",0.25,"reduction in lighting by 2018 (indoor and outdoor)"]
["Title 24",7.0000000000000007E-2,"increase in standards every 3 years (2008, 2011, 2014, 2017, 2020)"]
["M2"]
{"$rows_left_out":171}
{"sheet":"Detail Type Data","index":36,"n_rows":157,"n_cols":36,"rows_kept":157,"cut":false,"hidden":true,"merged":[[91,3,91,5],[92,9,92,12]]}
[]
[null,"Stationary Fuel Combustion Energy Use (MMBtu)"]
[null,null,"Natural Gas","Diesel","Gasoline","LPG","Propane","Butane","Residual Fuel Oil No. 5","Residual Fuel Oil No. 6","Jet Fuel","Bituminous Coal","Digester Gas","Total"]
[null,null,{"$f":"VLOOKUP(C3, stat_factors, 5, FALSE)","v":1.0369999999999999},0.1380952380952381,0.12023809523809523,9.1999999999999998E-2,9.0999999999999998E-2,0.10299999999999999,0.14000000000000001,0.15,0.13500000000000001,{"$error":"#N/A"},0.65500000000000003]
[null,{"$f":"'Background Controls'!O5","v":"Residential: Single Family Units"},{"$f":"SUMIFS(stat_data_consump, stat_data_bldgtype, $B5, stat_data_FuelType, C$3)*C$4","v":0},0,0,0,0,0,0,0,0,{"$error":"#N/A"},0,{"$f":"SUM(C5:M5)","v":{"$error":"#N/A"}}]
[null,{"$f":"'Background Controls'!O6","v":"Residential: Apartment Buildings"},0,0,0,0,0,0,0,0,0,{"$error":"#N/A"},0,{"$f":"SUM(C6:M6)","v":{"$error":"#N/A"}}]
{"$rows_left_out":152}
{"sheet":"Notes","index":37,"n_rows":1,"n_cols":1,"rows_kept":1,"cut":false,"hidden":false,"merged":[]}
["Notes"]